Build #300

Build: #300 failed Scheduled with changes by albertshau <ashau@google.com>

Test results

  • 900 tests in total
  • 2 tests failed
  • 2 failures are new
  • 5 tests were fixed
  • 3735 minutes taken in total.
New test failures 2
Status Test View job Duration
Collapse Failed TPFSParquetSinkSourceTest testSpark History
Distro Tests - CDH 5.14 4 mins
java.util.concurrent.ExecutionException: java.lang.RuntimeException: java.io.IOException: 500: Connection refused (Connection refused)
	at io.cdap.cdap.client.util.RESTClient.execute(RESTClient.java:132)
	at io.cdap.cdap.client.util.RESTClient.execute(RESTClient.java:74)
	at io.cdap.cdap.client.ProgramClient.getProgramRuns(ProgramClient.java:502)
	at io.cdap.cdap.test.remote.RemoteApplicationManager.getHistory(RemoteApplicationManager.java:160)
	at io.cdap.cdap.test.AbstractProgramManager.getHistory(AbstractProgramManager.java:150)
	at io.cdap.cdap.test.AbstractProgramManager.lambda$waitForRuns$0(AbstractProgramManager.java:96)
	at io.cdap.cdap.common.utils.Tasks.waitFor(Tasks.java:58)
(6 more lines...)
Collapse Failed WorkflowTest test History
Distro Tests - CDH 5.12 1 min
java.util.concurrent.ExecutionException: java.lang.RuntimeException: java.io.IOException: 500: Connection refused (Connection refused)
	at io.cdap.cdap.client.util.RESTClient.execute(RESTClient.java:132)
	at io.cdap.cdap.client.util.RESTClient.execute(RESTClient.java:74)
	at io.cdap.cdap.client.ProgramClient.getProgramRuns(ProgramClient.java:502)
	at io.cdap.cdap.test.remote.RemoteApplicationManager.getHistory(RemoteApplicationManager.java:160)
	at io.cdap.cdap.test.AbstractProgramManager.getHistory(AbstractProgramManager.java:150)
	at io.cdap.cdap.test.AbstractProgramManager.lambda$waitForRuns$0(AbstractProgramManager.java:96)
	at io.cdap.cdap.common.utils.Tasks.waitFor(Tasks.java:58)
(5 more lines...)
Fixed tests 5
Status Test Failing since View job Duration
Successful XMLReaderTest testInvalidNodePathWithMoveAction History
Failing since build #299 (Scheduled with changes by albertshau <ashau@google.com> and Vlad Hlinskiy <vglinskiy@cybervisiontech.com>) Distro Tests - HDP 2.3 4 mins
Successful XMLReaderTest testPatternWithDeleteAction History
Failing since build #299 (Scheduled with changes by albertshau <ashau@google.com> and Vlad Hlinskiy <vglinskiy@cybervisiontech.com>) Distro Tests - HDP 2.3 4 mins
Successful XMLReaderTest testPreProcessingRequired History
Failing since build #299 (Scheduled with changes by albertshau <ashau@google.com> and Vlad Hlinskiy <vglinskiy@cybervisiontech.com>) Distro Tests - HDP 2.3 4 mins
Successful XMLReaderTest testInvalidPatternWithDeleteAction History
Failing since build #299 (Scheduled with changes by albertshau <ashau@google.com> and Vlad Hlinskiy <vglinskiy@cybervisiontech.com>) Distro Tests - HDP 2.3 3 mins