Build #299

Build result summary

Details

Completed
Duration
694 minutes
Labels
None
Revision
594f487f26b0424af376a87687edda32de49eba2 594f487f26b0424af376a87687edda32de49eba2
Total tests
900

Responsible

No one has taken responsibility for this failure

Code commits

Author Commit Message Commit date
albertshau <ashau@google.com> albertshau <ashau@google.com> 594f487f26b0424af376a87687edda32de49eba2 594f487f26b0424af376a87687edda32de49eba2 Merge pull request #1014 from vladhlinskiy/feature/CDAP-15641-spanner-integration-tests
CDAP-15641 Spanner integration tests
Vlad Hlinskiy <vglinskiy@cybervisiontech.com> Vlad Hlinskiy <vglinskiy@cybervisiontech.com> fa1a14c3799b50d72804c8116fccf712b38c50b0 fa1a14c3799b50d72804c8116fccf712b38c50b0 CDAP-15641 Spanner integration tests created
albertshau <ashau@google.com> albertshau <ashau@google.com> a0220e91873d5dd80f9982c779e53e971270c3fc a0220e91873d5dd80f9982c779e53e971270c3fc Merge pull request #1013 from vladhlinskiy/fetaure/CDAP-15640-GCS-integration-tests-coverage
CDAP-15640 GCS integration tests coverage
Vlad Hlinskiy <vglinskiy@cybervisiontech.com> Vlad Hlinskiy <vglinskiy@cybervisiontech.com> ccce58e8b4de9183e4f2d5d59f88eddc373f6cdd ccce58e8b4de9183e4f2d5d59f88eddc373f6cdd CDAP-15640 GCS integration tests coverage

Tests

New test failures 5
Status Test View job Duration
Collapse Failed XMLReaderTest testInvalidNodePathWithMoveAction History
Distro Tests - HDP 2.3 2 mins
java.util.concurrent.TimeoutException: Timeout occurred. Expected STOPPED but found STARTING.
	at io.cdap.cdap.common.utils.Tasks.waitFor(Tasks.java:70)
	at io.cdap.cdap.common.utils.Tasks.waitFor(Tasks.java:91)
	at io.cdap.cdap.client.ProgramClient.waitForStatus(ProgramClient.java:323)
	at io.cdap.cdap.client.ProgramClient.stopAll(ProgramClient.java:254)
	at io.cdap.cdap.test.IntegrationTestBase.doClear(IntegrationTestBase.java:390)
	at io.cdap.cdap.test.IntegrationTestBase.setUp(IntegrationTestBase.java:107)
	at sun.reflect.GeneratedMethodAccessor2.invoke(Unknown Source)
(41 more lines...)
Collapse Failed XMLReaderTest testPatternWithDeleteAction History
Distro Tests - HDP 2.3 2 mins
java.util.concurrent.TimeoutException: Timeout occurred. Expected STOPPED but found STARTING.
	at io.cdap.cdap.common.utils.Tasks.waitFor(Tasks.java:70)
	at io.cdap.cdap.common.utils.Tasks.waitFor(Tasks.java:91)
	at io.cdap.cdap.client.ProgramClient.waitForStatus(ProgramClient.java:323)
	at io.cdap.cdap.client.ProgramClient.stopAll(ProgramClient.java:254)
	at io.cdap.cdap.test.IntegrationTestBase.doClear(IntegrationTestBase.java:390)
	at io.cdap.cdap.test.IntegrationTestBase.setUp(IntegrationTestBase.java:107)
	at sun.reflect.GeneratedMethodAccessor2.invoke(Unknown Source)
(41 more lines...)
Collapse Failed XMLReaderTest testPreProcessingRequired History
Distro Tests - HDP 2.3 2 mins
java.util.concurrent.TimeoutException: Timeout occurred. Expected STOPPED but found STARTING.
	at io.cdap.cdap.common.utils.Tasks.waitFor(Tasks.java:70)
	at io.cdap.cdap.common.utils.Tasks.waitFor(Tasks.java:91)
	at io.cdap.cdap.client.ProgramClient.waitForStatus(ProgramClient.java:323)
	at io.cdap.cdap.client.ProgramClient.stopAll(ProgramClient.java:254)
	at io.cdap.cdap.test.IntegrationTestBase.doClear(IntegrationTestBase.java:390)
	at io.cdap.cdap.test.IntegrationTestBase.setUp(IntegrationTestBase.java:107)
	at sun.reflect.GeneratedMethodAccessor2.invoke(Unknown Source)
(41 more lines...)
Collapse Failed XMLReaderTest testInvalidPatternWithDeleteAction History
Distro Tests - HDP 2.3 2 mins
java.util.concurrent.ExecutionException: java.lang.RuntimeException: java.io.IOException: 500: Connection refused (Connection refused)
	at io.cdap.cdap.client.util.RESTClient.execute(RESTClient.java:132)
	at io.cdap.cdap.client.util.RESTClient.execute(RESTClient.java:74)
	at io.cdap.cdap.client.ProgramClient.getProgramRuns(ProgramClient.java:478)
	at io.cdap.cdap.test.remote.RemoteApplicationManager.getHistory(RemoteApplicationManager.java:160)
	at io.cdap.cdap.test.AbstractProgramManager.getHistory(AbstractProgramManager.java:150)
	at io.cdap.cdap.test.AbstractProgramManager.lambda$waitForRuns$0(AbstractProgramManager.java:96)
	at io.cdap.cdap.common.utils.Tasks.waitFor(Tasks.java:58)
(6 more lines...)

JIRA issues

IssueDescriptionStatus
Unknown Issue TypeCDAP-15640Could not obtain issue details from JIRA
Unknown Issue TypeCDAP-15641Could not obtain issue details from JIRA