Build #239

Build: #239 failed Scheduled

Test results

  • 900 tests in total
  • 2 tests failed
  • 2 failures are new
  • 3 tests were fixed
  • 3430 minutes taken in total.
New test failures 2
Status Test View job Duration
Collapse Failed ApplicationTest test History
Distro Tests - MapR 5.0 46 secs
java.lang.RuntimeException: java.io.IOException: Service 'Core scheduler' is not available. Please wait until it is up and running.
	at co.cask.cdap.client.util.RESTClient.upload(RESTClient.java:160)
	at co.cask.cdap.client.ApplicationClient.deployApp(ApplicationClient.java:449)
	at co.cask.cdap.client.ApplicationClient.deploy(ApplicationClient.java:377)
	at co.cask.cdap.client.ApplicationClient.deploy(ApplicationClient.java:353)
	at co.cask.cdap.test.IntegrationTestManager.deployApplication(IntegrationTestManager.java:180)
	at co.cask.cdap.test.AbstractTestManager.deployApplication(AbstractTestManager.java:43)
	at co.cask.cdap.test.IntegrationTestBase.deployApplication(IntegrationTestBase.java:368)
(2 more lines...)
Collapse Failed ApplicationTest test History
Distro Tests - MapR 5.1 50 secs
java.lang.RuntimeException: java.io.IOException: Service 'Core scheduler' is not available. Please wait until it is up and running.
	at co.cask.cdap.client.util.RESTClient.upload(RESTClient.java:160)
	at co.cask.cdap.client.ApplicationClient.deployApp(ApplicationClient.java:449)
	at co.cask.cdap.client.ApplicationClient.deploy(ApplicationClient.java:377)
	at co.cask.cdap.client.ApplicationClient.deploy(ApplicationClient.java:353)
	at co.cask.cdap.test.IntegrationTestManager.deployApplication(IntegrationTestManager.java:180)
	at co.cask.cdap.test.AbstractTestManager.deployApplication(AbstractTestManager.java:43)
	at co.cask.cdap.test.IntegrationTestBase.deployApplication(IntegrationTestBase.java:368)
(2 more lines...)
Fixed tests 3
Status Test Failing since View job Duration
Successful ApplicationTest test History
Failing since build #238 (Scheduled) Distro Tests - HDP 2.2 1 min
Successful ApplicationTest test History
Failing since build #238 (Scheduled) Distro Tests - HDP 2.3 1 min
Successful ApplicationTest test History
Failing since build #238 (Scheduled) Distro Tests - MapR 5.2 MEP 1.1 1 min