Build #206

Build: #206 failed Manual run by Ali Anwar

Test results

  • 880 tests in total
  • 80 tests failed
  • 80 failures are new
  • 20 tests were fixed
  • 3242 minutes taken in total.
New test failures 80
Status Test View job Duration
Collapse Failed ETLMapReduceTest testDAGSchemaChanges History
Distro Tests - CDH 5.10 4 mins
java.lang.AssertionError: expected:<4> but was:<0>
	at org.junit.Assert.fail(Assert.java:88)
	at org.junit.Assert.failNotEquals(Assert.java:834)
	at org.junit.Assert.assertEquals(Assert.java:645)
	at org.junit.Assert.assertEquals(Assert.java:631)
	at co.cask.cdap.app.etl.batch.ETLMapReduceTest.testDAGSchemaChanges(ETLMapReduceTest.java:453)
Collapse Failed ETLMapReduceTest testDAG History
Distro Tests - CDH 5.10 4 mins
java.lang.AssertionError: expected:<2> but was:<0>
	at org.junit.Assert.fail(Assert.java:88)
	at org.junit.Assert.failNotEquals(Assert.java:834)
	at org.junit.Assert.assertEquals(Assert.java:645)
	at org.junit.Assert.assertEquals(Assert.java:631)
	at co.cask.cdap.app.etl.batch.ETLMapReduceTest.testDAG(ETLMapReduceTest.java:210)
Collapse Failed ETLMapReduceTest testDAGSchemaChanges History
Distro Tests - CDH 5.11 4 mins
java.lang.AssertionError: expected:<4> but was:<0>
	at org.junit.Assert.fail(Assert.java:88)
	at org.junit.Assert.failNotEquals(Assert.java:834)
	at org.junit.Assert.assertEquals(Assert.java:645)
	at org.junit.Assert.assertEquals(Assert.java:631)
	at co.cask.cdap.app.etl.batch.ETLMapReduceTest.testDAGSchemaChanges(ETLMapReduceTest.java:453)
Collapse Failed ETLMapReduceTest testDAG History
Distro Tests - CDH 5.11 4 mins
java.lang.AssertionError: expected:<2> but was:<0>
	at org.junit.Assert.fail(Assert.java:88)
	at org.junit.Assert.failNotEquals(Assert.java:834)
	at org.junit.Assert.assertEquals(Assert.java:645)
	at org.junit.Assert.assertEquals(Assert.java:631)
	at co.cask.cdap.app.etl.batch.ETLMapReduceTest.testDAG(ETLMapReduceTest.java:210)
Collapse Failed ETLMapReduceTest testDAGSchemaChanges History
Distro Tests - CDH 5.12 3 mins
java.lang.AssertionError: expected:<4> but was:<0>
	at org.junit.Assert.fail(Assert.java:88)
	at org.junit.Assert.failNotEquals(Assert.java:834)
	at org.junit.Assert.assertEquals(Assert.java:645)
	at org.junit.Assert.assertEquals(Assert.java:631)
	at co.cask.cdap.app.etl.batch.ETLMapReduceTest.testDAGSchemaChanges(ETLMapReduceTest.java:453)
Collapse Failed ETLMapReduceTest testDAG History
Distro Tests - CDH 5.12 3 mins
java.lang.AssertionError: expected:<2> but was:<0>
	at org.junit.Assert.fail(Assert.java:88)
	at org.junit.Assert.failNotEquals(Assert.java:834)
	at org.junit.Assert.assertEquals(Assert.java:645)
	at org.junit.Assert.assertEquals(Assert.java:631)
	at co.cask.cdap.app.etl.batch.ETLMapReduceTest.testDAG(ETLMapReduceTest.java:210)
Collapse Failed ETLMapReduceTest testDAGSchemaChanges History
Distro Tests - CDH 5.13 4 mins
java.lang.AssertionError: expected:<4> but was:<0>
	at org.junit.Assert.fail(Assert.java:88)
	at org.junit.Assert.failNotEquals(Assert.java:834)
	at org.junit.Assert.assertEquals(Assert.java:645)
	at org.junit.Assert.assertEquals(Assert.java:631)
	at co.cask.cdap.app.etl.batch.ETLMapReduceTest.testDAGSchemaChanges(ETLMapReduceTest.java:453)
Collapse Failed ETLMapReduceTest testDAG History
Distro Tests - CDH 5.13 4 mins
java.lang.AssertionError: expected:<2> but was:<0>
	at org.junit.Assert.fail(Assert.java:88)
	at org.junit.Assert.failNotEquals(Assert.java:834)
	at org.junit.Assert.assertEquals(Assert.java:645)
	at org.junit.Assert.assertEquals(Assert.java:631)
	at co.cask.cdap.app.etl.batch.ETLMapReduceTest.testDAG(ETLMapReduceTest.java:210)
Collapse Failed ETLMapReduceTest testDAGSchemaChanges History
Distro Tests - CDH 5.14 3 mins
java.lang.AssertionError: expected:<4> but was:<0>
	at org.junit.Assert.fail(Assert.java:88)
	at org.junit.Assert.failNotEquals(Assert.java:834)
	at org.junit.Assert.assertEquals(Assert.java:645)
	at org.junit.Assert.assertEquals(Assert.java:631)
	at co.cask.cdap.app.etl.batch.ETLMapReduceTest.testDAGSchemaChanges(ETLMapReduceTest.java:453)
Collapse Failed ETLMapReduceTest testDAG History
Distro Tests - CDH 5.14 3 mins
java.lang.AssertionError: expected:<2> but was:<0>
	at org.junit.Assert.fail(Assert.java:88)
	at org.junit.Assert.failNotEquals(Assert.java:834)
	at org.junit.Assert.assertEquals(Assert.java:645)
	at org.junit.Assert.assertEquals(Assert.java:631)
	at co.cask.cdap.app.etl.batch.ETLMapReduceTest.testDAG(ETLMapReduceTest.java:210)
Collapse Failed ETLMapReduceTest testDAGSchemaChanges History
Distro Tests - CDH 5.15 3 mins
java.lang.AssertionError: expected:<4> but was:<0>
	at org.junit.Assert.fail(Assert.java:88)
	at org.junit.Assert.failNotEquals(Assert.java:834)
	at org.junit.Assert.assertEquals(Assert.java:645)
	at org.junit.Assert.assertEquals(Assert.java:631)
	at co.cask.cdap.app.etl.batch.ETLMapReduceTest.testDAGSchemaChanges(ETLMapReduceTest.java:453)
Collapse Failed ETLMapReduceTest testDAG History
Distro Tests - CDH 5.15 3 mins
java.lang.AssertionError: expected:<2> but was:<0>
	at org.junit.Assert.fail(Assert.java:88)
	at org.junit.Assert.failNotEquals(Assert.java:834)
	at org.junit.Assert.assertEquals(Assert.java:645)
	at org.junit.Assert.assertEquals(Assert.java:631)
	at co.cask.cdap.app.etl.batch.ETLMapReduceTest.testDAG(ETLMapReduceTest.java:210)
Collapse Failed ETLMapReduceTest testDAGSchemaChanges History
Distro Tests - CDH 5.4 3 mins
java.lang.AssertionError: expected:<4> but was:<0>
	at org.junit.Assert.fail(Assert.java:88)
	at org.junit.Assert.failNotEquals(Assert.java:834)
	at org.junit.Assert.assertEquals(Assert.java:645)
	at org.junit.Assert.assertEquals(Assert.java:631)
	at co.cask.cdap.app.etl.batch.ETLMapReduceTest.testDAGSchemaChanges(ETLMapReduceTest.java:453)
Collapse Failed ETLMapReduceTest testDAG History
Distro Tests - CDH 5.4 3 mins
java.lang.AssertionError: expected:<2> but was:<0>
	at org.junit.Assert.fail(Assert.java:88)
	at org.junit.Assert.failNotEquals(Assert.java:834)
	at org.junit.Assert.assertEquals(Assert.java:645)
	at org.junit.Assert.assertEquals(Assert.java:631)
	at co.cask.cdap.app.etl.batch.ETLMapReduceTest.testDAG(ETLMapReduceTest.java:210)
Collapse Failed ETLMapReduceTest testDAGSchemaChanges History
Distro Tests - CDH 5.5 3 mins
java.lang.AssertionError: expected:<4> but was:<0>
	at org.junit.Assert.fail(Assert.java:88)
	at org.junit.Assert.failNotEquals(Assert.java:834)
	at org.junit.Assert.assertEquals(Assert.java:645)
	at org.junit.Assert.assertEquals(Assert.java:631)
	at co.cask.cdap.app.etl.batch.ETLMapReduceTest.testDAGSchemaChanges(ETLMapReduceTest.java:453)
Collapse Failed ETLMapReduceTest testDAG History
Distro Tests - CDH 5.5 3 mins
java.lang.AssertionError: expected:<2> but was:<0>
	at org.junit.Assert.fail(Assert.java:88)
	at org.junit.Assert.failNotEquals(Assert.java:834)
	at org.junit.Assert.assertEquals(Assert.java:645)
	at org.junit.Assert.assertEquals(Assert.java:631)
	at co.cask.cdap.app.etl.batch.ETLMapReduceTest.testDAG(ETLMapReduceTest.java:210)
Collapse Failed ETLMapReduceTest testDAGSchemaChanges History
Distro Tests - CDH 5.6 3 mins
java.lang.AssertionError: expected:<4> but was:<0>
	at org.junit.Assert.fail(Assert.java:88)
	at org.junit.Assert.failNotEquals(Assert.java:834)
	at org.junit.Assert.assertEquals(Assert.java:645)
	at org.junit.Assert.assertEquals(Assert.java:631)
	at co.cask.cdap.app.etl.batch.ETLMapReduceTest.testDAGSchemaChanges(ETLMapReduceTest.java:453)
Collapse Failed ETLMapReduceTest testDAG History
Distro Tests - CDH 5.6 3 mins
java.lang.AssertionError: expected:<2> but was:<0>
	at org.junit.Assert.fail(Assert.java:88)
	at org.junit.Assert.failNotEquals(Assert.java:834)
	at org.junit.Assert.assertEquals(Assert.java:645)
	at org.junit.Assert.assertEquals(Assert.java:631)
	at co.cask.cdap.app.etl.batch.ETLMapReduceTest.testDAG(ETLMapReduceTest.java:210)
Collapse Failed ETLMapReduceTest testDAGSchemaChanges History
Distro Tests - CDH 5.7 4 mins
java.lang.AssertionError: expected:<4> but was:<0>
	at org.junit.Assert.fail(Assert.java:88)
	at org.junit.Assert.failNotEquals(Assert.java:834)
	at org.junit.Assert.assertEquals(Assert.java:645)
	at org.junit.Assert.assertEquals(Assert.java:631)
	at co.cask.cdap.app.etl.batch.ETLMapReduceTest.testDAGSchemaChanges(ETLMapReduceTest.java:453)
Collapse Failed ETLMapReduceTest testDAG History
Distro Tests - CDH 5.7 4 mins
java.lang.AssertionError: expected:<2> but was:<0>
	at org.junit.Assert.fail(Assert.java:88)
	at org.junit.Assert.failNotEquals(Assert.java:834)
	at org.junit.Assert.assertEquals(Assert.java:645)
	at org.junit.Assert.assertEquals(Assert.java:631)
	at co.cask.cdap.app.etl.batch.ETLMapReduceTest.testDAG(ETLMapReduceTest.java:210)
Collapse Failed ETLMapReduceTest testDAGSchemaChanges History
Distro Tests - CDH 5.8 4 mins
java.lang.AssertionError: expected:<4> but was:<0>
	at org.junit.Assert.fail(Assert.java:88)
	at org.junit.Assert.failNotEquals(Assert.java:834)
	at org.junit.Assert.assertEquals(Assert.java:645)
	at org.junit.Assert.assertEquals(Assert.java:631)
	at co.cask.cdap.app.etl.batch.ETLMapReduceTest.testDAGSchemaChanges(ETLMapReduceTest.java:453)
Collapse Failed ETLMapReduceTest testDAG History
Distro Tests - CDH 5.8 4 mins
java.lang.AssertionError: expected:<2> but was:<0>
	at org.junit.Assert.fail(Assert.java:88)
	at org.junit.Assert.failNotEquals(Assert.java:834)
	at org.junit.Assert.assertEquals(Assert.java:645)
	at org.junit.Assert.assertEquals(Assert.java:631)
	at co.cask.cdap.app.etl.batch.ETLMapReduceTest.testDAG(ETLMapReduceTest.java:210)
Collapse Failed ETLMapReduceTest testDAGSchemaChanges History
Distro Tests - CDH 5.9 4 mins
java.lang.AssertionError: expected:<4> but was:<0>
	at org.junit.Assert.fail(Assert.java:88)
	at org.junit.Assert.failNotEquals(Assert.java:834)
	at org.junit.Assert.assertEquals(Assert.java:645)
	at org.junit.Assert.assertEquals(Assert.java:631)
	at co.cask.cdap.app.etl.batch.ETLMapReduceTest.testDAGSchemaChanges(ETLMapReduceTest.java:453)
Collapse Failed ETLMapReduceTest testDAG History
Distro Tests - CDH 5.9 4 mins
java.lang.AssertionError: expected:<2> but was:<0>
	at org.junit.Assert.fail(Assert.java:88)
	at org.junit.Assert.failNotEquals(Assert.java:834)
	at org.junit.Assert.assertEquals(Assert.java:645)
	at org.junit.Assert.assertEquals(Assert.java:631)
	at co.cask.cdap.app.etl.batch.ETLMapReduceTest.testDAG(ETLMapReduceTest.java:210)
Collapse Failed ETLMapReduceTest testDAGSchemaChanges History
Distro Tests - HDP 2.2 3 mins
java.lang.AssertionError: expected:<4> but was:<0>
	at org.junit.Assert.fail(Assert.java:88)
	at org.junit.Assert.failNotEquals(Assert.java:834)
	at org.junit.Assert.assertEquals(Assert.java:645)
	at org.junit.Assert.assertEquals(Assert.java:631)
	at co.cask.cdap.app.etl.batch.ETLMapReduceTest.testDAGSchemaChanges(ETLMapReduceTest.java:453)
Collapse Failed ETLMapReduceTest testDAG History
Distro Tests - HDP 2.2 3 mins
java.lang.AssertionError: expected:<2> but was:<0>
	at org.junit.Assert.fail(Assert.java:88)
	at org.junit.Assert.failNotEquals(Assert.java:834)
	at org.junit.Assert.assertEquals(Assert.java:645)
	at org.junit.Assert.assertEquals(Assert.java:631)
	at co.cask.cdap.app.etl.batch.ETLMapReduceTest.testDAG(ETLMapReduceTest.java:210)
Collapse Failed ETLMapReduceTest testDAGSchemaChanges History
Distro Tests - HDP 2.3 4 mins
java.lang.AssertionError: expected:<4> but was:<0>
	at org.junit.Assert.fail(Assert.java:88)
	at org.junit.Assert.failNotEquals(Assert.java:834)
	at org.junit.Assert.assertEquals(Assert.java:645)
	at org.junit.Assert.assertEquals(Assert.java:631)
	at co.cask.cdap.app.etl.batch.ETLMapReduceTest.testDAGSchemaChanges(ETLMapReduceTest.java:453)
Collapse Failed ETLMapReduceTest testDAG History
Distro Tests - HDP 2.3 3 mins
java.lang.AssertionError: expected:<2> but was:<0>
	at org.junit.Assert.fail(Assert.java:88)
	at org.junit.Assert.failNotEquals(Assert.java:834)
	at org.junit.Assert.assertEquals(Assert.java:645)
	at org.junit.Assert.assertEquals(Assert.java:631)
	at co.cask.cdap.app.etl.batch.ETLMapReduceTest.testDAG(ETLMapReduceTest.java:210)
Collapse Failed ETLMapReduceTest testDAGSchemaChanges History
Distro Tests - HDP 2.4 4 mins
java.lang.AssertionError: expected:<4> but was:<0>
	at org.junit.Assert.fail(Assert.java:88)
	at org.junit.Assert.failNotEquals(Assert.java:834)
	at org.junit.Assert.assertEquals(Assert.java:645)
	at org.junit.Assert.assertEquals(Assert.java:631)
	at co.cask.cdap.app.etl.batch.ETLMapReduceTest.testDAGSchemaChanges(ETLMapReduceTest.java:453)
Collapse Failed ETLMapReduceTest testDAG History
Distro Tests - HDP 2.4 4 mins
java.lang.AssertionError: expected:<2> but was:<0>
	at org.junit.Assert.fail(Assert.java:88)
	at org.junit.Assert.failNotEquals(Assert.java:834)
	at org.junit.Assert.assertEquals(Assert.java:645)
	at org.junit.Assert.assertEquals(Assert.java:631)
	at co.cask.cdap.app.etl.batch.ETLMapReduceTest.testDAG(ETLMapReduceTest.java:210)
Collapse Failed ETLMapReduceTest testDAGSchemaChanges History
Distro Tests - HDP 2.5 4 mins
java.lang.AssertionError: expected:<4> but was:<0>
	at org.junit.Assert.fail(Assert.java:88)
	at org.junit.Assert.failNotEquals(Assert.java:834)
	at org.junit.Assert.assertEquals(Assert.java:645)
	at org.junit.Assert.assertEquals(Assert.java:631)
	at co.cask.cdap.app.etl.batch.ETLMapReduceTest.testDAGSchemaChanges(ETLMapReduceTest.java:453)
Collapse Failed ETLMapReduceTest testDAG History
Distro Tests - HDP 2.5 4 mins
java.lang.AssertionError: expected:<2> but was:<0>
	at org.junit.Assert.fail(Assert.java:88)
	at org.junit.Assert.failNotEquals(Assert.java:834)
	at org.junit.Assert.assertEquals(Assert.java:645)
	at org.junit.Assert.assertEquals(Assert.java:631)
	at co.cask.cdap.app.etl.batch.ETLMapReduceTest.testDAG(ETLMapReduceTest.java:210)
Collapse Failed ETLMapReduceTest testDAGSchemaChanges History
Distro Tests - HDP 2.6 3 mins
java.lang.AssertionError: expected:<4> but was:<0>
	at org.junit.Assert.fail(Assert.java:88)
	at org.junit.Assert.failNotEquals(Assert.java:834)
	at org.junit.Assert.assertEquals(Assert.java:645)
	at org.junit.Assert.assertEquals(Assert.java:631)
	at co.cask.cdap.app.etl.batch.ETLMapReduceTest.testDAGSchemaChanges(ETLMapReduceTest.java:453)
Collapse Failed ETLMapReduceTest testDAG History
Distro Tests - HDP 2.6 3 mins
java.lang.AssertionError: expected:<2> but was:<0>
	at org.junit.Assert.fail(Assert.java:88)
	at org.junit.Assert.failNotEquals(Assert.java:834)
	at org.junit.Assert.assertEquals(Assert.java:645)
	at org.junit.Assert.assertEquals(Assert.java:631)
	at co.cask.cdap.app.etl.batch.ETLMapReduceTest.testDAG(ETLMapReduceTest.java:210)
Collapse Failed ETLMapReduceTest testDAGSchemaChanges History
Distro Tests - MapR 5.0 2 mins
java.lang.AssertionError: expected:<4> but was:<0>
	at org.junit.Assert.fail(Assert.java:88)
	at org.junit.Assert.failNotEquals(Assert.java:834)
	at org.junit.Assert.assertEquals(Assert.java:645)
	at org.junit.Assert.assertEquals(Assert.java:631)
	at co.cask.cdap.app.etl.batch.ETLMapReduceTest.testDAGSchemaChanges(ETLMapReduceTest.java:453)
Collapse Failed ETLMapReduceTest testDAG History
Distro Tests - MapR 5.0 2 mins
java.lang.AssertionError: expected:<2> but was:<0>
	at org.junit.Assert.fail(Assert.java:88)
	at org.junit.Assert.failNotEquals(Assert.java:834)
	at org.junit.Assert.assertEquals(Assert.java:645)
	at org.junit.Assert.assertEquals(Assert.java:631)
	at co.cask.cdap.app.etl.batch.ETLMapReduceTest.testDAG(ETLMapReduceTest.java:210)
Collapse Failed ETLMapReduceTest testDAGSchemaChanges History
Distro Tests - MapR 5.1 3 mins
java.lang.AssertionError: expected:<4> but was:<0>
	at org.junit.Assert.fail(Assert.java:88)
	at org.junit.Assert.failNotEquals(Assert.java:834)
	at org.junit.Assert.assertEquals(Assert.java:645)
	at org.junit.Assert.assertEquals(Assert.java:631)
	at co.cask.cdap.app.etl.batch.ETLMapReduceTest.testDAGSchemaChanges(ETLMapReduceTest.java:453)
Collapse Failed ETLMapReduceTest testDAG History
Distro Tests - MapR 5.1 3 mins
java.lang.AssertionError: expected:<2> but was:<0>
	at org.junit.Assert.fail(Assert.java:88)
	at org.junit.Assert.failNotEquals(Assert.java:834)
	at org.junit.Assert.assertEquals(Assert.java:645)
	at org.junit.Assert.assertEquals(Assert.java:631)
	at co.cask.cdap.app.etl.batch.ETLMapReduceTest.testDAG(ETLMapReduceTest.java:210)
Collapse Failed ETLMapReduceTest testDAGSchemaChanges History
Distro Tests - MapR 5.2 MEP 1.1 3 mins
java.lang.AssertionError: expected:<4> but was:<0>
	at org.junit.Assert.fail(Assert.java:88)
	at org.junit.Assert.failNotEquals(Assert.java:834)
	at org.junit.Assert.assertEquals(Assert.java:645)
	at org.junit.Assert.assertEquals(Assert.java:631)
	at co.cask.cdap.app.etl.batch.ETLMapReduceTest.testDAGSchemaChanges(ETLMapReduceTest.java:453)
Collapse Failed ETLMapReduceTest testDAG History
Distro Tests - MapR 5.2 MEP 1.1 3 mins
java.lang.AssertionError: expected:<2> but was:<0>
	at org.junit.Assert.fail(Assert.java:88)
	at org.junit.Assert.failNotEquals(Assert.java:834)
	at org.junit.Assert.assertEquals(Assert.java:645)
	at org.junit.Assert.assertEquals(Assert.java:631)
	at co.cask.cdap.app.etl.batch.ETLMapReduceTest.testDAG(ETLMapReduceTest.java:210)
Collapse Failed PartitionCorrectorTest test History
Distro Tests - CDH 5.10 1 min
java.lang.AssertionError: expected:<100> but was:<0>
	at org.junit.Assert.fail(Assert.java:88)
	at org.junit.Assert.failNotEquals(Assert.java:834)
	at org.junit.Assert.assertEquals(Assert.java:645)
	at org.junit.Assert.assertEquals(Assert.java:631)
	at co.cask.cdap.apps.fileset.PartitionCorrectorTest.validate(PartitionCorrectorTest.java:93)
	at co.cask.cdap.apps.fileset.PartitionCorrectorTest.test(PartitionCorrectorTest.java:63)
Collapse Failed PartitionCorrectorTest test History
Distro Tests - CDH 5.11 1 min
java.lang.AssertionError: expected:<100> but was:<0>
	at org.junit.Assert.fail(Assert.java:88)
	at org.junit.Assert.failNotEquals(Assert.java:834)
	at org.junit.Assert.assertEquals(Assert.java:645)
	at org.junit.Assert.assertEquals(Assert.java:631)
	at co.cask.cdap.apps.fileset.PartitionCorrectorTest.validate(PartitionCorrectorTest.java:93)
	at co.cask.cdap.apps.fileset.PartitionCorrectorTest.test(PartitionCorrectorTest.java:63)
Collapse Failed PartitionCorrectorTest test History
Distro Tests - CDH 5.12 1 min
java.lang.AssertionError: expected:<100> but was:<0>
	at org.junit.Assert.fail(Assert.java:88)
	at org.junit.Assert.failNotEquals(Assert.java:834)
	at org.junit.Assert.assertEquals(Assert.java:645)
	at org.junit.Assert.assertEquals(Assert.java:631)
	at co.cask.cdap.apps.fileset.PartitionCorrectorTest.validate(PartitionCorrectorTest.java:93)
	at co.cask.cdap.apps.fileset.PartitionCorrectorTest.test(PartitionCorrectorTest.java:63)
Collapse Failed PartitionCorrectorTest test History
Distro Tests - CDH 5.13 1 min
java.lang.AssertionError: expected:<100> but was:<0>
	at org.junit.Assert.fail(Assert.java:88)
	at org.junit.Assert.failNotEquals(Assert.java:834)
	at org.junit.Assert.assertEquals(Assert.java:645)
	at org.junit.Assert.assertEquals(Assert.java:631)
	at co.cask.cdap.apps.fileset.PartitionCorrectorTest.validate(PartitionCorrectorTest.java:93)
	at co.cask.cdap.apps.fileset.PartitionCorrectorTest.test(PartitionCorrectorTest.java:63)
Collapse Failed PartitionCorrectorTest test History
Distro Tests - CDH 5.14 1 min
java.lang.AssertionError: expected:<100> but was:<0>
	at org.junit.Assert.fail(Assert.java:88)
	at org.junit.Assert.failNotEquals(Assert.java:834)
	at org.junit.Assert.assertEquals(Assert.java:645)
	at org.junit.Assert.assertEquals(Assert.java:631)
	at co.cask.cdap.apps.fileset.PartitionCorrectorTest.validate(PartitionCorrectorTest.java:93)
	at co.cask.cdap.apps.fileset.PartitionCorrectorTest.test(PartitionCorrectorTest.java:63)
Collapse Failed PartitionCorrectorTest test History
Distro Tests - CDH 5.15 1 min
java.lang.AssertionError: expected:<100> but was:<0>
	at org.junit.Assert.fail(Assert.java:88)
	at org.junit.Assert.failNotEquals(Assert.java:834)
	at org.junit.Assert.assertEquals(Assert.java:645)
	at org.junit.Assert.assertEquals(Assert.java:631)
	at co.cask.cdap.apps.fileset.PartitionCorrectorTest.validate(PartitionCorrectorTest.java:93)
	at co.cask.cdap.apps.fileset.PartitionCorrectorTest.test(PartitionCorrectorTest.java:63)
Collapse Failed PartitionCorrectorTest test History
Distro Tests - CDH 5.4 1 min
java.lang.AssertionError: expected:<100> but was:<0>
	at org.junit.Assert.fail(Assert.java:88)
	at org.junit.Assert.failNotEquals(Assert.java:834)
	at org.junit.Assert.assertEquals(Assert.java:645)
	at org.junit.Assert.assertEquals(Assert.java:631)
	at co.cask.cdap.apps.fileset.PartitionCorrectorTest.validate(PartitionCorrectorTest.java:93)
	at co.cask.cdap.apps.fileset.PartitionCorrectorTest.test(PartitionCorrectorTest.java:63)
Collapse Failed PartitionCorrectorTest test History
Distro Tests - CDH 5.5 1 min
java.lang.AssertionError: expected:<100> but was:<0>
	at org.junit.Assert.fail(Assert.java:88)
	at org.junit.Assert.failNotEquals(Assert.java:834)
	at org.junit.Assert.assertEquals(Assert.java:645)
	at org.junit.Assert.assertEquals(Assert.java:631)
	at co.cask.cdap.apps.fileset.PartitionCorrectorTest.validate(PartitionCorrectorTest.java:93)
	at co.cask.cdap.apps.fileset.PartitionCorrectorTest.test(PartitionCorrectorTest.java:63)
Collapse Failed PartitionCorrectorTest test History
Distro Tests - CDH 5.6 1 min
java.lang.AssertionError: expected:<100> but was:<0>
	at org.junit.Assert.fail(Assert.java:88)
	at org.junit.Assert.failNotEquals(Assert.java:834)
	at org.junit.Assert.assertEquals(Assert.java:645)
	at org.junit.Assert.assertEquals(Assert.java:631)
	at co.cask.cdap.apps.fileset.PartitionCorrectorTest.validate(PartitionCorrectorTest.java:93)
	at co.cask.cdap.apps.fileset.PartitionCorrectorTest.test(PartitionCorrectorTest.java:63)
Collapse Failed PartitionCorrectorTest test History
Distro Tests - CDH 5.7 1 min
java.lang.AssertionError: expected:<100> but was:<0>
	at org.junit.Assert.fail(Assert.java:88)
	at org.junit.Assert.failNotEquals(Assert.java:834)
	at org.junit.Assert.assertEquals(Assert.java:645)
	at org.junit.Assert.assertEquals(Assert.java:631)
	at co.cask.cdap.apps.fileset.PartitionCorrectorTest.validate(PartitionCorrectorTest.java:93)
	at co.cask.cdap.apps.fileset.PartitionCorrectorTest.test(PartitionCorrectorTest.java:63)
Collapse Failed PartitionCorrectorTest test History
Distro Tests - CDH 5.8 1 min
java.lang.AssertionError: expected:<100> but was:<0>
	at org.junit.Assert.fail(Assert.java:88)
	at org.junit.Assert.failNotEquals(Assert.java:834)
	at org.junit.Assert.assertEquals(Assert.java:645)
	at org.junit.Assert.assertEquals(Assert.java:631)
	at co.cask.cdap.apps.fileset.PartitionCorrectorTest.validate(PartitionCorrectorTest.java:93)
	at co.cask.cdap.apps.fileset.PartitionCorrectorTest.test(PartitionCorrectorTest.java:63)
Collapse Failed PartitionCorrectorTest test History
Distro Tests - CDH 5.9 1 min
java.lang.AssertionError: expected:<100> but was:<0>
	at org.junit.Assert.fail(Assert.java:88)
	at org.junit.Assert.failNotEquals(Assert.java:834)
	at org.junit.Assert.assertEquals(Assert.java:645)
	at org.junit.Assert.assertEquals(Assert.java:631)
	at co.cask.cdap.apps.fileset.PartitionCorrectorTest.validate(PartitionCorrectorTest.java:93)
	at co.cask.cdap.apps.fileset.PartitionCorrectorTest.test(PartitionCorrectorTest.java:63)
Collapse Failed PartitionCorrectorTest test History
Distro Tests - HDP 2.2 1 min
java.lang.AssertionError: expected:<100> but was:<0>
	at org.junit.Assert.fail(Assert.java:88)
	at org.junit.Assert.failNotEquals(Assert.java:834)
	at org.junit.Assert.assertEquals(Assert.java:645)
	at org.junit.Assert.assertEquals(Assert.java:631)
	at co.cask.cdap.apps.fileset.PartitionCorrectorTest.validate(PartitionCorrectorTest.java:93)
	at co.cask.cdap.apps.fileset.PartitionCorrectorTest.test(PartitionCorrectorTest.java:63)
Collapse Failed PartitionCorrectorTest test History
Distro Tests - HDP 2.3 1 min
java.lang.AssertionError: expected:<100> but was:<0>
	at org.junit.Assert.fail(Assert.java:88)
	at org.junit.Assert.failNotEquals(Assert.java:834)
	at org.junit.Assert.assertEquals(Assert.java:645)
	at org.junit.Assert.assertEquals(Assert.java:631)
	at co.cask.cdap.apps.fileset.PartitionCorrectorTest.validate(PartitionCorrectorTest.java:93)
	at co.cask.cdap.apps.fileset.PartitionCorrectorTest.test(PartitionCorrectorTest.java:63)
Collapse Failed PartitionCorrectorTest test History
Distro Tests - HDP 2.4 1 min
java.lang.AssertionError: expected:<100> but was:<0>
	at org.junit.Assert.fail(Assert.java:88)
	at org.junit.Assert.failNotEquals(Assert.java:834)
	at org.junit.Assert.assertEquals(Assert.java:645)
	at org.junit.Assert.assertEquals(Assert.java:631)
	at co.cask.cdap.apps.fileset.PartitionCorrectorTest.validate(PartitionCorrectorTest.java:93)
	at co.cask.cdap.apps.fileset.PartitionCorrectorTest.test(PartitionCorrectorTest.java:63)
Collapse Failed PartitionCorrectorTest test History
Distro Tests - HDP 2.5 1 min
java.lang.AssertionError: expected:<100> but was:<0>
	at org.junit.Assert.fail(Assert.java:88)
	at org.junit.Assert.failNotEquals(Assert.java:834)
	at org.junit.Assert.assertEquals(Assert.java:645)
	at org.junit.Assert.assertEquals(Assert.java:631)
	at co.cask.cdap.apps.fileset.PartitionCorrectorTest.validate(PartitionCorrectorTest.java:93)
	at co.cask.cdap.apps.fileset.PartitionCorrectorTest.test(PartitionCorrectorTest.java:63)
Collapse Failed PartitionCorrectorTest test History
Distro Tests - HDP 2.6 1 min
java.lang.AssertionError: expected:<100> but was:<0>
	at org.junit.Assert.fail(Assert.java:88)
	at org.junit.Assert.failNotEquals(Assert.java:834)
	at org.junit.Assert.assertEquals(Assert.java:645)
	at org.junit.Assert.assertEquals(Assert.java:631)
	at co.cask.cdap.apps.fileset.PartitionCorrectorTest.validate(PartitionCorrectorTest.java:93)
	at co.cask.cdap.apps.fileset.PartitionCorrectorTest.test(PartitionCorrectorTest.java:63)
Collapse Failed PartitionCorrectorTest test History
Distro Tests - MapR 5.0 55 secs
java.lang.AssertionError: expected:<100> but was:<0>
	at org.junit.Assert.fail(Assert.java:88)
	at org.junit.Assert.failNotEquals(Assert.java:834)
	at org.junit.Assert.assertEquals(Assert.java:645)
	at org.junit.Assert.assertEquals(Assert.java:631)
	at co.cask.cdap.apps.fileset.PartitionCorrectorTest.validate(PartitionCorrectorTest.java:93)
	at co.cask.cdap.apps.fileset.PartitionCorrectorTest.test(PartitionCorrectorTest.java:63)
Collapse Failed PartitionCorrectorTest test History
Distro Tests - MapR 5.1 1 min
java.lang.AssertionError: expected:<100> but was:<0>
	at org.junit.Assert.fail(Assert.java:88)
	at org.junit.Assert.failNotEquals(Assert.java:834)
	at org.junit.Assert.assertEquals(Assert.java:645)
	at org.junit.Assert.assertEquals(Assert.java:631)
	at co.cask.cdap.apps.fileset.PartitionCorrectorTest.validate(PartitionCorrectorTest.java:93)
	at co.cask.cdap.apps.fileset.PartitionCorrectorTest.test(PartitionCorrectorTest.java:63)
Collapse Failed PartitionCorrectorTest test History
Distro Tests - MapR 5.2 MEP 1.1 1 min
java.lang.AssertionError: expected:<100> but was:<0>
	at org.junit.Assert.fail(Assert.java:88)
	at org.junit.Assert.failNotEquals(Assert.java:834)
	at org.junit.Assert.assertEquals(Assert.java:645)
	at org.junit.Assert.assertEquals(Assert.java:631)
	at co.cask.cdap.apps.fileset.PartitionCorrectorTest.validate(PartitionCorrectorTest.java:93)
	at co.cask.cdap.apps.fileset.PartitionCorrectorTest.test(PartitionCorrectorTest.java:63)
Collapse Failed PartitionedFileSetUpdateTest test History
Distro Tests - CDH 5.10 1 min
java.lang.AssertionError: expected:<3> but was:<0>
	at org.junit.Assert.fail(Assert.java:88)
	at org.junit.Assert.failNotEquals(Assert.java:834)
	at org.junit.Assert.assertEquals(Assert.java:645)
	at org.junit.Assert.assertEquals(Assert.java:631)
	at co.cask.cdap.apps.fileset.PartitionedFileSetUpdateTest.validate(PartitionedFileSetUpdateTest.java:143)
	at co.cask.cdap.apps.fileset.PartitionedFileSetUpdateTest.test(PartitionedFileSetUpdateTest.java:76)
Collapse Failed PartitionedFileSetUpdateTest test History
Distro Tests - CDH 5.11 1 min
java.lang.AssertionError: expected:<3> but was:<0>
	at org.junit.Assert.fail(Assert.java:88)
	at org.junit.Assert.failNotEquals(Assert.java:834)
	at org.junit.Assert.assertEquals(Assert.java:645)
	at org.junit.Assert.assertEquals(Assert.java:631)
	at co.cask.cdap.apps.fileset.PartitionedFileSetUpdateTest.validate(PartitionedFileSetUpdateTest.java:143)
	at co.cask.cdap.apps.fileset.PartitionedFileSetUpdateTest.test(PartitionedFileSetUpdateTest.java:76)
Collapse Failed PartitionedFileSetUpdateTest test History
Distro Tests - CDH 5.12 1 min
java.lang.AssertionError: expected:<3> but was:<0>
	at org.junit.Assert.fail(Assert.java:88)
	at org.junit.Assert.failNotEquals(Assert.java:834)
	at org.junit.Assert.assertEquals(Assert.java:645)
	at org.junit.Assert.assertEquals(Assert.java:631)
	at co.cask.cdap.apps.fileset.PartitionedFileSetUpdateTest.validate(PartitionedFileSetUpdateTest.java:143)
	at co.cask.cdap.apps.fileset.PartitionedFileSetUpdateTest.test(PartitionedFileSetUpdateTest.java:76)
Collapse Failed PartitionedFileSetUpdateTest test History
Distro Tests - CDH 5.13 1 min
java.lang.AssertionError: expected:<3> but was:<0>
	at org.junit.Assert.fail(Assert.java:88)
	at org.junit.Assert.failNotEquals(Assert.java:834)
	at org.junit.Assert.assertEquals(Assert.java:645)
	at org.junit.Assert.assertEquals(Assert.java:631)
	at co.cask.cdap.apps.fileset.PartitionedFileSetUpdateTest.validate(PartitionedFileSetUpdateTest.java:143)
	at co.cask.cdap.apps.fileset.PartitionedFileSetUpdateTest.test(PartitionedFileSetUpdateTest.java:76)
Collapse Failed PartitionedFileSetUpdateTest test History
Distro Tests - CDH 5.14 1 min
java.lang.AssertionError: expected:<3> but was:<0>
	at org.junit.Assert.fail(Assert.java:88)
	at org.junit.Assert.failNotEquals(Assert.java:834)
	at org.junit.Assert.assertEquals(Assert.java:645)
	at org.junit.Assert.assertEquals(Assert.java:631)
	at co.cask.cdap.apps.fileset.PartitionedFileSetUpdateTest.validate(PartitionedFileSetUpdateTest.java:143)
	at co.cask.cdap.apps.fileset.PartitionedFileSetUpdateTest.test(PartitionedFileSetUpdateTest.java:76)
Collapse Failed PartitionedFileSetUpdateTest test History
Distro Tests - CDH 5.15 1 min
java.lang.AssertionError: expected:<3> but was:<0>
	at org.junit.Assert.fail(Assert.java:88)
	at org.junit.Assert.failNotEquals(Assert.java:834)
	at org.junit.Assert.assertEquals(Assert.java:645)
	at org.junit.Assert.assertEquals(Assert.java:631)
	at co.cask.cdap.apps.fileset.PartitionedFileSetUpdateTest.validate(PartitionedFileSetUpdateTest.java:143)
	at co.cask.cdap.apps.fileset.PartitionedFileSetUpdateTest.test(PartitionedFileSetUpdateTest.java:76)
Collapse Failed PartitionedFileSetUpdateTest test History
Distro Tests - CDH 5.4 56 secs
java.lang.AssertionError: expected:<3> but was:<0>
	at org.junit.Assert.fail(Assert.java:88)
	at org.junit.Assert.failNotEquals(Assert.java:834)
	at org.junit.Assert.assertEquals(Assert.java:645)
	at org.junit.Assert.assertEquals(Assert.java:631)
	at co.cask.cdap.apps.fileset.PartitionedFileSetUpdateTest.validate(PartitionedFileSetUpdateTest.java:143)
	at co.cask.cdap.apps.fileset.PartitionedFileSetUpdateTest.test(PartitionedFileSetUpdateTest.java:76)
Collapse Failed PartitionedFileSetUpdateTest test History
Distro Tests - CDH 5.5 57 secs
java.lang.AssertionError: expected:<3> but was:<0>
	at org.junit.Assert.fail(Assert.java:88)
	at org.junit.Assert.failNotEquals(Assert.java:834)
	at org.junit.Assert.assertEquals(Assert.java:645)
	at org.junit.Assert.assertEquals(Assert.java:631)
	at co.cask.cdap.apps.fileset.PartitionedFileSetUpdateTest.validate(PartitionedFileSetUpdateTest.java:143)
	at co.cask.cdap.apps.fileset.PartitionedFileSetUpdateTest.test(PartitionedFileSetUpdateTest.java:76)
Collapse Failed PartitionedFileSetUpdateTest test History
Distro Tests - CDH 5.6 53 secs
java.lang.AssertionError: expected:<3> but was:<0>
	at org.junit.Assert.fail(Assert.java:88)
	at org.junit.Assert.failNotEquals(Assert.java:834)
	at org.junit.Assert.assertEquals(Assert.java:645)
	at org.junit.Assert.assertEquals(Assert.java:631)
	at co.cask.cdap.apps.fileset.PartitionedFileSetUpdateTest.validate(PartitionedFileSetUpdateTest.java:143)
	at co.cask.cdap.apps.fileset.PartitionedFileSetUpdateTest.test(PartitionedFileSetUpdateTest.java:76)
Collapse Failed PartitionedFileSetUpdateTest test History
Distro Tests - CDH 5.7 1 min
java.lang.AssertionError: expected:<3> but was:<0>
	at org.junit.Assert.fail(Assert.java:88)
	at org.junit.Assert.failNotEquals(Assert.java:834)
	at org.junit.Assert.assertEquals(Assert.java:645)
	at org.junit.Assert.assertEquals(Assert.java:631)
	at co.cask.cdap.apps.fileset.PartitionedFileSetUpdateTest.validate(PartitionedFileSetUpdateTest.java:143)
	at co.cask.cdap.apps.fileset.PartitionedFileSetUpdateTest.test(PartitionedFileSetUpdateTest.java:76)
Collapse Failed PartitionedFileSetUpdateTest test History
Distro Tests - CDH 5.8 1 min
java.lang.AssertionError: expected:<3> but was:<0>
	at org.junit.Assert.fail(Assert.java:88)
	at org.junit.Assert.failNotEquals(Assert.java:834)
	at org.junit.Assert.assertEquals(Assert.java:645)
	at org.junit.Assert.assertEquals(Assert.java:631)
	at co.cask.cdap.apps.fileset.PartitionedFileSetUpdateTest.validate(PartitionedFileSetUpdateTest.java:143)
	at co.cask.cdap.apps.fileset.PartitionedFileSetUpdateTest.test(PartitionedFileSetUpdateTest.java:76)
Collapse Failed PartitionedFileSetUpdateTest test History
Distro Tests - CDH 5.9 1 min
java.lang.AssertionError: expected:<3> but was:<0>
	at org.junit.Assert.fail(Assert.java:88)
	at org.junit.Assert.failNotEquals(Assert.java:834)
	at org.junit.Assert.assertEquals(Assert.java:645)
	at org.junit.Assert.assertEquals(Assert.java:631)
	at co.cask.cdap.apps.fileset.PartitionedFileSetUpdateTest.validate(PartitionedFileSetUpdateTest.java:143)
	at co.cask.cdap.apps.fileset.PartitionedFileSetUpdateTest.test(PartitionedFileSetUpdateTest.java:76)
Collapse Failed PartitionedFileSetUpdateTest test History
Distro Tests - HDP 2.2 51 secs
java.lang.AssertionError: expected:<3> but was:<0>
	at org.junit.Assert.fail(Assert.java:88)
	at org.junit.Assert.failNotEquals(Assert.java:834)
	at org.junit.Assert.assertEquals(Assert.java:645)
	at org.junit.Assert.assertEquals(Assert.java:631)
	at co.cask.cdap.apps.fileset.PartitionedFileSetUpdateTest.validate(PartitionedFileSetUpdateTest.java:143)
	at co.cask.cdap.apps.fileset.PartitionedFileSetUpdateTest.test(PartitionedFileSetUpdateTest.java:76)
Collapse Failed PartitionedFileSetUpdateTest test History
Distro Tests - HDP 2.3 59 secs
java.lang.AssertionError: expected:<3> but was:<0>
	at org.junit.Assert.fail(Assert.java:88)
	at org.junit.Assert.failNotEquals(Assert.java:834)
	at org.junit.Assert.assertEquals(Assert.java:645)
	at org.junit.Assert.assertEquals(Assert.java:631)
	at co.cask.cdap.apps.fileset.PartitionedFileSetUpdateTest.validate(PartitionedFileSetUpdateTest.java:143)
	at co.cask.cdap.apps.fileset.PartitionedFileSetUpdateTest.test(PartitionedFileSetUpdateTest.java:76)
Collapse Failed PartitionedFileSetUpdateTest test History
Distro Tests - HDP 2.4 1 min
java.lang.AssertionError: expected:<3> but was:<0>
	at org.junit.Assert.fail(Assert.java:88)
	at org.junit.Assert.failNotEquals(Assert.java:834)
	at org.junit.Assert.assertEquals(Assert.java:645)
	at org.junit.Assert.assertEquals(Assert.java:631)
	at co.cask.cdap.apps.fileset.PartitionedFileSetUpdateTest.validate(PartitionedFileSetUpdateTest.java:143)
	at co.cask.cdap.apps.fileset.PartitionedFileSetUpdateTest.test(PartitionedFileSetUpdateTest.java:76)
Collapse Failed PartitionedFileSetUpdateTest test History
Distro Tests - HDP 2.5 1 min
java.lang.AssertionError: expected:<3> but was:<0>
	at org.junit.Assert.fail(Assert.java:88)
	at org.junit.Assert.failNotEquals(Assert.java:834)
	at org.junit.Assert.assertEquals(Assert.java:645)
	at org.junit.Assert.assertEquals(Assert.java:631)
	at co.cask.cdap.apps.fileset.PartitionedFileSetUpdateTest.validate(PartitionedFileSetUpdateTest.java:143)
	at co.cask.cdap.apps.fileset.PartitionedFileSetUpdateTest.test(PartitionedFileSetUpdateTest.java:76)
Collapse Failed PartitionedFileSetUpdateTest test History
Distro Tests - HDP 2.6 1 min
java.lang.AssertionError: expected:<3> but was:<0>
	at org.junit.Assert.fail(Assert.java:88)
	at org.junit.Assert.failNotEquals(Assert.java:834)
	at org.junit.Assert.assertEquals(Assert.java:645)
	at org.junit.Assert.assertEquals(Assert.java:631)
	at co.cask.cdap.apps.fileset.PartitionedFileSetUpdateTest.validate(PartitionedFileSetUpdateTest.java:143)
	at co.cask.cdap.apps.fileset.PartitionedFileSetUpdateTest.test(PartitionedFileSetUpdateTest.java:76)
Collapse Failed PartitionedFileSetUpdateTest test History
Distro Tests - MapR 5.0 46 secs
java.lang.AssertionError: expected:<3> but was:<0>
	at org.junit.Assert.fail(Assert.java:88)
	at org.junit.Assert.failNotEquals(Assert.java:834)
	at org.junit.Assert.assertEquals(Assert.java:645)
	at org.junit.Assert.assertEquals(Assert.java:631)
	at co.cask.cdap.apps.fileset.PartitionedFileSetUpdateTest.validate(PartitionedFileSetUpdateTest.java:143)
	at co.cask.cdap.apps.fileset.PartitionedFileSetUpdateTest.test(PartitionedFileSetUpdateTest.java:76)
Collapse Failed PartitionedFileSetUpdateTest test History
Distro Tests - MapR 5.1 54 secs
java.lang.AssertionError: expected:<3> but was:<0>
	at org.junit.Assert.fail(Assert.java:88)
	at org.junit.Assert.failNotEquals(Assert.java:834)
	at org.junit.Assert.assertEquals(Assert.java:645)
	at org.junit.Assert.assertEquals(Assert.java:631)
	at co.cask.cdap.apps.fileset.PartitionedFileSetUpdateTest.validate(PartitionedFileSetUpdateTest.java:143)
	at co.cask.cdap.apps.fileset.PartitionedFileSetUpdateTest.test(PartitionedFileSetUpdateTest.java:76)
Collapse Failed PartitionedFileSetUpdateTest test History
Distro Tests - MapR 5.2 MEP 1.1 54 secs
java.lang.AssertionError: expected:<3> but was:<0>
	at org.junit.Assert.fail(Assert.java:88)
	at org.junit.Assert.failNotEquals(Assert.java:834)
	at org.junit.Assert.assertEquals(Assert.java:645)
	at org.junit.Assert.assertEquals(Assert.java:631)
	at co.cask.cdap.apps.fileset.PartitionedFileSetUpdateTest.validate(PartitionedFileSetUpdateTest.java:143)
	at co.cask.cdap.apps.fileset.PartitionedFileSetUpdateTest.test(PartitionedFileSetUpdateTest.java:76)
Fixed tests 20
Status Test Failing since View job Duration
Successful ApplicationTest test History
Failing since build #204 (Scheduled) Distro Tests - CDH 5.10 1 min
Successful ApplicationTest test History
Failing since build #204 (Scheduled) Distro Tests - CDH 5.11 1 min
Successful ApplicationTest test History
Failing since build #204 (Scheduled) Distro Tests - CDH 5.12 1 min
Successful ApplicationTest test History
Failing since build #204 (Scheduled) Distro Tests - CDH 5.13 1 min
Successful ApplicationTest test History
Failing since build #203 (Scheduled with changes by Ali Anwar and Ali <alianwar@google.com>) Distro Tests - CDH 5.14 1 min
Successful ApplicationTest test History
Failing since build #203 (Scheduled with changes by Ali Anwar and Ali <alianwar@google.com>) Distro Tests - CDH 5.15 1 min
Successful ApplicationTest test History
Failing since build #204 (Scheduled) Distro Tests - CDH 5.4 1 min
Successful ApplicationTest test History
Failing since build #204 (Scheduled) Distro Tests - CDH 5.5 1 min
Successful ApplicationTest test History
Failing since build #204 (Scheduled) Distro Tests - CDH 5.6 1 min
Successful ApplicationTest test History
Failing since build #204 (Scheduled) Distro Tests - CDH 5.7 1 min
Successful ApplicationTest test History
Failing since build #204 (Scheduled) Distro Tests - CDH 5.8 2 mins
Successful ApplicationTest test History
Failing since build #204 (Scheduled) Distro Tests - CDH 5.9 1 min
Successful ApplicationTest test History
Failing since build #204 (Scheduled) Distro Tests - HDP 2.2 57 secs
Successful ApplicationTest test History
Failing since build #204 (Scheduled) Distro Tests - HDP 2.3 1 min
Successful ApplicationTest test History
Failing since build #204 (Scheduled) Distro Tests - HDP 2.4 1 min
Successful ApplicationTest test History
Failing since build #204 (Scheduled) Distro Tests - HDP 2.5 2 mins
Successful ApplicationTest test History
Failing since build #204 (Scheduled) Distro Tests - HDP 2.6 1 min
Successful ApplicationTest test History
Failing since build #204 (Scheduled) Distro Tests - MapR 5.0 46 secs
Successful ApplicationTest test History
Failing since build #203 (Scheduled with changes by Ali Anwar and Ali <alianwar@google.com>) Distro Tests - MapR 5.1 1 min
Successful ApplicationTest test History
Failing since build #203 (Scheduled with changes by Ali Anwar and Ali <alianwar@google.com>) Distro Tests - MapR 5.2 MEP 1.1 52 secs