Build #206

Build: #206 failed Manual run by Ali Anwar

Build result summary

Details

Completed
Duration
378 minutes
Labels
None
Revision
d14c98d811a345e1c9e5e15005a7ec0d17783110 d14c98d811a345e1c9e5e15005a7ec0d17783110
Total tests
880
Failing since
#185 (Scheduled with changes by Andreas Neumann and Andreas Neumann <andreas@cask.co>)
Fixed in
#208 (Scheduled)

Responsible

This build has been failing since #185
No one has taken responsibility

Code commits

Author Commit Message Commit date
Ali Anwar Ali Anwar d14c98d811a345e1c9e5e15005a7ec0d17783110 d14c98d811a345e1c9e5e15005a7ec0d17783110 Merge pull request #991 from cdapio/remove-tests
Remove tests that use streams/flows.
Ali <alianwar@google.com> Ali <alianwar@google.com> a36b6c8dc9b88e181f5b6e3b36f47dfd88900f39 a36b6c8dc9b88e181f5b6e3b36f47dfd88900f39 Simply remove stream code to fix compilation.
Ali <alianwar@google.com> Ali <alianwar@google.com> 2041dc88b0312928596bd5ce57b5ca734f07c1ae 2041dc88b0312928596bd5ce57b5ca734f07c1ae CDAP-14741 Remove unused app (from previously-removed tests).
Ali <alianwar@google.com> Ali <alianwar@google.com> 4b72afd9045e9b0008289f509c939c39d674e7e4 4b72afd9045e9b0008289f509c939c39d674e7e4 CDAP-14741 Remove unused AuthorizationTestBase.
Ali <alianwar@google.com> Ali <alianwar@google.com> dc82feb01ea99cc9c54ec9ccbfb47e2620667007 dc82feb01ea99cc9c54ec9ccbfb47e2620667007 CDAP-14741 Remove SentryBasicAuthorizationTest.

Tests

New test failures 80
Status Test View job Duration
Collapse Failed ETLMapReduceTest testDAGSchemaChanges History
Distro Tests - CDH 5.10 4 mins
java.lang.AssertionError: expected:<4> but was:<0>
	at org.junit.Assert.fail(Assert.java:88)
	at org.junit.Assert.failNotEquals(Assert.java:834)
	at org.junit.Assert.assertEquals(Assert.java:645)
	at org.junit.Assert.assertEquals(Assert.java:631)
	at co.cask.cdap.app.etl.batch.ETLMapReduceTest.testDAGSchemaChanges(ETLMapReduceTest.java:453)
Collapse Failed ETLMapReduceTest testDAG History
Distro Tests - CDH 5.10 4 mins
java.lang.AssertionError: expected:<2> but was:<0>
	at org.junit.Assert.fail(Assert.java:88)
	at org.junit.Assert.failNotEquals(Assert.java:834)
	at org.junit.Assert.assertEquals(Assert.java:645)
	at org.junit.Assert.assertEquals(Assert.java:631)
	at co.cask.cdap.app.etl.batch.ETLMapReduceTest.testDAG(ETLMapReduceTest.java:210)
Collapse Failed ETLMapReduceTest testDAGSchemaChanges History
Distro Tests - CDH 5.11 4 mins
java.lang.AssertionError: expected:<4> but was:<0>
	at org.junit.Assert.fail(Assert.java:88)
	at org.junit.Assert.failNotEquals(Assert.java:834)
	at org.junit.Assert.assertEquals(Assert.java:645)
	at org.junit.Assert.assertEquals(Assert.java:631)
	at co.cask.cdap.app.etl.batch.ETLMapReduceTest.testDAGSchemaChanges(ETLMapReduceTest.java:453)
Collapse Failed ETLMapReduceTest testDAG History
Distro Tests - CDH 5.11 4 mins
java.lang.AssertionError: expected:<2> but was:<0>
	at org.junit.Assert.fail(Assert.java:88)
	at org.junit.Assert.failNotEquals(Assert.java:834)
	at org.junit.Assert.assertEquals(Assert.java:645)
	at org.junit.Assert.assertEquals(Assert.java:631)
	at co.cask.cdap.app.etl.batch.ETLMapReduceTest.testDAG(ETLMapReduceTest.java:210)
Collapse Failed ETLMapReduceTest testDAGSchemaChanges History
Distro Tests - CDH 5.12 3 mins
java.lang.AssertionError: expected:<4> but was:<0>
	at org.junit.Assert.fail(Assert.java:88)
	at org.junit.Assert.failNotEquals(Assert.java:834)
	at org.junit.Assert.assertEquals(Assert.java:645)
	at org.junit.Assert.assertEquals(Assert.java:631)
	at co.cask.cdap.app.etl.batch.ETLMapReduceTest.testDAGSchemaChanges(ETLMapReduceTest.java:453)
Collapse Failed ETLMapReduceTest testDAG History
Distro Tests - CDH 5.12 3 mins
java.lang.AssertionError: expected:<2> but was:<0>
	at org.junit.Assert.fail(Assert.java:88)
	at org.junit.Assert.failNotEquals(Assert.java:834)
	at org.junit.Assert.assertEquals(Assert.java:645)
	at org.junit.Assert.assertEquals(Assert.java:631)
	at co.cask.cdap.app.etl.batch.ETLMapReduceTest.testDAG(ETLMapReduceTest.java:210)
Collapse Failed ETLMapReduceTest testDAGSchemaChanges History
Distro Tests - CDH 5.13 4 mins
java.lang.AssertionError: expected:<4> but was:<0>
	at org.junit.Assert.fail(Assert.java:88)
	at org.junit.Assert.failNotEquals(Assert.java:834)
	at org.junit.Assert.assertEquals(Assert.java:645)
	at org.junit.Assert.assertEquals(Assert.java:631)
	at co.cask.cdap.app.etl.batch.ETLMapReduceTest.testDAGSchemaChanges(ETLMapReduceTest.java:453)
Collapse Failed ETLMapReduceTest testDAG History
Distro Tests - CDH 5.13 4 mins
java.lang.AssertionError: expected:<2> but was:<0>
	at org.junit.Assert.fail(Assert.java:88)
	at org.junit.Assert.failNotEquals(Assert.java:834)
	at org.junit.Assert.assertEquals(Assert.java:645)
	at org.junit.Assert.assertEquals(Assert.java:631)
	at co.cask.cdap.app.etl.batch.ETLMapReduceTest.testDAG(ETLMapReduceTest.java:210)
Collapse Failed ETLMapReduceTest testDAGSchemaChanges History
Distro Tests - CDH 5.14 3 mins
java.lang.AssertionError: expected:<4> but was:<0>
	at org.junit.Assert.fail(Assert.java:88)
	at org.junit.Assert.failNotEquals(Assert.java:834)
	at org.junit.Assert.assertEquals(Assert.java:645)
	at org.junit.Assert.assertEquals(Assert.java:631)
	at co.cask.cdap.app.etl.batch.ETLMapReduceTest.testDAGSchemaChanges(ETLMapReduceTest.java:453)
Collapse Failed ETLMapReduceTest testDAG History
Distro Tests - CDH 5.14 3 mins
java.lang.AssertionError: expected:<2> but was:<0>
	at org.junit.Assert.fail(Assert.java:88)
	at org.junit.Assert.failNotEquals(Assert.java:834)
	at org.junit.Assert.assertEquals(Assert.java:645)
	at org.junit.Assert.assertEquals(Assert.java:631)
	at co.cask.cdap.app.etl.batch.ETLMapReduceTest.testDAG(ETLMapReduceTest.java:210)
Collapse Failed ETLMapReduceTest testDAGSchemaChanges History
Distro Tests - CDH 5.15 3 mins
java.lang.AssertionError: expected:<4> but was:<0>
	at org.junit.Assert.fail(Assert.java:88)
	at org.junit.Assert.failNotEquals(Assert.java:834)
	at org.junit.Assert.assertEquals(Assert.java:645)
	at org.junit.Assert.assertEquals(Assert.java:631)
	at co.cask.cdap.app.etl.batch.ETLMapReduceTest.testDAGSchemaChanges(ETLMapReduceTest.java:453)
Collapse Failed ETLMapReduceTest testDAG History
Distro Tests - CDH 5.15 3 mins
java.lang.AssertionError: expected:<2> but was:<0>
	at org.junit.Assert.fail(Assert.java:88)
	at org.junit.Assert.failNotEquals(Assert.java:834)
	at org.junit.Assert.assertEquals(Assert.java:645)
	at org.junit.Assert.assertEquals(Assert.java:631)
	at co.cask.cdap.app.etl.batch.ETLMapReduceTest.testDAG(ETLMapReduceTest.java:210)
Collapse Failed ETLMapReduceTest testDAGSchemaChanges History
Distro Tests - CDH 5.4 3 mins
java.lang.AssertionError: expected:<4> but was:<0>
	at org.junit.Assert.fail(Assert.java:88)
	at org.junit.Assert.failNotEquals(Assert.java:834)
	at org.junit.Assert.assertEquals(Assert.java:645)
	at org.junit.Assert.assertEquals(Assert.java:631)
	at co.cask.cdap.app.etl.batch.ETLMapReduceTest.testDAGSchemaChanges(ETLMapReduceTest.java:453)
Collapse Failed ETLMapReduceTest testDAG History
Distro Tests - CDH 5.4 3 mins
java.lang.AssertionError: expected:<2> but was:<0>
	at org.junit.Assert.fail(Assert.java:88)
	at org.junit.Assert.failNotEquals(Assert.java:834)
	at org.junit.Assert.assertEquals(Assert.java:645)
	at org.junit.Assert.assertEquals(Assert.java:631)
	at co.cask.cdap.app.etl.batch.ETLMapReduceTest.testDAG(ETLMapReduceTest.java:210)
Collapse Failed ETLMapReduceTest testDAGSchemaChanges History
Distro Tests - CDH 5.5 3 mins
java.lang.AssertionError: expected:<4> but was:<0>
	at org.junit.Assert.fail(Assert.java:88)
	at org.junit.Assert.failNotEquals(Assert.java:834)
	at org.junit.Assert.assertEquals(Assert.java:645)
	at org.junit.Assert.assertEquals(Assert.java:631)
	at co.cask.cdap.app.etl.batch.ETLMapReduceTest.testDAGSchemaChanges(ETLMapReduceTest.java:453)
Collapse Failed ETLMapReduceTest testDAG History
Distro Tests - CDH 5.5 3 mins
java.lang.AssertionError: expected:<2> but was:<0>
	at org.junit.Assert.fail(Assert.java:88)
	at org.junit.Assert.failNotEquals(Assert.java:834)
	at org.junit.Assert.assertEquals(Assert.java:645)
	at org.junit.Assert.assertEquals(Assert.java:631)
	at co.cask.cdap.app.etl.batch.ETLMapReduceTest.testDAG(ETLMapReduceTest.java:210)
Collapse Failed ETLMapReduceTest testDAGSchemaChanges History
Distro Tests - CDH 5.6 3 mins
java.lang.AssertionError: expected:<4> but was:<0>
	at org.junit.Assert.fail(Assert.java:88)
	at org.junit.Assert.failNotEquals(Assert.java:834)
	at org.junit.Assert.assertEquals(Assert.java:645)
	at org.junit.Assert.assertEquals(Assert.java:631)
	at co.cask.cdap.app.etl.batch.ETLMapReduceTest.testDAGSchemaChanges(ETLMapReduceTest.java:453)
Collapse Failed ETLMapReduceTest testDAG History
Distro Tests - CDH 5.6 3 mins
java.lang.AssertionError: expected:<2> but was:<0>
	at org.junit.Assert.fail(Assert.java:88)
	at org.junit.Assert.failNotEquals(Assert.java:834)
	at org.junit.Assert.assertEquals(Assert.java:645)
	at org.junit.Assert.assertEquals(Assert.java:631)
	at co.cask.cdap.app.etl.batch.ETLMapReduceTest.testDAG(ETLMapReduceTest.java:210)
Collapse Failed ETLMapReduceTest testDAGSchemaChanges History
Distro Tests - CDH 5.7 4 mins
java.lang.AssertionError: expected:<4> but was:<0>
	at org.junit.Assert.fail(Assert.java:88)
	at org.junit.Assert.failNotEquals(Assert.java:834)
	at org.junit.Assert.assertEquals(Assert.java:645)
	at org.junit.Assert.assertEquals(Assert.java:631)
	at co.cask.cdap.app.etl.batch.ETLMapReduceTest.testDAGSchemaChanges(ETLMapReduceTest.java:453)
Collapse Failed ETLMapReduceTest testDAG History
Distro Tests - CDH 5.7 4 mins
java.lang.AssertionError: expected:<2> but was:<0>
	at org.junit.Assert.fail(Assert.java:88)
	at org.junit.Assert.failNotEquals(Assert.java:834)
	at org.junit.Assert.assertEquals(Assert.java:645)
	at org.junit.Assert.assertEquals(Assert.java:631)
	at co.cask.cdap.app.etl.batch.ETLMapReduceTest.testDAG(ETLMapReduceTest.java:210)
Collapse Failed ETLMapReduceTest testDAGSchemaChanges History
Distro Tests - CDH 5.8 4 mins
java.lang.AssertionError: expected:<4> but was:<0>
	at org.junit.Assert.fail(Assert.java:88)
	at org.junit.Assert.failNotEquals(Assert.java:834)
	at org.junit.Assert.assertEquals(Assert.java:645)
	at org.junit.Assert.assertEquals(Assert.java:631)
	at co.cask.cdap.app.etl.batch.ETLMapReduceTest.testDAGSchemaChanges(ETLMapReduceTest.java:453)
Collapse Failed ETLMapReduceTest testDAG History
Distro Tests - CDH 5.8 4 mins
java.lang.AssertionError: expected:<2> but was:<0>
	at org.junit.Assert.fail(Assert.java:88)
	at org.junit.Assert.failNotEquals(Assert.java:834)
	at org.junit.Assert.assertEquals(Assert.java:645)
	at org.junit.Assert.assertEquals(Assert.java:631)
	at co.cask.cdap.app.etl.batch.ETLMapReduceTest.testDAG(ETLMapReduceTest.java:210)
Collapse Failed ETLMapReduceTest testDAGSchemaChanges History
Distro Tests - CDH 5.9 4 mins
java.lang.AssertionError: expected:<4> but was:<0>
	at org.junit.Assert.fail(Assert.java:88)
	at org.junit.Assert.failNotEquals(Assert.java:834)
	at org.junit.Assert.assertEquals(Assert.java:645)
	at org.junit.Assert.assertEquals(Assert.java:631)
	at co.cask.cdap.app.etl.batch.ETLMapReduceTest.testDAGSchemaChanges(ETLMapReduceTest.java:453)
Collapse Failed ETLMapReduceTest testDAG History
Distro Tests - CDH 5.9 4 mins
java.lang.AssertionError: expected:<2> but was:<0>
	at org.junit.Assert.fail(Assert.java:88)
	at org.junit.Assert.failNotEquals(Assert.java:834)
	at org.junit.Assert.assertEquals(Assert.java:645)
	at org.junit.Assert.assertEquals(Assert.java:631)
	at co.cask.cdap.app.etl.batch.ETLMapReduceTest.testDAG(ETLMapReduceTest.java:210)
Collapse Failed ETLMapReduceTest testDAGSchemaChanges History
Distro Tests - HDP 2.2 3 mins
java.lang.AssertionError: expected:<4> but was:<0>
	at org.junit.Assert.fail(Assert.java:88)
	at org.junit.Assert.failNotEquals(Assert.java:834)
	at org.junit.Assert.assertEquals(Assert.java:645)
	at org.junit.Assert.assertEquals(Assert.java:631)
	at co.cask.cdap.app.etl.batch.ETLMapReduceTest.testDAGSchemaChanges(ETLMapReduceTest.java:453)
Collapse Failed ETLMapReduceTest testDAG History
Distro Tests - HDP 2.2 3 mins
java.lang.AssertionError: expected:<2> but was:<0>
	at org.junit.Assert.fail(Assert.java:88)
	at org.junit.Assert.failNotEquals(Assert.java:834)
	at org.junit.Assert.assertEquals(Assert.java:645)
	at org.junit.Assert.assertEquals(Assert.java:631)
	at co.cask.cdap.app.etl.batch.ETLMapReduceTest.testDAG(ETLMapReduceTest.java:210)
Collapse Failed ETLMapReduceTest testDAGSchemaChanges History
Distro Tests - HDP 2.3 4 mins
java.lang.AssertionError: expected:<4> but was:<0>
	at org.junit.Assert.fail(Assert.java:88)
	at org.junit.Assert.failNotEquals(Assert.java:834)
	at org.junit.Assert.assertEquals(Assert.java:645)
	at org.junit.Assert.assertEquals(Assert.java:631)
	at co.cask.cdap.app.etl.batch.ETLMapReduceTest.testDAGSchemaChanges(ETLMapReduceTest.java:453)
Collapse Failed ETLMapReduceTest testDAG History
Distro Tests - HDP 2.3 3 mins
java.lang.AssertionError: expected:<2> but was:<0>
	at org.junit.Assert.fail(Assert.java:88)
	at org.junit.Assert.failNotEquals(Assert.java:834)
	at org.junit.Assert.assertEquals(Assert.java:645)
	at org.junit.Assert.assertEquals(Assert.java:631)
	at co.cask.cdap.app.etl.batch.ETLMapReduceTest.testDAG(ETLMapReduceTest.java:210)
Collapse Failed ETLMapReduceTest testDAGSchemaChanges History
Distro Tests - HDP 2.4 4 mins
java.lang.AssertionError: expected:<4> but was:<0>
	at org.junit.Assert.fail(Assert.java:88)
	at org.junit.Assert.failNotEquals(Assert.java:834)
	at org.junit.Assert.assertEquals(Assert.java:645)
	at org.junit.Assert.assertEquals(Assert.java:631)
	at co.cask.cdap.app.etl.batch.ETLMapReduceTest.testDAGSchemaChanges(ETLMapReduceTest.java:453)
Collapse Failed ETLMapReduceTest testDAG History
Distro Tests - HDP 2.4 4 mins
java.lang.AssertionError: expected:<2> but was:<0>
	at org.junit.Assert.fail(Assert.java:88)
	at org.junit.Assert.failNotEquals(Assert.java:834)
	at org.junit.Assert.assertEquals(Assert.java:645)
	at org.junit.Assert.assertEquals(Assert.java:631)
	at co.cask.cdap.app.etl.batch.ETLMapReduceTest.testDAG(ETLMapReduceTest.java:210)
Collapse Failed ETLMapReduceTest testDAGSchemaChanges History
Distro Tests - HDP 2.5 4 mins
java.lang.AssertionError: expected:<4> but was:<0>
	at org.junit.Assert.fail(Assert.java:88)
	at org.junit.Assert.failNotEquals(Assert.java:834)
	at org.junit.Assert.assertEquals(Assert.java:645)
	at org.junit.Assert.assertEquals(Assert.java:631)
	at co.cask.cdap.app.etl.batch.ETLMapReduceTest.testDAGSchemaChanges(ETLMapReduceTest.java:453)
Collapse Failed ETLMapReduceTest testDAG History
Distro Tests - HDP 2.5 4 mins
java.lang.AssertionError: expected:<2> but was:<0>
	at org.junit.Assert.fail(Assert.java:88)
	at org.junit.Assert.failNotEquals(Assert.java:834)
	at org.junit.Assert.assertEquals(Assert.java:645)
	at org.junit.Assert.assertEquals(Assert.java:631)
	at co.cask.cdap.app.etl.batch.ETLMapReduceTest.testDAG(ETLMapReduceTest.java:210)
Collapse Failed ETLMapReduceTest testDAGSchemaChanges History
Distro Tests - HDP 2.6 3 mins
java.lang.AssertionError: expected:<4> but was:<0>
	at org.junit.Assert.fail(Assert.java:88)
	at org.junit.Assert.failNotEquals(Assert.java:834)
	at org.junit.Assert.assertEquals(Assert.java:645)
	at org.junit.Assert.assertEquals(Assert.java:631)
	at co.cask.cdap.app.etl.batch.ETLMapReduceTest.testDAGSchemaChanges(ETLMapReduceTest.java:453)
Collapse Failed ETLMapReduceTest testDAG History
Distro Tests - HDP 2.6 3 mins
java.lang.AssertionError: expected:<2> but was:<0>
	at org.junit.Assert.fail(Assert.java:88)
	at org.junit.Assert.failNotEquals(Assert.java:834)
	at org.junit.Assert.assertEquals(Assert.java:645)
	at org.junit.Assert.assertEquals(Assert.java:631)
	at co.cask.cdap.app.etl.batch.ETLMapReduceTest.testDAG(ETLMapReduceTest.java:210)
Collapse Failed ETLMapReduceTest testDAGSchemaChanges History
Distro Tests - MapR 5.0 2 mins
java.lang.AssertionError: expected:<4> but was:<0>
	at org.junit.Assert.fail(Assert.java:88)
	at org.junit.Assert.failNotEquals(Assert.java:834)
	at org.junit.Assert.assertEquals(Assert.java:645)
	at org.junit.Assert.assertEquals(Assert.java:631)
	at co.cask.cdap.app.etl.batch.ETLMapReduceTest.testDAGSchemaChanges(ETLMapReduceTest.java:453)
Collapse Failed ETLMapReduceTest testDAG History
Distro Tests - MapR 5.0 2 mins
java.lang.AssertionError: expected:<2> but was:<0>
	at org.junit.Assert.fail(Assert.java:88)
	at org.junit.Assert.failNotEquals(Assert.java:834)
	at org.junit.Assert.assertEquals(Assert.java:645)
	at org.junit.Assert.assertEquals(Assert.java:631)
	at co.cask.cdap.app.etl.batch.ETLMapReduceTest.testDAG(ETLMapReduceTest.java:210)
Collapse Failed ETLMapReduceTest testDAGSchemaChanges History
Distro Tests - MapR 5.1 3 mins
java.lang.AssertionError: expected:<4> but was:<0>
	at org.junit.Assert.fail(Assert.java:88)
	at org.junit.Assert.failNotEquals(Assert.java:834)
	at org.junit.Assert.assertEquals(Assert.java:645)
	at org.junit.Assert.assertEquals(Assert.java:631)
	at co.cask.cdap.app.etl.batch.ETLMapReduceTest.testDAGSchemaChanges(ETLMapReduceTest.java:453)
Collapse Failed ETLMapReduceTest testDAG History
Distro Tests - MapR 5.1 3 mins
java.lang.AssertionError: expected:<2> but was:<0>
	at org.junit.Assert.fail(Assert.java:88)
	at org.junit.Assert.failNotEquals(Assert.java:834)
	at org.junit.Assert.assertEquals(Assert.java:645)
	at org.junit.Assert.assertEquals(Assert.java:631)
	at co.cask.cdap.app.etl.batch.ETLMapReduceTest.testDAG(ETLMapReduceTest.java:210)
Collapse Failed ETLMapReduceTest testDAGSchemaChanges History
Distro Tests - MapR 5.2 MEP 1.1 3 mins
java.lang.AssertionError: expected:<4> but was:<0>
	at org.junit.Assert.fail(Assert.java:88)
	at org.junit.Assert.failNotEquals(Assert.java:834)
	at org.junit.Assert.assertEquals(Assert.java:645)
	at org.junit.Assert.assertEquals(Assert.java:631)
	at co.cask.cdap.app.etl.batch.ETLMapReduceTest.testDAGSchemaChanges(ETLMapReduceTest.java:453)
Collapse Failed ETLMapReduceTest testDAG History
Distro Tests - MapR 5.2 MEP 1.1 3 mins
java.lang.AssertionError: expected:<2> but was:<0>
	at org.junit.Assert.fail(Assert.java:88)
	at org.junit.Assert.failNotEquals(Assert.java:834)
	at org.junit.Assert.assertEquals(Assert.java:645)
	at org.junit.Assert.assertEquals(Assert.java:631)
	at co.cask.cdap.app.etl.batch.ETLMapReduceTest.testDAG(ETLMapReduceTest.java:210)
Collapse Failed PartitionCorrectorTest test History
Distro Tests - CDH 5.10 1 min
java.lang.AssertionError: expected:<100> but was:<0>
	at org.junit.Assert.fail(Assert.java:88)
	at org.junit.Assert.failNotEquals(Assert.java:834)
	at org.junit.Assert.assertEquals(Assert.java:645)
	at org.junit.Assert.assertEquals(Assert.java:631)
	at co.cask.cdap.apps.fileset.PartitionCorrectorTest.validate(PartitionCorrectorTest.java:93)
	at co.cask.cdap.apps.fileset.PartitionCorrectorTest.test(PartitionCorrectorTest.java:63)
Collapse Failed PartitionCorrectorTest test History
Distro Tests - CDH 5.11 1 min
java.lang.AssertionError: expected:<100> but was:<0>
	at org.junit.Assert.fail(Assert.java:88)
	at org.junit.Assert.failNotEquals(Assert.java:834)
	at org.junit.Assert.assertEquals(Assert.java:645)
	at org.junit.Assert.assertEquals(Assert.java:631)
	at co.cask.cdap.apps.fileset.PartitionCorrectorTest.validate(PartitionCorrectorTest.java:93)
	at co.cask.cdap.apps.fileset.PartitionCorrectorTest.test(PartitionCorrectorTest.java:63)
Collapse Failed PartitionCorrectorTest test History
Distro Tests - CDH 5.12 1 min
java.lang.AssertionError: expected:<100> but was:<0>
	at org.junit.Assert.fail(Assert.java:88)
	at org.junit.Assert.failNotEquals(Assert.java:834)
	at org.junit.Assert.assertEquals(Assert.java:645)
	at org.junit.Assert.assertEquals(Assert.java:631)
	at co.cask.cdap.apps.fileset.PartitionCorrectorTest.validate(PartitionCorrectorTest.java:93)
	at co.cask.cdap.apps.fileset.PartitionCorrectorTest.test(PartitionCorrectorTest.java:63)
Collapse Failed PartitionCorrectorTest test History
Distro Tests - CDH 5.13 1 min
java.lang.AssertionError: expected:<100> but was:<0>
	at org.junit.Assert.fail(Assert.java:88)
	at org.junit.Assert.failNotEquals(Assert.java:834)
	at org.junit.Assert.assertEquals(Assert.java:645)
	at org.junit.Assert.assertEquals(Assert.java:631)
	at co.cask.cdap.apps.fileset.PartitionCorrectorTest.validate(PartitionCorrectorTest.java:93)
	at co.cask.cdap.apps.fileset.PartitionCorrectorTest.test(PartitionCorrectorTest.java:63)
Collapse Failed PartitionCorrectorTest test History
Distro Tests - CDH 5.14 1 min
java.lang.AssertionError: expected:<100> but was:<0>
	at org.junit.Assert.fail(Assert.java:88)
	at org.junit.Assert.failNotEquals(Assert.java:834)
	at org.junit.Assert.assertEquals(Assert.java:645)
	at org.junit.Assert.assertEquals(Assert.java:631)
	at co.cask.cdap.apps.fileset.PartitionCorrectorTest.validate(PartitionCorrectorTest.java:93)
	at co.cask.cdap.apps.fileset.PartitionCorrectorTest.test(PartitionCorrectorTest.java:63)
Collapse Failed PartitionCorrectorTest test History
Distro Tests - CDH 5.15 1 min
java.lang.AssertionError: expected:<100> but was:<0>
	at org.junit.Assert.fail(Assert.java:88)
	at org.junit.Assert.failNotEquals(Assert.java:834)
	at org.junit.Assert.assertEquals(Assert.java:645)
	at org.junit.Assert.assertEquals(Assert.java:631)
	at co.cask.cdap.apps.fileset.PartitionCorrectorTest.validate(PartitionCorrectorTest.java:93)
	at co.cask.cdap.apps.fileset.PartitionCorrectorTest.test(PartitionCorrectorTest.java:63)
Collapse Failed PartitionCorrectorTest test History
Distro Tests - CDH 5.4 1 min
java.lang.AssertionError: expected:<100> but was:<0>
	at org.junit.Assert.fail(Assert.java:88)
	at org.junit.Assert.failNotEquals(Assert.java:834)
	at org.junit.Assert.assertEquals(Assert.java:645)
	at org.junit.Assert.assertEquals(Assert.java:631)
	at co.cask.cdap.apps.fileset.PartitionCorrectorTest.validate(PartitionCorrectorTest.java:93)
	at co.cask.cdap.apps.fileset.PartitionCorrectorTest.test(PartitionCorrectorTest.java:63)
Collapse Failed PartitionCorrectorTest test History
Distro Tests - CDH 5.5 1 min
java.lang.AssertionError: expected:<100> but was:<0>
	at org.junit.Assert.fail(Assert.java:88)
	at org.junit.Assert.failNotEquals(Assert.java:834)
	at org.junit.Assert.assertEquals(Assert.java:645)
	at org.junit.Assert.assertEquals(Assert.java:631)
	at co.cask.cdap.apps.fileset.PartitionCorrectorTest.validate(PartitionCorrectorTest.java:93)
	at co.cask.cdap.apps.fileset.PartitionCorrectorTest.test(PartitionCorrectorTest.java:63)
Collapse Failed PartitionCorrectorTest test History
Distro Tests - CDH 5.6 1 min
java.lang.AssertionError: expected:<100> but was:<0>
	at org.junit.Assert.fail(Assert.java:88)
	at org.junit.Assert.failNotEquals(Assert.java:834)
	at org.junit.Assert.assertEquals(Assert.java:645)
	at org.junit.Assert.assertEquals(Assert.java:631)
	at co.cask.cdap.apps.fileset.PartitionCorrectorTest.validate(PartitionCorrectorTest.java:93)
	at co.cask.cdap.apps.fileset.PartitionCorrectorTest.test(PartitionCorrectorTest.java:63)
Collapse Failed PartitionCorrectorTest test History
Distro Tests - CDH 5.7 1 min
java.lang.AssertionError: expected:<100> but was:<0>
	at org.junit.Assert.fail(Assert.java:88)
	at org.junit.Assert.failNotEquals(Assert.java:834)
	at org.junit.Assert.assertEquals(Assert.java:645)
	at org.junit.Assert.assertEquals(Assert.java:631)
	at co.cask.cdap.apps.fileset.PartitionCorrectorTest.validate(PartitionCorrectorTest.java:93)
	at co.cask.cdap.apps.fileset.PartitionCorrectorTest.test(PartitionCorrectorTest.java:63)
Fixed tests 20
Status Test Failing since View job Duration
Successful ApplicationTest test History
Failing since build #204 (Scheduled) Distro Tests - CDH 5.10 1 min
Successful ApplicationTest test History
Failing since build #204 (Scheduled) Distro Tests - CDH 5.11 1 min
Successful ApplicationTest test History
Failing since build #204 (Scheduled) Distro Tests - CDH 5.12 1 min
Successful ApplicationTest test History
Failing since build #204 (Scheduled) Distro Tests - CDH 5.13 1 min
Successful ApplicationTest test History
Failing since build #203 (Scheduled with changes by Ali Anwar and Ali <alianwar@google.com>) Distro Tests - CDH 5.14 1 min
Successful ApplicationTest test History
Failing since build #203 (Scheduled with changes by Ali Anwar and Ali <alianwar@google.com>) Distro Tests - CDH 5.15 1 min
Successful ApplicationTest test History
Failing since build #204 (Scheduled) Distro Tests - CDH 5.4 1 min
Successful ApplicationTest test History
Failing since build #204 (Scheduled) Distro Tests - CDH 5.5 1 min
Successful ApplicationTest test History
Failing since build #204 (Scheduled) Distro Tests - CDH 5.6 1 min
Successful ApplicationTest test History
Failing since build #204 (Scheduled) Distro Tests - CDH 5.7 1 min
Successful ApplicationTest test History
Failing since build #204 (Scheduled) Distro Tests - CDH 5.8 2 mins
Successful ApplicationTest test History
Failing since build #204 (Scheduled) Distro Tests - CDH 5.9 1 min
Successful ApplicationTest test History
Failing since build #204 (Scheduled) Distro Tests - HDP 2.2 57 secs
Successful ApplicationTest test History
Failing since build #204 (Scheduled) Distro Tests - HDP 2.3 1 min
Successful ApplicationTest test History
Failing since build #204 (Scheduled) Distro Tests - HDP 2.4 1 min
Successful ApplicationTest test History
Failing since build #204 (Scheduled) Distro Tests - HDP 2.5 2 mins
Successful ApplicationTest test History
Failing since build #204 (Scheduled) Distro Tests - HDP 2.6 1 min
Successful ApplicationTest test History
Failing since build #204 (Scheduled) Distro Tests - MapR 5.0 46 secs
Successful ApplicationTest test History
Failing since build #203 (Scheduled with changes by Ali Anwar and Ali <alianwar@google.com>) Distro Tests - MapR 5.1 1 min
Successful ApplicationTest test History
Failing since build #203 (Scheduled with changes by Ali Anwar and Ali <alianwar@google.com>) Distro Tests - MapR 5.2 MEP 1.1 52 secs

JIRA issues

IssueDescriptionStatus
Unknown Issue TypeCDAP-14741Could not obtain issue details from JIRA
Unknown Issue TypeCDAP-14746Could not obtain issue details from JIRA