Build #204

Build: #204 failed Scheduled

Test results

  • 980 tests in total
  • 100 tests failed
  • 79 failures are new
  • 3414 minutes taken in total.
New test failures 79
Status Test View job Duration
Collapse Failed ApplicationTest test History
Distro Tests - CDH 5.10 9 secs
java.lang.RuntimeException: java.io.IOException: co.cask.cdap.api.flow.Flow
	at co.cask.cdap.client.util.RESTClient.upload(RESTClient.java:160)
	at co.cask.cdap.client.ApplicationClient.deployApp(ApplicationClient.java:449)
	at co.cask.cdap.client.ApplicationClient.deploy(ApplicationClient.java:377)
	at co.cask.cdap.client.ApplicationClient.deploy(ApplicationClient.java:353)
	at co.cask.cdap.test.IntegrationTestManager.deployApplication(IntegrationTestManager.java:183)
	at co.cask.cdap.test.AbstractTestManager.deployApplication(AbstractTestManager.java:43)
	at co.cask.cdap.test.IntegrationTestBase.deployApplication(IntegrationTestBase.java:374)
(2 more lines...)
Collapse Failed ApplicationTest test History
Distro Tests - CDH 5.11 1 min
java.lang.RuntimeException: java.io.IOException: co.cask.cdap.api.flow.Flow
	at co.cask.cdap.client.util.RESTClient.upload(RESTClient.java:160)
	at co.cask.cdap.client.ApplicationClient.deployApp(ApplicationClient.java:449)
	at co.cask.cdap.client.ApplicationClient.deploy(ApplicationClient.java:377)
	at co.cask.cdap.client.ApplicationClient.deploy(ApplicationClient.java:353)
	at co.cask.cdap.test.IntegrationTestManager.deployApplication(IntegrationTestManager.java:183)
	at co.cask.cdap.test.AbstractTestManager.deployApplication(AbstractTestManager.java:43)
	at co.cask.cdap.test.IntegrationTestBase.deployApplication(IntegrationTestBase.java:374)
(2 more lines...)
Collapse Failed ApplicationTest test History
Distro Tests - CDH 5.12 9 secs
java.lang.RuntimeException: java.io.IOException: co.cask.cdap.api.flow.Flow
	at co.cask.cdap.client.util.RESTClient.upload(RESTClient.java:160)
	at co.cask.cdap.client.ApplicationClient.deployApp(ApplicationClient.java:449)
	at co.cask.cdap.client.ApplicationClient.deploy(ApplicationClient.java:377)
	at co.cask.cdap.client.ApplicationClient.deploy(ApplicationClient.java:353)
	at co.cask.cdap.test.IntegrationTestManager.deployApplication(IntegrationTestManager.java:183)
	at co.cask.cdap.test.AbstractTestManager.deployApplication(AbstractTestManager.java:43)
	at co.cask.cdap.test.IntegrationTestBase.deployApplication(IntegrationTestBase.java:374)
(2 more lines...)
Collapse Failed ApplicationTest test History
Distro Tests - CDH 5.13 12 secs
java.lang.RuntimeException: java.io.IOException: co.cask.cdap.api.flow.Flow
	at co.cask.cdap.client.util.RESTClient.upload(RESTClient.java:160)
	at co.cask.cdap.client.ApplicationClient.deployApp(ApplicationClient.java:449)
	at co.cask.cdap.client.ApplicationClient.deploy(ApplicationClient.java:377)
	at co.cask.cdap.client.ApplicationClient.deploy(ApplicationClient.java:353)
	at co.cask.cdap.test.IntegrationTestManager.deployApplication(IntegrationTestManager.java:183)
	at co.cask.cdap.test.AbstractTestManager.deployApplication(AbstractTestManager.java:43)
	at co.cask.cdap.test.IntegrationTestBase.deployApplication(IntegrationTestBase.java:374)
(2 more lines...)
Collapse Failed ApplicationTest test History
Distro Tests - CDH 5.4 7 secs
java.lang.RuntimeException: java.io.IOException: co.cask.cdap.api.flow.Flow
	at co.cask.cdap.client.util.RESTClient.upload(RESTClient.java:160)
	at co.cask.cdap.client.ApplicationClient.deployApp(ApplicationClient.java:449)
	at co.cask.cdap.client.ApplicationClient.deploy(ApplicationClient.java:377)
	at co.cask.cdap.client.ApplicationClient.deploy(ApplicationClient.java:353)
	at co.cask.cdap.test.IntegrationTestManager.deployApplication(IntegrationTestManager.java:183)
	at co.cask.cdap.test.AbstractTestManager.deployApplication(AbstractTestManager.java:43)
	at co.cask.cdap.test.IntegrationTestBase.deployApplication(IntegrationTestBase.java:374)
(2 more lines...)
Collapse Failed ApplicationTest test History
Distro Tests - CDH 5.5 39 secs
java.lang.RuntimeException: java.io.IOException: co.cask.cdap.api.flow.Flow
	at co.cask.cdap.client.util.RESTClient.upload(RESTClient.java:160)
	at co.cask.cdap.client.ApplicationClient.deployApp(ApplicationClient.java:449)
	at co.cask.cdap.client.ApplicationClient.deploy(ApplicationClient.java:377)
	at co.cask.cdap.client.ApplicationClient.deploy(ApplicationClient.java:353)
	at co.cask.cdap.test.IntegrationTestManager.deployApplication(IntegrationTestManager.java:183)
	at co.cask.cdap.test.AbstractTestManager.deployApplication(AbstractTestManager.java:43)
	at co.cask.cdap.test.IntegrationTestBase.deployApplication(IntegrationTestBase.java:374)
(2 more lines...)
Collapse Failed ApplicationTest test History
Distro Tests - CDH 5.6 26 secs
java.lang.RuntimeException: java.io.IOException: co.cask.cdap.api.flow.Flow
	at co.cask.cdap.client.util.RESTClient.upload(RESTClient.java:160)
	at co.cask.cdap.client.ApplicationClient.deployApp(ApplicationClient.java:449)
	at co.cask.cdap.client.ApplicationClient.deploy(ApplicationClient.java:377)
	at co.cask.cdap.client.ApplicationClient.deploy(ApplicationClient.java:353)
	at co.cask.cdap.test.IntegrationTestManager.deployApplication(IntegrationTestManager.java:183)
	at co.cask.cdap.test.AbstractTestManager.deployApplication(AbstractTestManager.java:43)
	at co.cask.cdap.test.IntegrationTestBase.deployApplication(IntegrationTestBase.java:374)
(2 more lines...)
Collapse Failed ApplicationTest test History
Distro Tests - CDH 5.7 42 secs
java.lang.RuntimeException: java.io.IOException: co.cask.cdap.api.flow.Flow
	at co.cask.cdap.client.util.RESTClient.upload(RESTClient.java:160)
	at co.cask.cdap.client.ApplicationClient.deployApp(ApplicationClient.java:449)
	at co.cask.cdap.client.ApplicationClient.deploy(ApplicationClient.java:377)
	at co.cask.cdap.client.ApplicationClient.deploy(ApplicationClient.java:353)
	at co.cask.cdap.test.IntegrationTestManager.deployApplication(IntegrationTestManager.java:183)
	at co.cask.cdap.test.AbstractTestManager.deployApplication(AbstractTestManager.java:43)
	at co.cask.cdap.test.IntegrationTestBase.deployApplication(IntegrationTestBase.java:374)
(2 more lines...)
Collapse Failed ApplicationTest test History
Distro Tests - CDH 5.8 35 secs
java.lang.RuntimeException: java.io.IOException: co.cask.cdap.api.flow.Flow
	at co.cask.cdap.client.util.RESTClient.upload(RESTClient.java:160)
	at co.cask.cdap.client.ApplicationClient.deployApp(ApplicationClient.java:449)
	at co.cask.cdap.client.ApplicationClient.deploy(ApplicationClient.java:377)
	at co.cask.cdap.client.ApplicationClient.deploy(ApplicationClient.java:353)
	at co.cask.cdap.test.IntegrationTestManager.deployApplication(IntegrationTestManager.java:183)
	at co.cask.cdap.test.AbstractTestManager.deployApplication(AbstractTestManager.java:43)
	at co.cask.cdap.test.IntegrationTestBase.deployApplication(IntegrationTestBase.java:374)
(2 more lines...)
Collapse Failed ApplicationTest test History
Distro Tests - CDH 5.9 34 secs
java.lang.RuntimeException: java.io.IOException: co.cask.cdap.api.flow.Flow
	at co.cask.cdap.client.util.RESTClient.upload(RESTClient.java:160)
	at co.cask.cdap.client.ApplicationClient.deployApp(ApplicationClient.java:449)
	at co.cask.cdap.client.ApplicationClient.deploy(ApplicationClient.java:377)
	at co.cask.cdap.client.ApplicationClient.deploy(ApplicationClient.java:353)
	at co.cask.cdap.test.IntegrationTestManager.deployApplication(IntegrationTestManager.java:183)
	at co.cask.cdap.test.AbstractTestManager.deployApplication(AbstractTestManager.java:43)
	at co.cask.cdap.test.IntegrationTestBase.deployApplication(IntegrationTestBase.java:374)
(2 more lines...)
Collapse Failed ApplicationTest test History
Distro Tests - HDP 2.2 31 secs
java.lang.RuntimeException: java.io.IOException: co.cask.cdap.api.flow.Flow
	at co.cask.cdap.client.util.RESTClient.upload(RESTClient.java:160)
	at co.cask.cdap.client.ApplicationClient.deployApp(ApplicationClient.java:449)
	at co.cask.cdap.client.ApplicationClient.deploy(ApplicationClient.java:377)
	at co.cask.cdap.client.ApplicationClient.deploy(ApplicationClient.java:353)
	at co.cask.cdap.test.IntegrationTestManager.deployApplication(IntegrationTestManager.java:183)
	at co.cask.cdap.test.AbstractTestManager.deployApplication(AbstractTestManager.java:43)
	at co.cask.cdap.test.IntegrationTestBase.deployApplication(IntegrationTestBase.java:374)
(2 more lines...)
Collapse Failed ApplicationTest test History
Distro Tests - HDP 2.3 8 secs
java.lang.RuntimeException: java.io.IOException: co.cask.cdap.api.flow.Flow
	at co.cask.cdap.client.util.RESTClient.upload(RESTClient.java:160)
	at co.cask.cdap.client.ApplicationClient.deployApp(ApplicationClient.java:449)
	at co.cask.cdap.client.ApplicationClient.deploy(ApplicationClient.java:377)
	at co.cask.cdap.client.ApplicationClient.deploy(ApplicationClient.java:353)
	at co.cask.cdap.test.IntegrationTestManager.deployApplication(IntegrationTestManager.java:183)
	at co.cask.cdap.test.AbstractTestManager.deployApplication(AbstractTestManager.java:43)
	at co.cask.cdap.test.IntegrationTestBase.deployApplication(IntegrationTestBase.java:374)
(2 more lines...)
Collapse Failed ApplicationTest test History
Distro Tests - HDP 2.4 41 secs
java.lang.RuntimeException: java.io.IOException: co.cask.cdap.api.flow.Flow
	at co.cask.cdap.client.util.RESTClient.upload(RESTClient.java:160)
	at co.cask.cdap.client.ApplicationClient.deployApp(ApplicationClient.java:449)
	at co.cask.cdap.client.ApplicationClient.deploy(ApplicationClient.java:377)
	at co.cask.cdap.client.ApplicationClient.deploy(ApplicationClient.java:353)
	at co.cask.cdap.test.IntegrationTestManager.deployApplication(IntegrationTestManager.java:183)
	at co.cask.cdap.test.AbstractTestManager.deployApplication(AbstractTestManager.java:43)
	at co.cask.cdap.test.IntegrationTestBase.deployApplication(IntegrationTestBase.java:374)
(2 more lines...)
Collapse Failed ApplicationTest test History
Distro Tests - HDP 2.5 56 secs
java.lang.RuntimeException: java.io.IOException: co.cask.cdap.api.flow.Flow
	at co.cask.cdap.client.util.RESTClient.upload(RESTClient.java:160)
	at co.cask.cdap.client.ApplicationClient.deployApp(ApplicationClient.java:449)
	at co.cask.cdap.client.ApplicationClient.deploy(ApplicationClient.java:377)
	at co.cask.cdap.client.ApplicationClient.deploy(ApplicationClient.java:353)
	at co.cask.cdap.test.IntegrationTestManager.deployApplication(IntegrationTestManager.java:183)
	at co.cask.cdap.test.AbstractTestManager.deployApplication(AbstractTestManager.java:43)
	at co.cask.cdap.test.IntegrationTestBase.deployApplication(IntegrationTestBase.java:374)
(2 more lines...)
Collapse Failed ApplicationTest test History
Distro Tests - HDP 2.6 25 secs
java.lang.RuntimeException: java.io.IOException: co.cask.cdap.api.flow.Flow
	at co.cask.cdap.client.util.RESTClient.upload(RESTClient.java:160)
	at co.cask.cdap.client.ApplicationClient.deployApp(ApplicationClient.java:449)
	at co.cask.cdap.client.ApplicationClient.deploy(ApplicationClient.java:377)
	at co.cask.cdap.client.ApplicationClient.deploy(ApplicationClient.java:353)
	at co.cask.cdap.test.IntegrationTestManager.deployApplication(IntegrationTestManager.java:183)
	at co.cask.cdap.test.AbstractTestManager.deployApplication(AbstractTestManager.java:43)
	at co.cask.cdap.test.IntegrationTestBase.deployApplication(IntegrationTestBase.java:374)
(2 more lines...)
Collapse Failed ApplicationTest test History
Distro Tests - MapR 5.0 21 secs
java.lang.RuntimeException: java.io.IOException: co.cask.cdap.api.flow.Flow
	at co.cask.cdap.client.util.RESTClient.upload(RESTClient.java:160)
	at co.cask.cdap.client.ApplicationClient.deployApp(ApplicationClient.java:449)
	at co.cask.cdap.client.ApplicationClient.deploy(ApplicationClient.java:377)
	at co.cask.cdap.client.ApplicationClient.deploy(ApplicationClient.java:353)
	at co.cask.cdap.test.IntegrationTestManager.deployApplication(IntegrationTestManager.java:183)
	at co.cask.cdap.test.AbstractTestManager.deployApplication(AbstractTestManager.java:43)
	at co.cask.cdap.test.IntegrationTestBase.deployApplication(IntegrationTestBase.java:374)
(2 more lines...)
Collapse Failed DatasetTest test History
Distro Tests - CDH 5.10 2 secs
java.lang.RuntimeException: java.io.IOException: co.cask.cdap.api.flow.Flow
	at co.cask.cdap.client.util.RESTClient.upload(RESTClient.java:160)
	at co.cask.cdap.client.ApplicationClient.deployApp(ApplicationClient.java:449)
	at co.cask.cdap.client.ApplicationClient.deploy(ApplicationClient.java:377)
	at co.cask.cdap.client.ApplicationClient.deploy(ApplicationClient.java:353)
	at co.cask.cdap.test.IntegrationTestManager.deployApplication(IntegrationTestManager.java:183)
	at co.cask.cdap.test.AbstractTestManager.deployApplication(AbstractTestManager.java:43)
	at co.cask.cdap.test.IntegrationTestBase.deployApplication(IntegrationTestBase.java:374)
(2 more lines...)
Collapse Failed DatasetTest test History
Distro Tests - CDH 5.11 2 secs
java.lang.RuntimeException: java.io.IOException: co.cask.cdap.api.flow.Flow
	at co.cask.cdap.client.util.RESTClient.upload(RESTClient.java:160)
	at co.cask.cdap.client.ApplicationClient.deployApp(ApplicationClient.java:449)
	at co.cask.cdap.client.ApplicationClient.deploy(ApplicationClient.java:377)
	at co.cask.cdap.client.ApplicationClient.deploy(ApplicationClient.java:353)
	at co.cask.cdap.test.IntegrationTestManager.deployApplication(IntegrationTestManager.java:183)
	at co.cask.cdap.test.AbstractTestManager.deployApplication(AbstractTestManager.java:43)
	at co.cask.cdap.test.IntegrationTestBase.deployApplication(IntegrationTestBase.java:374)
(2 more lines...)
Collapse Failed DatasetTest test History
Distro Tests - CDH 5.12 2 secs
java.lang.RuntimeException: java.io.IOException: co.cask.cdap.api.flow.Flow
	at co.cask.cdap.client.util.RESTClient.upload(RESTClient.java:160)
	at co.cask.cdap.client.ApplicationClient.deployApp(ApplicationClient.java:449)
	at co.cask.cdap.client.ApplicationClient.deploy(ApplicationClient.java:377)
	at co.cask.cdap.client.ApplicationClient.deploy(ApplicationClient.java:353)
	at co.cask.cdap.test.IntegrationTestManager.deployApplication(IntegrationTestManager.java:183)
	at co.cask.cdap.test.AbstractTestManager.deployApplication(AbstractTestManager.java:43)
	at co.cask.cdap.test.IntegrationTestBase.deployApplication(IntegrationTestBase.java:374)
(2 more lines...)
Collapse Failed DatasetTest test History
Distro Tests - CDH 5.13 2 secs
java.lang.RuntimeException: java.io.IOException: co.cask.cdap.api.flow.Flow
	at co.cask.cdap.client.util.RESTClient.upload(RESTClient.java:160)
	at co.cask.cdap.client.ApplicationClient.deployApp(ApplicationClient.java:449)
	at co.cask.cdap.client.ApplicationClient.deploy(ApplicationClient.java:377)
	at co.cask.cdap.client.ApplicationClient.deploy(ApplicationClient.java:353)
	at co.cask.cdap.test.IntegrationTestManager.deployApplication(IntegrationTestManager.java:183)
	at co.cask.cdap.test.AbstractTestManager.deployApplication(AbstractTestManager.java:43)
	at co.cask.cdap.test.IntegrationTestBase.deployApplication(IntegrationTestBase.java:374)
(2 more lines...)
Collapse Failed DatasetTest test History
Distro Tests - CDH 5.4 2 secs
java.lang.RuntimeException: java.io.IOException: co.cask.cdap.api.flow.Flow
	at co.cask.cdap.client.util.RESTClient.upload(RESTClient.java:160)
	at co.cask.cdap.client.ApplicationClient.deployApp(ApplicationClient.java:449)
	at co.cask.cdap.client.ApplicationClient.deploy(ApplicationClient.java:377)
	at co.cask.cdap.client.ApplicationClient.deploy(ApplicationClient.java:353)
	at co.cask.cdap.test.IntegrationTestManager.deployApplication(IntegrationTestManager.java:183)
	at co.cask.cdap.test.AbstractTestManager.deployApplication(AbstractTestManager.java:43)
	at co.cask.cdap.test.IntegrationTestBase.deployApplication(IntegrationTestBase.java:374)
(2 more lines...)
Collapse Failed DatasetTest test History
Distro Tests - CDH 5.5 2 secs
java.lang.RuntimeException: java.io.IOException: co.cask.cdap.api.flow.Flow
	at co.cask.cdap.client.util.RESTClient.upload(RESTClient.java:160)
	at co.cask.cdap.client.ApplicationClient.deployApp(ApplicationClient.java:449)
	at co.cask.cdap.client.ApplicationClient.deploy(ApplicationClient.java:377)
	at co.cask.cdap.client.ApplicationClient.deploy(ApplicationClient.java:353)
	at co.cask.cdap.test.IntegrationTestManager.deployApplication(IntegrationTestManager.java:183)
	at co.cask.cdap.test.AbstractTestManager.deployApplication(AbstractTestManager.java:43)
	at co.cask.cdap.test.IntegrationTestBase.deployApplication(IntegrationTestBase.java:374)
(2 more lines...)
Collapse Failed DatasetTest test History
Distro Tests - CDH 5.6 2 secs
java.lang.RuntimeException: java.io.IOException: co.cask.cdap.api.flow.Flow
	at co.cask.cdap.client.util.RESTClient.upload(RESTClient.java:160)
	at co.cask.cdap.client.ApplicationClient.deployApp(ApplicationClient.java:449)
	at co.cask.cdap.client.ApplicationClient.deploy(ApplicationClient.java:377)
	at co.cask.cdap.client.ApplicationClient.deploy(ApplicationClient.java:353)
	at co.cask.cdap.test.IntegrationTestManager.deployApplication(IntegrationTestManager.java:183)
	at co.cask.cdap.test.AbstractTestManager.deployApplication(AbstractTestManager.java:43)
	at co.cask.cdap.test.IntegrationTestBase.deployApplication(IntegrationTestBase.java:374)
(2 more lines...)
Collapse Failed DatasetTest test History
Distro Tests - CDH 5.7 2 secs
java.lang.RuntimeException: java.io.IOException: co.cask.cdap.api.flow.Flow
	at co.cask.cdap.client.util.RESTClient.upload(RESTClient.java:160)
	at co.cask.cdap.client.ApplicationClient.deployApp(ApplicationClient.java:449)
	at co.cask.cdap.client.ApplicationClient.deploy(ApplicationClient.java:377)
	at co.cask.cdap.client.ApplicationClient.deploy(ApplicationClient.java:353)
	at co.cask.cdap.test.IntegrationTestManager.deployApplication(IntegrationTestManager.java:183)
	at co.cask.cdap.test.AbstractTestManager.deployApplication(AbstractTestManager.java:43)
	at co.cask.cdap.test.IntegrationTestBase.deployApplication(IntegrationTestBase.java:374)
(2 more lines...)
Collapse Failed DatasetTest test History
Distro Tests - CDH 5.8 2 secs
java.lang.RuntimeException: java.io.IOException: co.cask.cdap.api.flow.Flow
	at co.cask.cdap.client.util.RESTClient.upload(RESTClient.java:160)
	at co.cask.cdap.client.ApplicationClient.deployApp(ApplicationClient.java:449)
	at co.cask.cdap.client.ApplicationClient.deploy(ApplicationClient.java:377)
	at co.cask.cdap.client.ApplicationClient.deploy(ApplicationClient.java:353)
	at co.cask.cdap.test.IntegrationTestManager.deployApplication(IntegrationTestManager.java:183)
	at co.cask.cdap.test.AbstractTestManager.deployApplication(AbstractTestManager.java:43)
	at co.cask.cdap.test.IntegrationTestBase.deployApplication(IntegrationTestBase.java:374)
(2 more lines...)
Collapse Failed DatasetTest test History
Distro Tests - CDH 5.9 2 secs
java.lang.RuntimeException: java.io.IOException: co.cask.cdap.api.flow.Flow
	at co.cask.cdap.client.util.RESTClient.upload(RESTClient.java:160)
	at co.cask.cdap.client.ApplicationClient.deployApp(ApplicationClient.java:449)
	at co.cask.cdap.client.ApplicationClient.deploy(ApplicationClient.java:377)
	at co.cask.cdap.client.ApplicationClient.deploy(ApplicationClient.java:353)
	at co.cask.cdap.test.IntegrationTestManager.deployApplication(IntegrationTestManager.java:183)
	at co.cask.cdap.test.AbstractTestManager.deployApplication(AbstractTestManager.java:43)
	at co.cask.cdap.test.IntegrationTestBase.deployApplication(IntegrationTestBase.java:374)
(2 more lines...)
Collapse Failed DatasetTest test History
Distro Tests - HDP 2.3 2 secs
java.lang.RuntimeException: java.io.IOException: co.cask.cdap.api.flow.Flow
	at co.cask.cdap.client.util.RESTClient.upload(RESTClient.java:160)
	at co.cask.cdap.client.ApplicationClient.deployApp(ApplicationClient.java:449)
	at co.cask.cdap.client.ApplicationClient.deploy(ApplicationClient.java:377)
	at co.cask.cdap.client.ApplicationClient.deploy(ApplicationClient.java:353)
	at co.cask.cdap.test.IntegrationTestManager.deployApplication(IntegrationTestManager.java:183)
	at co.cask.cdap.test.AbstractTestManager.deployApplication(AbstractTestManager.java:43)
	at co.cask.cdap.test.IntegrationTestBase.deployApplication(IntegrationTestBase.java:374)
(2 more lines...)
Collapse Failed DatasetTest test History
Distro Tests - HDP 2.4 2 secs
java.lang.RuntimeException: java.io.IOException: co.cask.cdap.api.flow.Flow
	at co.cask.cdap.client.util.RESTClient.upload(RESTClient.java:160)
	at co.cask.cdap.client.ApplicationClient.deployApp(ApplicationClient.java:449)
	at co.cask.cdap.client.ApplicationClient.deploy(ApplicationClient.java:377)
	at co.cask.cdap.client.ApplicationClient.deploy(ApplicationClient.java:353)
	at co.cask.cdap.test.IntegrationTestManager.deployApplication(IntegrationTestManager.java:183)
	at co.cask.cdap.test.AbstractTestManager.deployApplication(AbstractTestManager.java:43)
	at co.cask.cdap.test.IntegrationTestBase.deployApplication(IntegrationTestBase.java:374)
(2 more lines...)
Collapse Failed DatasetTest test History
Distro Tests - HDP 2.5 2 secs
java.lang.RuntimeException: java.io.IOException: co.cask.cdap.api.flow.Flow
	at co.cask.cdap.client.util.RESTClient.upload(RESTClient.java:160)
	at co.cask.cdap.client.ApplicationClient.deployApp(ApplicationClient.java:449)
	at co.cask.cdap.client.ApplicationClient.deploy(ApplicationClient.java:377)
	at co.cask.cdap.client.ApplicationClient.deploy(ApplicationClient.java:353)
	at co.cask.cdap.test.IntegrationTestManager.deployApplication(IntegrationTestManager.java:183)
	at co.cask.cdap.test.AbstractTestManager.deployApplication(AbstractTestManager.java:43)
	at co.cask.cdap.test.IntegrationTestBase.deployApplication(IntegrationTestBase.java:374)
(2 more lines...)
Collapse Failed DatasetTest test History
Distro Tests - HDP 2.6 2 secs
java.lang.RuntimeException: java.io.IOException: co.cask.cdap.api.flow.Flow
	at co.cask.cdap.client.util.RESTClient.upload(RESTClient.java:160)
	at co.cask.cdap.client.ApplicationClient.deployApp(ApplicationClient.java:449)
	at co.cask.cdap.client.ApplicationClient.deploy(ApplicationClient.java:377)
	at co.cask.cdap.client.ApplicationClient.deploy(ApplicationClient.java:353)
	at co.cask.cdap.test.IntegrationTestManager.deployApplication(IntegrationTestManager.java:183)
	at co.cask.cdap.test.AbstractTestManager.deployApplication(AbstractTestManager.java:43)
	at co.cask.cdap.test.IntegrationTestBase.deployApplication(IntegrationTestBase.java:374)
(2 more lines...)
Collapse Failed DatasetTest test History
Distro Tests - MapR 5.0 2 secs
java.lang.RuntimeException: java.io.IOException: co.cask.cdap.api.flow.Flow
	at co.cask.cdap.client.util.RESTClient.upload(RESTClient.java:160)
	at co.cask.cdap.client.ApplicationClient.deployApp(ApplicationClient.java:449)
	at co.cask.cdap.client.ApplicationClient.deploy(ApplicationClient.java:377)
	at co.cask.cdap.client.ApplicationClient.deploy(ApplicationClient.java:353)
	at co.cask.cdap.test.IntegrationTestManager.deployApplication(IntegrationTestManager.java:183)
	at co.cask.cdap.test.AbstractTestManager.deployApplication(AbstractTestManager.java:43)
	at co.cask.cdap.test.IntegrationTestBase.deployApplication(IntegrationTestBase.java:374)
(2 more lines...)
Collapse Failed ExploreTest test History
Distro Tests - CDH 5.10 3 secs
java.lang.RuntimeException: java.io.IOException: co.cask.cdap.api.flow.Flow
	at co.cask.cdap.client.util.RESTClient.upload(RESTClient.java:160)
	at co.cask.cdap.client.ApplicationClient.deployApp(ApplicationClient.java:449)
	at co.cask.cdap.client.ApplicationClient.deploy(ApplicationClient.java:377)
	at co.cask.cdap.client.ApplicationClient.deploy(ApplicationClient.java:353)
	at co.cask.cdap.test.IntegrationTestManager.deployApplication(IntegrationTestManager.java:183)
	at co.cask.cdap.test.AbstractTestManager.deployApplication(AbstractTestManager.java:43)
	at co.cask.cdap.test.IntegrationTestBase.deployApplication(IntegrationTestBase.java:374)
(3 more lines...)
Collapse Failed ExploreTest testSubqueryInWhereClause History
Distro Tests - CDH 5.10 3 secs
java.lang.RuntimeException: java.io.IOException: co.cask.cdap.api.flow.Flow
	at co.cask.cdap.client.util.RESTClient.upload(RESTClient.java:160)
	at co.cask.cdap.client.ApplicationClient.deployApp(ApplicationClient.java:449)
	at co.cask.cdap.client.ApplicationClient.deploy(ApplicationClient.java:377)
	at co.cask.cdap.client.ApplicationClient.deploy(ApplicationClient.java:353)
	at co.cask.cdap.test.IntegrationTestManager.deployApplication(IntegrationTestManager.java:183)
	at co.cask.cdap.test.AbstractTestManager.deployApplication(AbstractTestManager.java:43)
	at co.cask.cdap.test.IntegrationTestBase.deployApplication(IntegrationTestBase.java:374)
(3 more lines...)
Collapse Failed ExploreTest test History
Distro Tests - CDH 5.11 3 secs
java.lang.RuntimeException: java.io.IOException: co.cask.cdap.api.flow.Flow
	at co.cask.cdap.client.util.RESTClient.upload(RESTClient.java:160)
	at co.cask.cdap.client.ApplicationClient.deployApp(ApplicationClient.java:449)
	at co.cask.cdap.client.ApplicationClient.deploy(ApplicationClient.java:377)
	at co.cask.cdap.client.ApplicationClient.deploy(ApplicationClient.java:353)
	at co.cask.cdap.test.IntegrationTestManager.deployApplication(IntegrationTestManager.java:183)
	at co.cask.cdap.test.AbstractTestManager.deployApplication(AbstractTestManager.java:43)
	at co.cask.cdap.test.IntegrationTestBase.deployApplication(IntegrationTestBase.java:374)
(3 more lines...)
Collapse Failed ExploreTest testSubqueryInWhereClause History
Distro Tests - CDH 5.11 3 secs
java.lang.RuntimeException: java.io.IOException: co.cask.cdap.api.flow.Flow
	at co.cask.cdap.client.util.RESTClient.upload(RESTClient.java:160)
	at co.cask.cdap.client.ApplicationClient.deployApp(ApplicationClient.java:449)
	at co.cask.cdap.client.ApplicationClient.deploy(ApplicationClient.java:377)
	at co.cask.cdap.client.ApplicationClient.deploy(ApplicationClient.java:353)
	at co.cask.cdap.test.IntegrationTestManager.deployApplication(IntegrationTestManager.java:183)
	at co.cask.cdap.test.AbstractTestManager.deployApplication(AbstractTestManager.java:43)
	at co.cask.cdap.test.IntegrationTestBase.deployApplication(IntegrationTestBase.java:374)
(3 more lines...)
Collapse Failed ExploreTest test History
Distro Tests - CDH 5.12 3 secs
java.lang.RuntimeException: java.io.IOException: co.cask.cdap.api.flow.Flow
	at co.cask.cdap.client.util.RESTClient.upload(RESTClient.java:160)
	at co.cask.cdap.client.ApplicationClient.deployApp(ApplicationClient.java:449)
	at co.cask.cdap.client.ApplicationClient.deploy(ApplicationClient.java:377)
	at co.cask.cdap.client.ApplicationClient.deploy(ApplicationClient.java:353)
	at co.cask.cdap.test.IntegrationTestManager.deployApplication(IntegrationTestManager.java:183)
	at co.cask.cdap.test.AbstractTestManager.deployApplication(AbstractTestManager.java:43)
	at co.cask.cdap.test.IntegrationTestBase.deployApplication(IntegrationTestBase.java:374)
(3 more lines...)
Collapse Failed ExploreTest testSubqueryInWhereClause History
Distro Tests - CDH 5.12 3 secs
java.lang.RuntimeException: java.io.IOException: co.cask.cdap.api.flow.Flow
	at co.cask.cdap.client.util.RESTClient.upload(RESTClient.java:160)
	at co.cask.cdap.client.ApplicationClient.deployApp(ApplicationClient.java:449)
	at co.cask.cdap.client.ApplicationClient.deploy(ApplicationClient.java:377)
	at co.cask.cdap.client.ApplicationClient.deploy(ApplicationClient.java:353)
	at co.cask.cdap.test.IntegrationTestManager.deployApplication(IntegrationTestManager.java:183)
	at co.cask.cdap.test.AbstractTestManager.deployApplication(AbstractTestManager.java:43)
	at co.cask.cdap.test.IntegrationTestBase.deployApplication(IntegrationTestBase.java:374)
(3 more lines...)
Collapse Failed ExploreTest test History
Distro Tests - CDH 5.13 3 secs
java.lang.RuntimeException: java.io.IOException: co.cask.cdap.api.flow.Flow
	at co.cask.cdap.client.util.RESTClient.upload(RESTClient.java:160)
	at co.cask.cdap.client.ApplicationClient.deployApp(ApplicationClient.java:449)
	at co.cask.cdap.client.ApplicationClient.deploy(ApplicationClient.java:377)
	at co.cask.cdap.client.ApplicationClient.deploy(ApplicationClient.java:353)
	at co.cask.cdap.test.IntegrationTestManager.deployApplication(IntegrationTestManager.java:183)
	at co.cask.cdap.test.AbstractTestManager.deployApplication(AbstractTestManager.java:43)
	at co.cask.cdap.test.IntegrationTestBase.deployApplication(IntegrationTestBase.java:374)
(3 more lines...)
Collapse Failed ExploreTest testSubqueryInWhereClause History
Distro Tests - CDH 5.13 3 secs
java.lang.RuntimeException: java.io.IOException: co.cask.cdap.api.flow.Flow
	at co.cask.cdap.client.util.RESTClient.upload(RESTClient.java:160)
	at co.cask.cdap.client.ApplicationClient.deployApp(ApplicationClient.java:449)
	at co.cask.cdap.client.ApplicationClient.deploy(ApplicationClient.java:377)
	at co.cask.cdap.client.ApplicationClient.deploy(ApplicationClient.java:353)
	at co.cask.cdap.test.IntegrationTestManager.deployApplication(IntegrationTestManager.java:183)
	at co.cask.cdap.test.AbstractTestManager.deployApplication(AbstractTestManager.java:43)
	at co.cask.cdap.test.IntegrationTestBase.deployApplication(IntegrationTestBase.java:374)
(3 more lines...)
Collapse Failed ExploreTest test History
Distro Tests - CDH 5.4 3 secs
java.lang.RuntimeException: java.io.IOException: co.cask.cdap.api.flow.Flow
	at co.cask.cdap.client.util.RESTClient.upload(RESTClient.java:160)
	at co.cask.cdap.client.ApplicationClient.deployApp(ApplicationClient.java:449)
	at co.cask.cdap.client.ApplicationClient.deploy(ApplicationClient.java:377)
	at co.cask.cdap.client.ApplicationClient.deploy(ApplicationClient.java:353)
	at co.cask.cdap.test.IntegrationTestManager.deployApplication(IntegrationTestManager.java:183)
	at co.cask.cdap.test.AbstractTestManager.deployApplication(AbstractTestManager.java:43)
	at co.cask.cdap.test.IntegrationTestBase.deployApplication(IntegrationTestBase.java:374)
(3 more lines...)
Collapse Failed ExploreTest testSubqueryInWhereClause History
Distro Tests - CDH 5.4 3 secs
java.lang.RuntimeException: java.io.IOException: co.cask.cdap.api.flow.Flow
	at co.cask.cdap.client.util.RESTClient.upload(RESTClient.java:160)
	at co.cask.cdap.client.ApplicationClient.deployApp(ApplicationClient.java:449)
	at co.cask.cdap.client.ApplicationClient.deploy(ApplicationClient.java:377)
	at co.cask.cdap.client.ApplicationClient.deploy(ApplicationClient.java:353)
	at co.cask.cdap.test.IntegrationTestManager.deployApplication(IntegrationTestManager.java:183)
	at co.cask.cdap.test.AbstractTestManager.deployApplication(AbstractTestManager.java:43)
	at co.cask.cdap.test.IntegrationTestBase.deployApplication(IntegrationTestBase.java:374)
(3 more lines...)
Collapse Failed ExploreTest test History
Distro Tests - CDH 5.5 3 secs
java.lang.RuntimeException: java.io.IOException: co.cask.cdap.api.flow.Flow
	at co.cask.cdap.client.util.RESTClient.upload(RESTClient.java:160)
	at co.cask.cdap.client.ApplicationClient.deployApp(ApplicationClient.java:449)
	at co.cask.cdap.client.ApplicationClient.deploy(ApplicationClient.java:377)
	at co.cask.cdap.client.ApplicationClient.deploy(ApplicationClient.java:353)
	at co.cask.cdap.test.IntegrationTestManager.deployApplication(IntegrationTestManager.java:183)
	at co.cask.cdap.test.AbstractTestManager.deployApplication(AbstractTestManager.java:43)
	at co.cask.cdap.test.IntegrationTestBase.deployApplication(IntegrationTestBase.java:374)
(3 more lines...)
Collapse Failed ExploreTest testSubqueryInWhereClause History
Distro Tests - CDH 5.5 3 secs
java.lang.RuntimeException: java.io.IOException: co.cask.cdap.api.flow.Flow
	at co.cask.cdap.client.util.RESTClient.upload(RESTClient.java:160)
	at co.cask.cdap.client.ApplicationClient.deployApp(ApplicationClient.java:449)
	at co.cask.cdap.client.ApplicationClient.deploy(ApplicationClient.java:377)
	at co.cask.cdap.client.ApplicationClient.deploy(ApplicationClient.java:353)
	at co.cask.cdap.test.IntegrationTestManager.deployApplication(IntegrationTestManager.java:183)
	at co.cask.cdap.test.AbstractTestManager.deployApplication(AbstractTestManager.java:43)
	at co.cask.cdap.test.IntegrationTestBase.deployApplication(IntegrationTestBase.java:374)
(3 more lines...)
Collapse Failed ExploreTest test History
Distro Tests - CDH 5.6 3 secs
java.lang.RuntimeException: java.io.IOException: co.cask.cdap.api.flow.Flow
	at co.cask.cdap.client.util.RESTClient.upload(RESTClient.java:160)
	at co.cask.cdap.client.ApplicationClient.deployApp(ApplicationClient.java:449)
	at co.cask.cdap.client.ApplicationClient.deploy(ApplicationClient.java:377)
	at co.cask.cdap.client.ApplicationClient.deploy(ApplicationClient.java:353)
	at co.cask.cdap.test.IntegrationTestManager.deployApplication(IntegrationTestManager.java:183)
	at co.cask.cdap.test.AbstractTestManager.deployApplication(AbstractTestManager.java:43)
	at co.cask.cdap.test.IntegrationTestBase.deployApplication(IntegrationTestBase.java:374)
(3 more lines...)
Collapse Failed ExploreTest testSubqueryInWhereClause History
Distro Tests - CDH 5.6 3 secs
java.lang.RuntimeException: java.io.IOException: co.cask.cdap.api.flow.Flow
	at co.cask.cdap.client.util.RESTClient.upload(RESTClient.java:160)
	at co.cask.cdap.client.ApplicationClient.deployApp(ApplicationClient.java:449)
	at co.cask.cdap.client.ApplicationClient.deploy(ApplicationClient.java:377)
	at co.cask.cdap.client.ApplicationClient.deploy(ApplicationClient.java:353)
	at co.cask.cdap.test.IntegrationTestManager.deployApplication(IntegrationTestManager.java:183)
	at co.cask.cdap.test.AbstractTestManager.deployApplication(AbstractTestManager.java:43)
	at co.cask.cdap.test.IntegrationTestBase.deployApplication(IntegrationTestBase.java:374)
(3 more lines...)
Collapse Failed ExploreTest test History
Distro Tests - CDH 5.7 3 secs
java.lang.RuntimeException: java.io.IOException: co.cask.cdap.api.flow.Flow
	at co.cask.cdap.client.util.RESTClient.upload(RESTClient.java:160)
	at co.cask.cdap.client.ApplicationClient.deployApp(ApplicationClient.java:449)
	at co.cask.cdap.client.ApplicationClient.deploy(ApplicationClient.java:377)
	at co.cask.cdap.client.ApplicationClient.deploy(ApplicationClient.java:353)
	at co.cask.cdap.test.IntegrationTestManager.deployApplication(IntegrationTestManager.java:183)
	at co.cask.cdap.test.AbstractTestManager.deployApplication(AbstractTestManager.java:43)
	at co.cask.cdap.test.IntegrationTestBase.deployApplication(IntegrationTestBase.java:374)
(3 more lines...)
Collapse Failed ExploreTest testSubqueryInWhereClause History
Distro Tests - CDH 5.7 3 secs
java.lang.RuntimeException: java.io.IOException: co.cask.cdap.api.flow.Flow
	at co.cask.cdap.client.util.RESTClient.upload(RESTClient.java:160)
	at co.cask.cdap.client.ApplicationClient.deployApp(ApplicationClient.java:449)
	at co.cask.cdap.client.ApplicationClient.deploy(ApplicationClient.java:377)
	at co.cask.cdap.client.ApplicationClient.deploy(ApplicationClient.java:353)
	at co.cask.cdap.test.IntegrationTestManager.deployApplication(IntegrationTestManager.java:183)
	at co.cask.cdap.test.AbstractTestManager.deployApplication(AbstractTestManager.java:43)
	at co.cask.cdap.test.IntegrationTestBase.deployApplication(IntegrationTestBase.java:374)
(3 more lines...)
Collapse Failed ExploreTest test History
Distro Tests - CDH 5.8 3 secs
java.lang.RuntimeException: java.io.IOException: co.cask.cdap.api.flow.Flow
	at co.cask.cdap.client.util.RESTClient.upload(RESTClient.java:160)
	at co.cask.cdap.client.ApplicationClient.deployApp(ApplicationClient.java:449)
	at co.cask.cdap.client.ApplicationClient.deploy(ApplicationClient.java:377)
	at co.cask.cdap.client.ApplicationClient.deploy(ApplicationClient.java:353)
	at co.cask.cdap.test.IntegrationTestManager.deployApplication(IntegrationTestManager.java:183)
	at co.cask.cdap.test.AbstractTestManager.deployApplication(AbstractTestManager.java:43)
	at co.cask.cdap.test.IntegrationTestBase.deployApplication(IntegrationTestBase.java:374)
(3 more lines...)
Collapse Failed ExploreTest testSubqueryInWhereClause History
Distro Tests - CDH 5.8 3 secs
java.lang.RuntimeException: java.io.IOException: co.cask.cdap.api.flow.Flow
	at co.cask.cdap.client.util.RESTClient.upload(RESTClient.java:160)
	at co.cask.cdap.client.ApplicationClient.deployApp(ApplicationClient.java:449)
	at co.cask.cdap.client.ApplicationClient.deploy(ApplicationClient.java:377)
	at co.cask.cdap.client.ApplicationClient.deploy(ApplicationClient.java:353)
	at co.cask.cdap.test.IntegrationTestManager.deployApplication(IntegrationTestManager.java:183)
	at co.cask.cdap.test.AbstractTestManager.deployApplication(AbstractTestManager.java:43)
	at co.cask.cdap.test.IntegrationTestBase.deployApplication(IntegrationTestBase.java:374)
(3 more lines...)
Collapse Failed ExploreTest test History
Distro Tests - CDH 5.9 3 secs
java.lang.RuntimeException: java.io.IOException: co.cask.cdap.api.flow.Flow
	at co.cask.cdap.client.util.RESTClient.upload(RESTClient.java:160)
	at co.cask.cdap.client.ApplicationClient.deployApp(ApplicationClient.java:449)
	at co.cask.cdap.client.ApplicationClient.deploy(ApplicationClient.java:377)
	at co.cask.cdap.client.ApplicationClient.deploy(ApplicationClient.java:353)
	at co.cask.cdap.test.IntegrationTestManager.deployApplication(IntegrationTestManager.java:183)
	at co.cask.cdap.test.AbstractTestManager.deployApplication(AbstractTestManager.java:43)
	at co.cask.cdap.test.IntegrationTestBase.deployApplication(IntegrationTestBase.java:374)
(3 more lines...)
Collapse Failed ExploreTest testSubqueryInWhereClause History
Distro Tests - CDH 5.9 3 secs
java.lang.RuntimeException: java.io.IOException: co.cask.cdap.api.flow.Flow
	at co.cask.cdap.client.util.RESTClient.upload(RESTClient.java:160)
	at co.cask.cdap.client.ApplicationClient.deployApp(ApplicationClient.java:449)
	at co.cask.cdap.client.ApplicationClient.deploy(ApplicationClient.java:377)
	at co.cask.cdap.client.ApplicationClient.deploy(ApplicationClient.java:353)
	at co.cask.cdap.test.IntegrationTestManager.deployApplication(IntegrationTestManager.java:183)
	at co.cask.cdap.test.AbstractTestManager.deployApplication(AbstractTestManager.java:43)
	at co.cask.cdap.test.IntegrationTestBase.deployApplication(IntegrationTestBase.java:374)
(3 more lines...)
Collapse Failed ExploreTest test History
Distro Tests - HDP 2.2 3 secs
java.lang.RuntimeException: java.io.IOException: co.cask.cdap.api.flow.Flow
	at co.cask.cdap.client.util.RESTClient.upload(RESTClient.java:160)
	at co.cask.cdap.client.ApplicationClient.deployApp(ApplicationClient.java:449)
	at co.cask.cdap.client.ApplicationClient.deploy(ApplicationClient.java:377)
	at co.cask.cdap.client.ApplicationClient.deploy(ApplicationClient.java:353)
	at co.cask.cdap.test.IntegrationTestManager.deployApplication(IntegrationTestManager.java:183)
	at co.cask.cdap.test.AbstractTestManager.deployApplication(AbstractTestManager.java:43)
	at co.cask.cdap.test.IntegrationTestBase.deployApplication(IntegrationTestBase.java:374)
(3 more lines...)
Collapse Failed ExploreTest testSubqueryInWhereClause History
Distro Tests - HDP 2.2 3 secs
java.lang.RuntimeException: java.io.IOException: co.cask.cdap.api.flow.Flow
	at co.cask.cdap.client.util.RESTClient.upload(RESTClient.java:160)
	at co.cask.cdap.client.ApplicationClient.deployApp(ApplicationClient.java:449)
	at co.cask.cdap.client.ApplicationClient.deploy(ApplicationClient.java:377)
	at co.cask.cdap.client.ApplicationClient.deploy(ApplicationClient.java:353)
	at co.cask.cdap.test.IntegrationTestManager.deployApplication(IntegrationTestManager.java:183)
	at co.cask.cdap.test.AbstractTestManager.deployApplication(AbstractTestManager.java:43)
	at co.cask.cdap.test.IntegrationTestBase.deployApplication(IntegrationTestBase.java:374)
(3 more lines...)
Collapse Failed ExploreTest test History
Distro Tests - HDP 2.3 3 secs
java.lang.RuntimeException: java.io.IOException: co.cask.cdap.api.flow.Flow
	at co.cask.cdap.client.util.RESTClient.upload(RESTClient.java:160)
	at co.cask.cdap.client.ApplicationClient.deployApp(ApplicationClient.java:449)
	at co.cask.cdap.client.ApplicationClient.deploy(ApplicationClient.java:377)
	at co.cask.cdap.client.ApplicationClient.deploy(ApplicationClient.java:353)
	at co.cask.cdap.test.IntegrationTestManager.deployApplication(IntegrationTestManager.java:183)
	at co.cask.cdap.test.AbstractTestManager.deployApplication(AbstractTestManager.java:43)
	at co.cask.cdap.test.IntegrationTestBase.deployApplication(IntegrationTestBase.java:374)
(3 more lines...)
Collapse Failed ExploreTest testSubqueryInWhereClause History
Distro Tests - HDP 2.3 3 secs
java.lang.RuntimeException: java.io.IOException: co.cask.cdap.api.flow.Flow
	at co.cask.cdap.client.util.RESTClient.upload(RESTClient.java:160)
	at co.cask.cdap.client.ApplicationClient.deployApp(ApplicationClient.java:449)
	at co.cask.cdap.client.ApplicationClient.deploy(ApplicationClient.java:377)
	at co.cask.cdap.client.ApplicationClient.deploy(ApplicationClient.java:353)
	at co.cask.cdap.test.IntegrationTestManager.deployApplication(IntegrationTestManager.java:183)
	at co.cask.cdap.test.AbstractTestManager.deployApplication(AbstractTestManager.java:43)
	at co.cask.cdap.test.IntegrationTestBase.deployApplication(IntegrationTestBase.java:374)
(3 more lines...)
Collapse Failed ExploreTest test History
Distro Tests - HDP 2.4 3 secs
java.lang.RuntimeException: java.io.IOException: co.cask.cdap.api.flow.Flow
	at co.cask.cdap.client.util.RESTClient.upload(RESTClient.java:160)
	at co.cask.cdap.client.ApplicationClient.deployApp(ApplicationClient.java:449)
	at co.cask.cdap.client.ApplicationClient.deploy(ApplicationClient.java:377)
	at co.cask.cdap.client.ApplicationClient.deploy(ApplicationClient.java:353)
	at co.cask.cdap.test.IntegrationTestManager.deployApplication(IntegrationTestManager.java:183)
	at co.cask.cdap.test.AbstractTestManager.deployApplication(AbstractTestManager.java:43)
	at co.cask.cdap.test.IntegrationTestBase.deployApplication(IntegrationTestBase.java:374)
(3 more lines...)
Collapse Failed ExploreTest testSubqueryInWhereClause History
Distro Tests - HDP 2.4 3 secs
java.lang.RuntimeException: java.io.IOException: co.cask.cdap.api.flow.Flow
	at co.cask.cdap.client.util.RESTClient.upload(RESTClient.java:160)
	at co.cask.cdap.client.ApplicationClient.deployApp(ApplicationClient.java:449)
	at co.cask.cdap.client.ApplicationClient.deploy(ApplicationClient.java:377)
	at co.cask.cdap.client.ApplicationClient.deploy(ApplicationClient.java:353)
	at co.cask.cdap.test.IntegrationTestManager.deployApplication(IntegrationTestManager.java:183)
	at co.cask.cdap.test.AbstractTestManager.deployApplication(AbstractTestManager.java:43)
	at co.cask.cdap.test.IntegrationTestBase.deployApplication(IntegrationTestBase.java:374)
(3 more lines...)
Collapse Failed ExploreTest test History
Distro Tests - HDP 2.5 3 secs
java.lang.RuntimeException: java.io.IOException: co.cask.cdap.api.flow.Flow
	at co.cask.cdap.client.util.RESTClient.upload(RESTClient.java:160)
	at co.cask.cdap.client.ApplicationClient.deployApp(ApplicationClient.java:449)
	at co.cask.cdap.client.ApplicationClient.deploy(ApplicationClient.java:377)
	at co.cask.cdap.client.ApplicationClient.deploy(ApplicationClient.java:353)
	at co.cask.cdap.test.IntegrationTestManager.deployApplication(IntegrationTestManager.java:183)
	at co.cask.cdap.test.AbstractTestManager.deployApplication(AbstractTestManager.java:43)
	at co.cask.cdap.test.IntegrationTestBase.deployApplication(IntegrationTestBase.java:374)
(3 more lines...)
Collapse Failed ExploreTest testSubqueryInWhereClause History
Distro Tests - HDP 2.5 3 secs
java.lang.RuntimeException: java.io.IOException: co.cask.cdap.api.flow.Flow
	at co.cask.cdap.client.util.RESTClient.upload(RESTClient.java:160)
	at co.cask.cdap.client.ApplicationClient.deployApp(ApplicationClient.java:449)
	at co.cask.cdap.client.ApplicationClient.deploy(ApplicationClient.java:377)
	at co.cask.cdap.client.ApplicationClient.deploy(ApplicationClient.java:353)
	at co.cask.cdap.test.IntegrationTestManager.deployApplication(IntegrationTestManager.java:183)
	at co.cask.cdap.test.AbstractTestManager.deployApplication(AbstractTestManager.java:43)
	at co.cask.cdap.test.IntegrationTestBase.deployApplication(IntegrationTestBase.java:374)
(3 more lines...)
Collapse Failed ExploreTest test History
Distro Tests - HDP 2.6 3 secs
java.lang.RuntimeException: java.io.IOException: co.cask.cdap.api.flow.Flow
	at co.cask.cdap.client.util.RESTClient.upload(RESTClient.java:160)
	at co.cask.cdap.client.ApplicationClient.deployApp(ApplicationClient.java:449)
	at co.cask.cdap.client.ApplicationClient.deploy(ApplicationClient.java:377)
	at co.cask.cdap.client.ApplicationClient.deploy(ApplicationClient.java:353)
	at co.cask.cdap.test.IntegrationTestManager.deployApplication(IntegrationTestManager.java:183)
	at co.cask.cdap.test.AbstractTestManager.deployApplication(AbstractTestManager.java:43)
	at co.cask.cdap.test.IntegrationTestBase.deployApplication(IntegrationTestBase.java:374)
(3 more lines...)
Collapse Failed ExploreTest testSubqueryInWhereClause History
Distro Tests - HDP 2.6 3 secs
java.lang.RuntimeException: java.io.IOException: co.cask.cdap.api.flow.Flow
	at co.cask.cdap.client.util.RESTClient.upload(RESTClient.java:160)
	at co.cask.cdap.client.ApplicationClient.deployApp(ApplicationClient.java:449)
	at co.cask.cdap.client.ApplicationClient.deploy(ApplicationClient.java:377)
	at co.cask.cdap.client.ApplicationClient.deploy(ApplicationClient.java:353)
	at co.cask.cdap.test.IntegrationTestManager.deployApplication(IntegrationTestManager.java:183)
	at co.cask.cdap.test.AbstractTestManager.deployApplication(AbstractTestManager.java:43)
	at co.cask.cdap.test.IntegrationTestBase.deployApplication(IntegrationTestBase.java:374)
(3 more lines...)
Collapse Failed ExploreTest testSubqueryInWhereClause History
Distro Tests - MapR 5.0 3 secs
java.lang.RuntimeException: java.io.IOException: co.cask.cdap.api.flow.Flow
	at co.cask.cdap.client.util.RESTClient.upload(RESTClient.java:160)
	at co.cask.cdap.client.ApplicationClient.deployApp(ApplicationClient.java:449)
	at co.cask.cdap.client.ApplicationClient.deploy(ApplicationClient.java:377)
	at co.cask.cdap.client.ApplicationClient.deploy(ApplicationClient.java:353)
	at co.cask.cdap.test.IntegrationTestManager.deployApplication(IntegrationTestManager.java:183)
	at co.cask.cdap.test.AbstractTestManager.deployApplication(AbstractTestManager.java:43)
	at co.cask.cdap.test.IntegrationTestBase.deployApplication(IntegrationTestBase.java:374)
(3 more lines...)
Collapse Failed ExploreTest test History
Distro Tests - MapR 5.0 3 secs
java.lang.RuntimeException: java.io.IOException: co.cask.cdap.api.flow.Flow
	at co.cask.cdap.client.util.RESTClient.upload(RESTClient.java:160)
	at co.cask.cdap.client.ApplicationClient.deployApp(ApplicationClient.java:449)
	at co.cask.cdap.client.ApplicationClient.deploy(ApplicationClient.java:377)
	at co.cask.cdap.client.ApplicationClient.deploy(ApplicationClient.java:353)
	at co.cask.cdap.test.IntegrationTestManager.deployApplication(IntegrationTestManager.java:183)
	at co.cask.cdap.test.AbstractTestManager.deployApplication(AbstractTestManager.java:43)
	at co.cask.cdap.test.IntegrationTestBase.deployApplication(IntegrationTestBase.java:374)
(3 more lines...)
Collapse Failed TransactionTimeoutTest testFlowletTimeouts History
Distro Tests - CDH 5.10 3 secs
java.lang.RuntimeException: java.io.IOException: co.cask.cdap.api.flow.Flow
	at co.cask.cdap.client.util.RESTClient.upload(RESTClient.java:160)
	at co.cask.cdap.client.ApplicationClient.deployApp(ApplicationClient.java:449)
	at co.cask.cdap.client.ApplicationClient.deploy(ApplicationClient.java:377)
	at co.cask.cdap.client.ApplicationClient.deploy(ApplicationClient.java:353)
	at co.cask.cdap.test.IntegrationTestManager.deployApplication(IntegrationTestManager.java:183)
	at co.cask.cdap.test.AbstractTestManager.deployApplication(AbstractTestManager.java:43)
	at co.cask.cdap.test.IntegrationTestBase.deployApplication(IntegrationTestBase.java:374)
(1 more lines...)
Collapse Failed TransactionTimeoutTest testFlowletTimeouts History
Distro Tests - CDH 5.11 3 secs
java.lang.RuntimeException: java.io.IOException: co.cask.cdap.api.flow.Flow
	at co.cask.cdap.client.util.RESTClient.upload(RESTClient.java:160)
	at co.cask.cdap.client.ApplicationClient.deployApp(ApplicationClient.java:449)
	at co.cask.cdap.client.ApplicationClient.deploy(ApplicationClient.java:377)
	at co.cask.cdap.client.ApplicationClient.deploy(ApplicationClient.java:353)
	at co.cask.cdap.test.IntegrationTestManager.deployApplication(IntegrationTestManager.java:183)
	at co.cask.cdap.test.AbstractTestManager.deployApplication(AbstractTestManager.java:43)
	at co.cask.cdap.test.IntegrationTestBase.deployApplication(IntegrationTestBase.java:374)
(1 more lines...)
Collapse Failed TransactionTimeoutTest testFlowletTimeouts History
Distro Tests - CDH 5.12 2 secs
java.lang.RuntimeException: java.io.IOException: co.cask.cdap.api.flow.Flow
	at co.cask.cdap.client.util.RESTClient.upload(RESTClient.java:160)
	at co.cask.cdap.client.ApplicationClient.deployApp(ApplicationClient.java:449)
	at co.cask.cdap.client.ApplicationClient.deploy(ApplicationClient.java:377)
	at co.cask.cdap.client.ApplicationClient.deploy(ApplicationClient.java:353)
	at co.cask.cdap.test.IntegrationTestManager.deployApplication(IntegrationTestManager.java:183)
	at co.cask.cdap.test.AbstractTestManager.deployApplication(AbstractTestManager.java:43)
	at co.cask.cdap.test.IntegrationTestBase.deployApplication(IntegrationTestBase.java:374)
(1 more lines...)
Collapse Failed TransactionTimeoutTest testFlowletTimeouts History
Distro Tests - CDH 5.13 3 secs
java.lang.RuntimeException: java.io.IOException: co.cask.cdap.api.flow.Flow
	at co.cask.cdap.client.util.RESTClient.upload(RESTClient.java:160)
	at co.cask.cdap.client.ApplicationClient.deployApp(ApplicationClient.java:449)
	at co.cask.cdap.client.ApplicationClient.deploy(ApplicationClient.java:377)
	at co.cask.cdap.client.ApplicationClient.deploy(ApplicationClient.java:353)
	at co.cask.cdap.test.IntegrationTestManager.deployApplication(IntegrationTestManager.java:183)
	at co.cask.cdap.test.AbstractTestManager.deployApplication(AbstractTestManager.java:43)
	at co.cask.cdap.test.IntegrationTestBase.deployApplication(IntegrationTestBase.java:374)
(1 more lines...)
Collapse Failed TransactionTimeoutTest testFlowletTimeouts History
Distro Tests - CDH 5.4 2 secs
java.lang.RuntimeException: java.io.IOException: co.cask.cdap.api.flow.Flow
	at co.cask.cdap.client.util.RESTClient.upload(RESTClient.java:160)
	at co.cask.cdap.client.ApplicationClient.deployApp(ApplicationClient.java:449)
	at co.cask.cdap.client.ApplicationClient.deploy(ApplicationClient.java:377)
	at co.cask.cdap.client.ApplicationClient.deploy(ApplicationClient.java:353)
	at co.cask.cdap.test.IntegrationTestManager.deployApplication(IntegrationTestManager.java:183)
	at co.cask.cdap.test.AbstractTestManager.deployApplication(AbstractTestManager.java:43)
	at co.cask.cdap.test.IntegrationTestBase.deployApplication(IntegrationTestBase.java:374)
(1 more lines...)
Collapse Failed TransactionTimeoutTest testFlowletTimeouts History
Distro Tests - CDH 5.5 3 secs
java.lang.RuntimeException: java.io.IOException: co.cask.cdap.api.flow.Flow
	at co.cask.cdap.client.util.RESTClient.upload(RESTClient.java:160)
	at co.cask.cdap.client.ApplicationClient.deployApp(ApplicationClient.java:449)
	at co.cask.cdap.client.ApplicationClient.deploy(ApplicationClient.java:377)
	at co.cask.cdap.client.ApplicationClient.deploy(ApplicationClient.java:353)
	at co.cask.cdap.test.IntegrationTestManager.deployApplication(IntegrationTestManager.java:183)
	at co.cask.cdap.test.AbstractTestManager.deployApplication(AbstractTestManager.java:43)
	at co.cask.cdap.test.IntegrationTestBase.deployApplication(IntegrationTestBase.java:374)
(1 more lines...)
Collapse Failed TransactionTimeoutTest testFlowletTimeouts History
Distro Tests - CDH 5.6 3 secs
java.lang.RuntimeException: java.io.IOException: co.cask.cdap.api.flow.Flow
	at co.cask.cdap.client.util.RESTClient.upload(RESTClient.java:160)
	at co.cask.cdap.client.ApplicationClient.deployApp(ApplicationClient.java:449)
	at co.cask.cdap.client.ApplicationClient.deploy(ApplicationClient.java:377)
	at co.cask.cdap.client.ApplicationClient.deploy(ApplicationClient.java:353)
	at co.cask.cdap.test.IntegrationTestManager.deployApplication(IntegrationTestManager.java:183)
	at co.cask.cdap.test.AbstractTestManager.deployApplication(AbstractTestManager.java:43)
	at co.cask.cdap.test.IntegrationTestBase.deployApplication(IntegrationTestBase.java:374)
(1 more lines...)
Collapse Failed TransactionTimeoutTest testFlowletTimeouts History
Distro Tests - CDH 5.7 3 secs
java.lang.RuntimeException: java.io.IOException: co.cask.cdap.api.flow.Flow
	at co.cask.cdap.client.util.RESTClient.upload(RESTClient.java:160)
	at co.cask.cdap.client.ApplicationClient.deployApp(ApplicationClient.java:449)
	at co.cask.cdap.client.ApplicationClient.deploy(ApplicationClient.java:377)
	at co.cask.cdap.client.ApplicationClient.deploy(ApplicationClient.java:353)
	at co.cask.cdap.test.IntegrationTestManager.deployApplication(IntegrationTestManager.java:183)
	at co.cask.cdap.test.AbstractTestManager.deployApplication(AbstractTestManager.java:43)
	at co.cask.cdap.test.IntegrationTestBase.deployApplication(IntegrationTestBase.java:374)
(1 more lines...)
Collapse Failed TransactionTimeoutTest testFlowletTimeouts History
Distro Tests - CDH 5.8 3 secs
java.lang.RuntimeException: java.io.IOException: co.cask.cdap.api.flow.Flow
	at co.cask.cdap.client.util.RESTClient.upload(RESTClient.java:160)
	at co.cask.cdap.client.ApplicationClient.deployApp(ApplicationClient.java:449)
	at co.cask.cdap.client.ApplicationClient.deploy(ApplicationClient.java:377)
	at co.cask.cdap.client.ApplicationClient.deploy(ApplicationClient.java:353)
	at co.cask.cdap.test.IntegrationTestManager.deployApplication(IntegrationTestManager.java:183)
	at co.cask.cdap.test.AbstractTestManager.deployApplication(AbstractTestManager.java:43)
	at co.cask.cdap.test.IntegrationTestBase.deployApplication(IntegrationTestBase.java:374)
(1 more lines...)
Collapse Failed TransactionTimeoutTest testFlowletTimeouts History
Distro Tests - CDH 5.9 3 secs
java.lang.RuntimeException: java.io.IOException: co.cask.cdap.api.flow.Flow
	at co.cask.cdap.client.util.RESTClient.upload(RESTClient.java:160)
	at co.cask.cdap.client.ApplicationClient.deployApp(ApplicationClient.java:449)
	at co.cask.cdap.client.ApplicationClient.deploy(ApplicationClient.java:377)
	at co.cask.cdap.client.ApplicationClient.deploy(ApplicationClient.java:353)
	at co.cask.cdap.test.IntegrationTestManager.deployApplication(IntegrationTestManager.java:183)
	at co.cask.cdap.test.AbstractTestManager.deployApplication(AbstractTestManager.java:43)
	at co.cask.cdap.test.IntegrationTestBase.deployApplication(IntegrationTestBase.java:374)
(1 more lines...)
Collapse Failed TransactionTimeoutTest testFlowletTimeouts History
Distro Tests - HDP 2.2 3 secs
java.lang.RuntimeException: java.io.IOException: co.cask.cdap.api.flow.Flow
	at co.cask.cdap.client.util.RESTClient.upload(RESTClient.java:160)
	at co.cask.cdap.client.ApplicationClient.deployApp(ApplicationClient.java:449)
	at co.cask.cdap.client.ApplicationClient.deploy(ApplicationClient.java:377)
	at co.cask.cdap.client.ApplicationClient.deploy(ApplicationClient.java:353)
	at co.cask.cdap.test.IntegrationTestManager.deployApplication(IntegrationTestManager.java:183)
	at co.cask.cdap.test.AbstractTestManager.deployApplication(AbstractTestManager.java:43)
	at co.cask.cdap.test.IntegrationTestBase.deployApplication(IntegrationTestBase.java:374)
(1 more lines...)
Collapse Failed TransactionTimeoutTest testFlowletTimeouts History
Distro Tests - HDP 2.3 3 secs
java.lang.RuntimeException: java.io.IOException: co.cask.cdap.api.flow.Flow
	at co.cask.cdap.client.util.RESTClient.upload(RESTClient.java:160)
	at co.cask.cdap.client.ApplicationClient.deployApp(ApplicationClient.java:449)
	at co.cask.cdap.client.ApplicationClient.deploy(ApplicationClient.java:377)
	at co.cask.cdap.client.ApplicationClient.deploy(ApplicationClient.java:353)
	at co.cask.cdap.test.IntegrationTestManager.deployApplication(IntegrationTestManager.java:183)
	at co.cask.cdap.test.AbstractTestManager.deployApplication(AbstractTestManager.java:43)
	at co.cask.cdap.test.IntegrationTestBase.deployApplication(IntegrationTestBase.java:374)
(1 more lines...)
Collapse Failed TransactionTimeoutTest testFlowletTimeouts History
Distro Tests - HDP 2.4 2 secs
java.lang.RuntimeException: java.io.IOException: co.cask.cdap.api.flow.Flow
	at co.cask.cdap.client.util.RESTClient.upload(RESTClient.java:160)
	at co.cask.cdap.client.ApplicationClient.deployApp(ApplicationClient.java:449)
	at co.cask.cdap.client.ApplicationClient.deploy(ApplicationClient.java:377)
	at co.cask.cdap.client.ApplicationClient.deploy(ApplicationClient.java:353)
	at co.cask.cdap.test.IntegrationTestManager.deployApplication(IntegrationTestManager.java:183)
	at co.cask.cdap.test.AbstractTestManager.deployApplication(AbstractTestManager.java:43)
	at co.cask.cdap.test.IntegrationTestBase.deployApplication(IntegrationTestBase.java:374)
(1 more lines...)
Collapse Failed TransactionTimeoutTest testFlowletTimeouts History
Distro Tests - HDP 2.5 3 secs
java.lang.RuntimeException: java.io.IOException: co.cask.cdap.api.flow.Flow
	at co.cask.cdap.client.util.RESTClient.upload(RESTClient.java:160)
	at co.cask.cdap.client.ApplicationClient.deployApp(ApplicationClient.java:449)
	at co.cask.cdap.client.ApplicationClient.deploy(ApplicationClient.java:377)
	at co.cask.cdap.client.ApplicationClient.deploy(ApplicationClient.java:353)
	at co.cask.cdap.test.IntegrationTestManager.deployApplication(IntegrationTestManager.java:183)
	at co.cask.cdap.test.AbstractTestManager.deployApplication(AbstractTestManager.java:43)
	at co.cask.cdap.test.IntegrationTestBase.deployApplication(IntegrationTestBase.java:374)
(1 more lines...)
Collapse Failed TransactionTimeoutTest testFlowletTimeouts History
Distro Tests - HDP 2.6 3 secs
java.lang.RuntimeException: java.io.IOException: co.cask.cdap.api.flow.Flow
	at co.cask.cdap.client.util.RESTClient.upload(RESTClient.java:160)
	at co.cask.cdap.client.ApplicationClient.deployApp(ApplicationClient.java:449)
	at co.cask.cdap.client.ApplicationClient.deploy(ApplicationClient.java:377)
	at co.cask.cdap.client.ApplicationClient.deploy(ApplicationClient.java:353)
	at co.cask.cdap.test.IntegrationTestManager.deployApplication(IntegrationTestManager.java:183)
	at co.cask.cdap.test.AbstractTestManager.deployApplication(AbstractTestManager.java:43)
	at co.cask.cdap.test.IntegrationTestBase.deployApplication(IntegrationTestBase.java:374)
(1 more lines...)
Collapse Failed TransactionTimeoutTest testFlowletTimeouts History
Distro Tests - MapR 5.0 3 secs
java.lang.RuntimeException: java.io.IOException: co.cask.cdap.api.flow.Flow
	at co.cask.cdap.client.util.RESTClient.upload(RESTClient.java:160)
	at co.cask.cdap.client.ApplicationClient.deployApp(ApplicationClient.java:449)
	at co.cask.cdap.client.ApplicationClient.deploy(ApplicationClient.java:377)
	at co.cask.cdap.client.ApplicationClient.deploy(ApplicationClient.java:353)
	at co.cask.cdap.test.IntegrationTestManager.deployApplication(IntegrationTestManager.java:183)
	at co.cask.cdap.test.AbstractTestManager.deployApplication(AbstractTestManager.java:43)
	at co.cask.cdap.test.IntegrationTestBase.deployApplication(IntegrationTestBase.java:374)
(1 more lines...)
Existing test failures 21
Status Test Failing since View job Duration
java.lang.RuntimeException: java.io.IOException: co.cask.cdap.api.flow.Flow
	at co.cask.cdap.client.util.RESTClient.upload(RESTClient.java:160)
	at co.cask.cdap.client.ApplicationClient.deployApp(ApplicationClient.java:449)
	at co.cask.cdap.client.ApplicationClient.deploy(ApplicationClient.java:377)
	at co.cask.cdap.client.ApplicationClient.deploy(ApplicationClient.java:353)
	at co.cask.cdap.test.IntegrationTestManager.deployApplication(IntegrationTestManager.java:183)
	at co.cask.cdap.test.AbstractTestManager.deployApplication(AbstractTestManager.java:43)
	at co.cask.cdap.test.IntegrationTestBase.deployApplication(IntegrationTestBase.java:374)
(2 more lines...)
java.lang.RuntimeException: java.io.IOException: co.cask.cdap.api.flow.Flow
	at co.cask.cdap.client.util.RESTClient.upload(RESTClient.java:160)
	at co.cask.cdap.client.ApplicationClient.deployApp(ApplicationClient.java:449)
	at co.cask.cdap.client.ApplicationClient.deploy(ApplicationClient.java:377)
	at co.cask.cdap.client.ApplicationClient.deploy(ApplicationClient.java:353)
	at co.cask.cdap.test.IntegrationTestManager.deployApplication(IntegrationTestManager.java:183)
	at co.cask.cdap.test.AbstractTestManager.deployApplication(AbstractTestManager.java:43)
	at co.cask.cdap.test.IntegrationTestBase.deployApplication(IntegrationTestBase.java:374)
(2 more lines...)
java.lang.RuntimeException: java.io.IOException: co.cask.cdap.api.flow.Flow
	at co.cask.cdap.client.util.RESTClient.upload(RESTClient.java:160)
	at co.cask.cdap.client.ApplicationClient.deployApp(ApplicationClient.java:449)
	at co.cask.cdap.client.ApplicationClient.deploy(ApplicationClient.java:377)
	at co.cask.cdap.client.ApplicationClient.deploy(ApplicationClient.java:353)
	at co.cask.cdap.test.IntegrationTestManager.deployApplication(IntegrationTestManager.java:183)
	at co.cask.cdap.test.AbstractTestManager.deployApplication(AbstractTestManager.java:43)
	at co.cask.cdap.test.IntegrationTestBase.deployApplication(IntegrationTestBase.java:374)
(2 more lines...)
java.lang.RuntimeException: java.io.IOException: co.cask.cdap.api.flow.Flow
	at co.cask.cdap.client.util.RESTClient.upload(RESTClient.java:160)
	at co.cask.cdap.client.ApplicationClient.deployApp(ApplicationClient.java:449)
	at co.cask.cdap.client.ApplicationClient.deploy(ApplicationClient.java:377)
	at co.cask.cdap.client.ApplicationClient.deploy(ApplicationClient.java:353)
	at co.cask.cdap.test.IntegrationTestManager.deployApplication(IntegrationTestManager.java:183)
	at co.cask.cdap.test.AbstractTestManager.deployApplication(AbstractTestManager.java:43)
	at co.cask.cdap.test.IntegrationTestBase.deployApplication(IntegrationTestBase.java:374)
(2 more lines...)
java.lang.RuntimeException: java.io.IOException: co.cask.cdap.api.flow.Flow
	at co.cask.cdap.client.util.RESTClient.upload(RESTClient.java:160)
	at co.cask.cdap.client.ApplicationClient.deployApp(ApplicationClient.java:449)
	at co.cask.cdap.client.ApplicationClient.deploy(ApplicationClient.java:377)
	at co.cask.cdap.client.ApplicationClient.deploy(ApplicationClient.java:353)
	at co.cask.cdap.test.IntegrationTestManager.deployApplication(IntegrationTestManager.java:183)
	at co.cask.cdap.test.AbstractTestManager.deployApplication(AbstractTestManager.java:43)
	at co.cask.cdap.test.IntegrationTestBase.deployApplication(IntegrationTestBase.java:374)
(2 more lines...)
java.lang.RuntimeException: java.io.IOException: co.cask.cdap.api.flow.Flow
	at co.cask.cdap.client.util.RESTClient.upload(RESTClient.java:160)
	at co.cask.cdap.client.ApplicationClient.deployApp(ApplicationClient.java:449)
	at co.cask.cdap.client.ApplicationClient.deploy(ApplicationClient.java:377)
	at co.cask.cdap.client.ApplicationClient.deploy(ApplicationClient.java:353)
	at co.cask.cdap.test.IntegrationTestManager.deployApplication(IntegrationTestManager.java:183)
	at co.cask.cdap.test.AbstractTestManager.deployApplication(AbstractTestManager.java:43)
	at co.cask.cdap.test.IntegrationTestBase.deployApplication(IntegrationTestBase.java:374)
(2 more lines...)
java.lang.RuntimeException: java.io.IOException: co.cask.cdap.api.flow.Flow
	at co.cask.cdap.client.util.RESTClient.upload(RESTClient.java:160)
	at co.cask.cdap.client.ApplicationClient.deployApp(ApplicationClient.java:449)
	at co.cask.cdap.client.ApplicationClient.deploy(ApplicationClient.java:377)
	at co.cask.cdap.client.ApplicationClient.deploy(ApplicationClient.java:353)
	at co.cask.cdap.test.IntegrationTestManager.deployApplication(IntegrationTestManager.java:183)
	at co.cask.cdap.test.AbstractTestManager.deployApplication(AbstractTestManager.java:43)
	at co.cask.cdap.test.IntegrationTestBase.deployApplication(IntegrationTestBase.java:374)
(2 more lines...)
java.lang.RuntimeException: java.io.IOException: co.cask.cdap.api.flow.Flow
	at co.cask.cdap.client.util.RESTClient.upload(RESTClient.java:160)
	at co.cask.cdap.client.ApplicationClient.deployApp(ApplicationClient.java:449)
	at co.cask.cdap.client.ApplicationClient.deploy(ApplicationClient.java:377)
	at co.cask.cdap.client.ApplicationClient.deploy(ApplicationClient.java:353)
	at co.cask.cdap.test.IntegrationTestManager.deployApplication(IntegrationTestManager.java:183)
	at co.cask.cdap.test.AbstractTestManager.deployApplication(AbstractTestManager.java:43)
	at co.cask.cdap.test.IntegrationTestBase.deployApplication(IntegrationTestBase.java:374)
(2 more lines...)
java.lang.RuntimeException: java.io.IOException: co.cask.cdap.api.flow.Flow
	at co.cask.cdap.client.util.RESTClient.upload(RESTClient.java:160)
	at co.cask.cdap.client.ApplicationClient.deployApp(ApplicationClient.java:449)
	at co.cask.cdap.client.ApplicationClient.deploy(ApplicationClient.java:377)
	at co.cask.cdap.client.ApplicationClient.deploy(ApplicationClient.java:353)
	at co.cask.cdap.test.IntegrationTestManager.deployApplication(IntegrationTestManager.java:183)
	at co.cask.cdap.test.AbstractTestManager.deployApplication(AbstractTestManager.java:43)
	at co.cask.cdap.test.IntegrationTestBase.deployApplication(IntegrationTestBase.java:374)
(2 more lines...)
java.lang.RuntimeException: java.io.IOException: co.cask.cdap.api.flow.Flow
	at co.cask.cdap.client.util.RESTClient.upload(RESTClient.java:160)
	at co.cask.cdap.client.ApplicationClient.deployApp(ApplicationClient.java:449)
	at co.cask.cdap.client.ApplicationClient.deploy(ApplicationClient.java:377)
	at co.cask.cdap.client.ApplicationClient.deploy(ApplicationClient.java:353)
	at co.cask.cdap.test.IntegrationTestManager.deployApplication(IntegrationTestManager.java:183)
	at co.cask.cdap.test.AbstractTestManager.deployApplication(AbstractTestManager.java:43)
	at co.cask.cdap.test.IntegrationTestBase.deployApplication(IntegrationTestBase.java:374)
(3 more lines...)
java.lang.RuntimeException: java.io.IOException: co.cask.cdap.api.flow.Flow
	at co.cask.cdap.client.util.RESTClient.upload(RESTClient.java:160)
	at co.cask.cdap.client.ApplicationClient.deployApp(ApplicationClient.java:449)
	at co.cask.cdap.client.ApplicationClient.deploy(ApplicationClient.java:377)
	at co.cask.cdap.client.ApplicationClient.deploy(ApplicationClient.java:353)
	at co.cask.cdap.test.IntegrationTestManager.deployApplication(IntegrationTestManager.java:183)
	at co.cask.cdap.test.AbstractTestManager.deployApplication(AbstractTestManager.java:43)
	at co.cask.cdap.test.IntegrationTestBase.deployApplication(IntegrationTestBase.java:374)
(3 more lines...)
java.lang.RuntimeException: java.io.IOException: co.cask.cdap.api.flow.Flow
	at co.cask.cdap.client.util.RESTClient.upload(RESTClient.java:160)
	at co.cask.cdap.client.ApplicationClient.deployApp(ApplicationClient.java:449)
	at co.cask.cdap.client.ApplicationClient.deploy(ApplicationClient.java:377)
	at co.cask.cdap.client.ApplicationClient.deploy(ApplicationClient.java:353)
	at co.cask.cdap.test.IntegrationTestManager.deployApplication(IntegrationTestManager.java:183)
	at co.cask.cdap.test.AbstractTestManager.deployApplication(AbstractTestManager.java:43)
	at co.cask.cdap.test.IntegrationTestBase.deployApplication(IntegrationTestBase.java:374)
(3 more lines...)
java.lang.RuntimeException: java.io.IOException: co.cask.cdap.api.flow.Flow
	at co.cask.cdap.client.util.RESTClient.upload(RESTClient.java:160)
	at co.cask.cdap.client.ApplicationClient.deployApp(ApplicationClient.java:449)
	at co.cask.cdap.client.ApplicationClient.deploy(ApplicationClient.java:377)
	at co.cask.cdap.client.ApplicationClient.deploy(ApplicationClient.java:353)
	at co.cask.cdap.test.IntegrationTestManager.deployApplication(IntegrationTestManager.java:183)
	at co.cask.cdap.test.AbstractTestManager.deployApplication(AbstractTestManager.java:43)
	at co.cask.cdap.test.IntegrationTestBase.deployApplication(IntegrationTestBase.java:374)
(3 more lines...)
java.lang.RuntimeException: java.io.IOException: co.cask.cdap.api.flow.Flow
	at co.cask.cdap.client.util.RESTClient.upload(RESTClient.java:160)
	at co.cask.cdap.client.ApplicationClient.deployApp(ApplicationClient.java:449)
	at co.cask.cdap.client.ApplicationClient.deploy(ApplicationClient.java:377)
	at co.cask.cdap.client.ApplicationClient.deploy(ApplicationClient.java:353)
	at co.cask.cdap.test.IntegrationTestManager.deployApplication(IntegrationTestManager.java:183)
	at co.cask.cdap.test.AbstractTestManager.deployApplication(AbstractTestManager.java:43)
	at co.cask.cdap.test.IntegrationTestBase.deployApplication(IntegrationTestBase.java:374)
(3 more lines...)
java.lang.RuntimeException: java.io.IOException: co.cask.cdap.api.flow.Flow
	at co.cask.cdap.client.util.RESTClient.upload(RESTClient.java:160)
	at co.cask.cdap.client.ApplicationClient.deployApp(ApplicationClient.java:449)
	at co.cask.cdap.client.ApplicationClient.deploy(ApplicationClient.java:377)
	at co.cask.cdap.client.ApplicationClient.deploy(ApplicationClient.java:353)
	at co.cask.cdap.test.IntegrationTestManager.deployApplication(IntegrationTestManager.java:183)
	at co.cask.cdap.test.AbstractTestManager.deployApplication(AbstractTestManager.java:43)
	at co.cask.cdap.test.IntegrationTestBase.deployApplication(IntegrationTestBase.java:374)
(3 more lines...)
java.lang.RuntimeException: java.io.IOException: co.cask.cdap.api.flow.Flow
	at co.cask.cdap.client.util.RESTClient.upload(RESTClient.java:160)
	at co.cask.cdap.client.ApplicationClient.deployApp(ApplicationClient.java:449)
	at co.cask.cdap.client.ApplicationClient.deploy(ApplicationClient.java:377)
	at co.cask.cdap.client.ApplicationClient.deploy(ApplicationClient.java:353)
	at co.cask.cdap.test.IntegrationTestManager.deployApplication(IntegrationTestManager.java:183)
	at co.cask.cdap.test.AbstractTestManager.deployApplication(AbstractTestManager.java:43)
	at co.cask.cdap.test.IntegrationTestBase.deployApplication(IntegrationTestBase.java:374)
(3 more lines...)
java.lang.RuntimeException: java.io.IOException: co.cask.cdap.api.flow.Flow
	at co.cask.cdap.client.util.RESTClient.upload(RESTClient.java:160)
	at co.cask.cdap.client.ApplicationClient.deployApp(ApplicationClient.java:449)
	at co.cask.cdap.client.ApplicationClient.deploy(ApplicationClient.java:377)
	at co.cask.cdap.client.ApplicationClient.deploy(ApplicationClient.java:353)
	at co.cask.cdap.test.IntegrationTestManager.deployApplication(IntegrationTestManager.java:183)
	at co.cask.cdap.test.AbstractTestManager.deployApplication(AbstractTestManager.java:43)
	at co.cask.cdap.test.IntegrationTestBase.deployApplication(IntegrationTestBase.java:374)
(3 more lines...)
java.lang.RuntimeException: java.io.IOException: co.cask.cdap.api.flow.Flow
	at co.cask.cdap.client.util.RESTClient.upload(RESTClient.java:160)
	at co.cask.cdap.client.ApplicationClient.deployApp(ApplicationClient.java:449)
	at co.cask.cdap.client.ApplicationClient.deploy(ApplicationClient.java:377)
	at co.cask.cdap.client.ApplicationClient.deploy(ApplicationClient.java:353)
	at co.cask.cdap.test.IntegrationTestManager.deployApplication(IntegrationTestManager.java:183)
	at co.cask.cdap.test.AbstractTestManager.deployApplication(AbstractTestManager.java:43)
	at co.cask.cdap.test.IntegrationTestBase.deployApplication(IntegrationTestBase.java:374)
(1 more lines...)
java.lang.RuntimeException: java.io.IOException: co.cask.cdap.api.flow.Flow
	at co.cask.cdap.client.util.RESTClient.upload(RESTClient.java:160)
	at co.cask.cdap.client.ApplicationClient.deployApp(ApplicationClient.java:449)
	at co.cask.cdap.client.ApplicationClient.deploy(ApplicationClient.java:377)
	at co.cask.cdap.client.ApplicationClient.deploy(ApplicationClient.java:353)
	at co.cask.cdap.test.IntegrationTestManager.deployApplication(IntegrationTestManager.java:183)
	at co.cask.cdap.test.AbstractTestManager.deployApplication(AbstractTestManager.java:43)
	at co.cask.cdap.test.IntegrationTestBase.deployApplication(IntegrationTestBase.java:374)
(1 more lines...)
java.lang.RuntimeException: java.io.IOException: co.cask.cdap.api.flow.Flow
	at co.cask.cdap.client.util.RESTClient.upload(RESTClient.java:160)
	at co.cask.cdap.client.ApplicationClient.deployApp(ApplicationClient.java:449)
	at co.cask.cdap.client.ApplicationClient.deploy(ApplicationClient.java:377)
	at co.cask.cdap.client.ApplicationClient.deploy(ApplicationClient.java:353)
	at co.cask.cdap.test.IntegrationTestManager.deployApplication(IntegrationTestManager.java:183)
	at co.cask.cdap.test.AbstractTestManager.deployApplication(AbstractTestManager.java:43)
	at co.cask.cdap.test.IntegrationTestBase.deployApplication(IntegrationTestBase.java:374)
(1 more lines...)
java.lang.RuntimeException: java.io.IOException: co.cask.cdap.api.flow.Flow
	at co.cask.cdap.client.util.RESTClient.upload(RESTClient.java:160)
	at co.cask.cdap.client.ApplicationClient.deployApp(ApplicationClient.java:449)
	at co.cask.cdap.client.ApplicationClient.deploy(ApplicationClient.java:377)
	at co.cask.cdap.client.ApplicationClient.deploy(ApplicationClient.java:353)
	at co.cask.cdap.test.IntegrationTestManager.deployApplication(IntegrationTestManager.java:183)
	at co.cask.cdap.test.AbstractTestManager.deployApplication(AbstractTestManager.java:43)
	at co.cask.cdap.test.IntegrationTestBase.deployApplication(IntegrationTestBase.java:374)
(1 more lines...)