Build #169

Build: #169 failed Scheduled

Logs

The following logs have been generated by the jobs in this plan.
  • Expand all
  • Collapse all
Job Logs
Collapse Distro Tests - CDH 5.4 Spinup and Test Download or View
08-Dec-2018 09:02:51 [INFO] integration-test-core ............................. SUCCESS [7.419s]
08-Dec-2018 09:02:51 [INFO] integration-test-remote ........................... FAILURE [5:25:59.499s]
08-Dec-2018 09:02:51 [INFO] integration-test-standalone ....................... SKIPPED
08-Dec-2018 09:02:51 [INFO] upgrade-test ...................................... SKIPPED
08-Dec-2018 09:02:51 [INFO] long-running-test ................................. SKIPPED
08-Dec-2018 09:02:51 [INFO] ------------------------------------------------------------------------
08-Dec-2018 09:02:51 [INFO] BUILD FAILURE
08-Dec-2018 09:02:51 [INFO] ------------------------------------------------------------------------
08-Dec-2018 09:02:51 [INFO] Total time: 5:26:29.998s
08-Dec-2018 09:02:51 [INFO] Finished at: Sat Dec 08 09:02:51 UTC 2018
08-Dec-2018 09:02:52 [INFO] Final Memory: 103M/1132M
08-Dec-2018 09:02:52 [INFO] ------------------------------------------------------------------------
08-Dec-2018 09:02:52 [ERROR] Failed to execute goal org.apache.maven.plugins:maven-surefire-plugin:2.18.1:test (default-test) on project integration-test-remote: There are test failures.
08-Dec-2018 09:02:52 [ERROR]
08-Dec-2018 09:02:52 [ERROR] Please refer to /var/bamboo/xml-data/build-dir/IT-ITN-DSTC54/cdap-integration-tests/integration-test-remote/target/surefire-reports for the individual test results.
08-Dec-2018 09:02:52 [ERROR] -> [Help 1]
08-Dec-2018 09:02:52 [ERROR]
08-Dec-2018 09:02:52 [ERROR] To see the full stack trace of the errors, re-run Maven with the -e switch.
08-Dec-2018 09:02:52 [ERROR] Re-run Maven using the -X switch to enable full debug logging.
08-Dec-2018 09:02:52 [ERROR]
08-Dec-2018 09:02:52 [ERROR] For more information about the errors and possible solutions, please read the following articles:
08-Dec-2018 09:02:52 [ERROR] [Help 1] http://cwiki.apache.org/confluence/display/MAVEN/MojoFailureException
08-Dec-2018 09:02:52 [ERROR]
08-Dec-2018 09:02:52 [ERROR] After correcting the problems, you can resume the build with the command
08-Dec-2018 09:02:52 [ERROR]   mvn <goals> -rf :integration-test-remote