Build #226

Automatically provisions CDAP cluster and runs integration test suite against it.

Build: #226 failed

Job: Distro Tests - CDH 5.5 failed

Stages & jobs

  1. Spinup and Test

test: Test case result

The below summarizes the result of the test "test" in build 226 of Integration Tests - Integration Tests - Mini - Distro Tests - CDH 5.5. View test case history
Description
test
Test class
io.cdap.cdap.apps.workflow.WorkflowTest
Method
test
Duration
1 min
Status
Failed (New Failure)

Error Log

java.util.concurrent.ExecutionException: java.lang.RuntimeException: java.io.IOException: 500: Connection refused (Connection refused)
	at io.cdap.cdap.client.util.RESTClient.execute(RESTClient.java:132)
	at io.cdap.cdap.client.util.RESTClient.execute(RESTClient.java:74)
	at io.cdap.cdap.client.ProgramClient.getProgramRuns(ProgramClient.java:478)
	at io.cdap.cdap.test.remote.RemoteApplicationManager.getHistory(RemoteApplicationManager.java:160)
	at io.cdap.cdap.test.AbstractProgramManager.getHistory(AbstractProgramManager.java:150)
	at io.cdap.cdap.test.AbstractProgramManager.lambda$waitForRuns$0(AbstractProgramManager.java:96)
	at io.cdap.cdap.common.utils.Tasks.waitFor(Tasks.java:58)
	at io.cdap.cdap.common.utils.Tasks.waitFor(Tasks.java:91)
	at io.cdap.cdap.common.utils.Tasks.waitFor(Tasks.java:130)
	at io.cdap.cdap.test.AbstractProgramManager.waitForRuns(AbstractProgramManager.java:96)
	at io.cdap.cdap.test.AbstractProgramManager.waitForRun(AbstractProgramManager.java:90)
	at io.cdap.cdap.apps.workflow.WorkflowTest.test(WorkflowTest.java:42)