Build #162

Automatically provisions CDAP cluster and runs integration test suite against it.

Build: #162 failed Manual run by Terence Yim

Build result summary

Details

Completed
Duration
367 minutes
Flags
Custom build
Labels
None
Agent
bamboo-agent07
Revision
a45d616de6cd993035808db42f8e30d9b5616a48 a45d616de6cd993035808db42f8e30d9b5616a48
Total tests
46
Fixed in
#163 (Manual run by Vinisha Shah)

Responsible

Custom variables

Name Value
itn.branch feature/CDAP-15113-fix-remote-secure-store

Code commits

Author Commit Message Commit date
Ali Anwar Ali Anwar a45d616de6cd993035808db42f8e30d9b5616a48 a45d616de6cd993035808db42f8e30d9b5616a48 Merge pull request #1006 from cdapio/fix-hive-plugin-test
Avoid using auth token for REST calls to CDAP Hub.
Ali <alianwar@google.com> Ali <alianwar@google.com> cfa03081bd14d2def4b70168e09fdf85fbc04de2 cfa03081bd14d2def4b70168e09fdf85fbc04de2 Avoid using auth token for REST calls to CDAP Hub.

Tests

New test failures 29
Status Test View job Duration
Collapse Failed KVTableWithProjectionTest testKVTableWithProjection History
Distro Tests - CDH 5.5 11 mins
java.util.concurrent.TimeoutException: Timeout occurred. Expected true but found false.
	at co.cask.cdap.common.utils.Tasks.waitFor(Tasks.java:70)
	at co.cask.cdap.common.utils.Tasks.waitFor(Tasks.java:91)
	at co.cask.cdap.common.utils.Tasks.waitFor(Tasks.java:130)
	at co.cask.cdap.test.AbstractProgramManager.waitForRuns(AbstractProgramManager.java:96)
	at co.cask.cdap.test.AbstractProgramManager.waitForRun(AbstractProgramManager.java:90)
	at co.cask.cdap.app.etl.KVTableWithProjectionTest.testKVTableWithProjection(KVTableWithProjectionTest.java:83)
Collapse Failed TPFSAvroSinkSourceTest testTPFSWithProjection History
Distro Tests - CDH 5.5 11 mins
java.util.concurrent.TimeoutException: Timeout occurred. Expected true but found false.
	at co.cask.cdap.common.utils.Tasks.waitFor(Tasks.java:70)
	at co.cask.cdap.common.utils.Tasks.waitFor(Tasks.java:91)
	at co.cask.cdap.common.utils.Tasks.waitFor(Tasks.java:130)
	at co.cask.cdap.test.AbstractProgramManager.waitForRuns(AbstractProgramManager.java:96)
	at co.cask.cdap.test.AbstractProgramManager.waitForRun(AbstractProgramManager.java:90)
	at co.cask.cdap.app.etl.TPFSAvroSinkSourceTest.testTPFSWithProjection(TPFSAvroSinkSourceTest.java:82)
Collapse Failed BatchAggregatorTest test History
Distro Tests - CDH 5.5 < 1 sec
java.util.concurrent.TimeoutException: Timeout occurred. Expected true but found false.
	at co.cask.cdap.common.utils.Tasks.waitFor(Tasks.java:70)
	at co.cask.cdap.common.utils.Tasks.waitFor(Tasks.java:91)
	at co.cask.cdap.common.utils.Tasks.waitFor(Tasks.java:130)
	at co.cask.cdap.test.AbstractProgramManager.waitForRuns(AbstractProgramManager.java:96)
	at co.cask.cdap.test.AbstractProgramManager.waitForRun(AbstractProgramManager.java:90)
	at co.cask.cdap.app.etl.batch.BatchAggregatorTest.test(BatchAggregatorTest.java:162)
Collapse Failed BatchCubeSinkTest test History
Distro Tests - CDH 5.5 6 mins
java.util.concurrent.TimeoutException: Timeout occurred. Expected true but found false.
	at co.cask.cdap.common.utils.Tasks.waitFor(Tasks.java:70)
	at co.cask.cdap.common.utils.Tasks.waitFor(Tasks.java:91)
	at co.cask.cdap.common.utils.Tasks.waitFor(Tasks.java:130)
	at co.cask.cdap.test.AbstractProgramManager.waitForRuns(AbstractProgramManager.java:96)
	at co.cask.cdap.test.AbstractProgramManager.waitForRun(AbstractProgramManager.java:90)
	at co.cask.cdap.app.etl.batch.BatchCubeSinkTest.test(BatchCubeSinkTest.java:108)
Collapse Failed BatchJoinerTest testJoinerSpark History
Distro Tests - CDH 5.5 < 1 sec
java.util.concurrent.TimeoutException: Timeout occurred. Expected true but found false.
	at co.cask.cdap.common.utils.Tasks.waitFor(Tasks.java:70)
	at co.cask.cdap.common.utils.Tasks.waitFor(Tasks.java:91)
	at co.cask.cdap.common.utils.Tasks.waitFor(Tasks.java:130)
	at co.cask.cdap.test.AbstractProgramManager.waitForRuns(AbstractProgramManager.java:96)
	at co.cask.cdap.test.AbstractProgramManager.waitForRun(AbstractProgramManager.java:90)
	at co.cask.cdap.app.etl.batch.BatchJoinerTest.testJoiner(BatchJoinerTest.java:216)
	at co.cask.cdap.app.etl.batch.BatchJoinerTest.testJoinerSpark(BatchJoinerTest.java:93)
Collapse Failed BatchJoinerTest testJoinerMR History
Distro Tests - CDH 5.5 < 1 sec
java.util.concurrent.TimeoutException: Timeout occurred. Expected true but found false.
	at co.cask.cdap.common.utils.Tasks.waitFor(Tasks.java:70)
	at co.cask.cdap.common.utils.Tasks.waitFor(Tasks.java:91)
	at co.cask.cdap.common.utils.Tasks.waitFor(Tasks.java:130)
	at co.cask.cdap.test.AbstractProgramManager.waitForRuns(AbstractProgramManager.java:96)
	at co.cask.cdap.test.AbstractProgramManager.waitForRun(AbstractProgramManager.java:90)
	at co.cask.cdap.app.etl.batch.BatchJoinerTest.testJoiner(BatchJoinerTest.java:216)
	at co.cask.cdap.app.etl.batch.BatchJoinerTest.testJoinerMR(BatchJoinerTest.java:85)
Collapse Failed ETLMapReduceTest testTableToTableWithValidations History
Distro Tests - CDH 5.5 6 mins
java.util.concurrent.TimeoutException: Timeout occurred. Expected true but found false.
	at co.cask.cdap.common.utils.Tasks.waitFor(Tasks.java:70)
	at co.cask.cdap.common.utils.Tasks.waitFor(Tasks.java:91)
	at co.cask.cdap.common.utils.Tasks.waitFor(Tasks.java:130)
	at co.cask.cdap.test.AbstractProgramManager.waitForRuns(AbstractProgramManager.java:96)
	at co.cask.cdap.test.AbstractProgramManager.waitForRun(AbstractProgramManager.java:90)
	at co.cask.cdap.app.etl.batch.ETLMapReduceTest.testTableToTableWithValidations(ETLMapReduceTest.java:620)
Collapse Failed ETLMapReduceTest testDAGSchemaChanges History
Distro Tests - CDH 5.5 6 mins
java.util.concurrent.TimeoutException: Timeout occurred. Expected true but found false.
	at co.cask.cdap.common.utils.Tasks.waitFor(Tasks.java:70)
	at co.cask.cdap.common.utils.Tasks.waitFor(Tasks.java:91)
	at co.cask.cdap.common.utils.Tasks.waitFor(Tasks.java:130)
	at co.cask.cdap.test.AbstractProgramManager.waitForRuns(AbstractProgramManager.java:96)
	at co.cask.cdap.test.AbstractProgramManager.waitForRun(AbstractProgramManager.java:90)
	at co.cask.cdap.app.etl.batch.ETLMapReduceTest.testDAGSchemaChanges(ETLMapReduceTest.java:448)
Collapse Failed ETLMapReduceTest testKVToKV History
Distro Tests - CDH 5.5 5 mins
java.util.concurrent.TimeoutException: Timeout occurred. Expected true but found false.
	at co.cask.cdap.common.utils.Tasks.waitFor(Tasks.java:70)
	at co.cask.cdap.common.utils.Tasks.waitFor(Tasks.java:91)
	at co.cask.cdap.common.utils.Tasks.waitFor(Tasks.java:130)
	at co.cask.cdap.test.AbstractProgramManager.waitForRuns(AbstractProgramManager.java:96)
	at co.cask.cdap.test.AbstractProgramManager.waitForRun(AbstractProgramManager.java:90)
	at co.cask.cdap.app.etl.batch.ETLMapReduceTest.testKVToKV(ETLMapReduceTest.java:108)
Collapse Failed ETLMapReduceTest testDAG History
Distro Tests - CDH 5.5 6 mins
java.util.concurrent.TimeoutException: Timeout occurred. Expected true but found false.
	at co.cask.cdap.common.utils.Tasks.waitFor(Tasks.java:70)
	at co.cask.cdap.common.utils.Tasks.waitFor(Tasks.java:91)
	at co.cask.cdap.common.utils.Tasks.waitFor(Tasks.java:130)
	at co.cask.cdap.test.AbstractProgramManager.waitForRuns(AbstractProgramManager.java:96)
	at co.cask.cdap.test.AbstractProgramManager.waitForRun(AbstractProgramManager.java:90)
	at co.cask.cdap.app.etl.batch.ETLMapReduceTest.testDAG(ETLMapReduceTest.java:195)
Collapse Failed ExcelInputReaderTest testExcelReaderReprocessFalse History
Distro Tests - CDH 5.5 11 mins
java.util.concurrent.TimeoutException: Timeout occurred. Expected true but found false.
	at co.cask.cdap.common.utils.Tasks.waitFor(Tasks.java:70)
	at co.cask.cdap.common.utils.Tasks.waitFor(Tasks.java:91)
	at co.cask.cdap.common.utils.Tasks.waitFor(Tasks.java:130)
	at co.cask.cdap.test.AbstractProgramManager.waitForRuns(AbstractProgramManager.java:96)
	at co.cask.cdap.test.AbstractProgramManager.waitForRun(AbstractProgramManager.java:90)
	at co.cask.cdap.app.etl.batch.ExcelInputReaderTest.testExcelReaderReprocessFalse(ExcelInputReaderTest.java:214)
Collapse Failed ExcelInputReaderTest testExcelReader History
Distro Tests - CDH 5.5 11 mins
java.util.concurrent.TimeoutException: Timeout occurred. Expected true but found false.
	at co.cask.cdap.common.utils.Tasks.waitFor(Tasks.java:70)
	at co.cask.cdap.common.utils.Tasks.waitFor(Tasks.java:91)
	at co.cask.cdap.common.utils.Tasks.waitFor(Tasks.java:130)
	at co.cask.cdap.test.AbstractProgramManager.waitForRuns(AbstractProgramManager.java:96)
	at co.cask.cdap.test.AbstractProgramManager.waitForRun(AbstractProgramManager.java:90)
	at co.cask.cdap.app.etl.batch.ExcelInputReaderTest.testExcelReader(ExcelInputReaderTest.java:144)
Collapse Failed NormalizeTest testNormalizeWithEmptyAttributeValue History
Distro Tests - CDH 5.5 6 mins
java.util.concurrent.TimeoutException: Timeout occurred. Expected true but found false.
	at co.cask.cdap.common.utils.Tasks.waitFor(Tasks.java:70)
	at co.cask.cdap.common.utils.Tasks.waitFor(Tasks.java:91)
	at co.cask.cdap.common.utils.Tasks.waitFor(Tasks.java:130)
	at co.cask.cdap.test.AbstractProgramManager.waitForRuns(AbstractProgramManager.java:96)
	at co.cask.cdap.test.AbstractProgramManager.waitForRun(AbstractProgramManager.java:90)
	at co.cask.cdap.app.etl.batch.NormalizeTest.startWorkFlow(NormalizeTest.java:131)
	at co.cask.cdap.app.etl.batch.NormalizeTest.testNormalizeWithEmptyAttributeValue(NormalizeTest.java:218)
Collapse Failed NormalizeTest testNormalize History
Distro Tests - CDH 5.5 6 mins
java.util.concurrent.TimeoutException: Timeout occurred. Expected true but found false.
	at co.cask.cdap.common.utils.Tasks.waitFor(Tasks.java:70)
	at co.cask.cdap.common.utils.Tasks.waitFor(Tasks.java:91)
	at co.cask.cdap.common.utils.Tasks.waitFor(Tasks.java:130)
	at co.cask.cdap.test.AbstractProgramManager.waitForRuns(AbstractProgramManager.java:96)
	at co.cask.cdap.test.AbstractProgramManager.waitForRun(AbstractProgramManager.java:90)
	at co.cask.cdap.app.etl.batch.NormalizeTest.startWorkFlow(NormalizeTest.java:131)
	at co.cask.cdap.app.etl.batch.NormalizeTest.testNormalize(NormalizeTest.java:165)
Collapse Failed RowDenormalizerTest test History
Distro Tests - CDH 5.5 10 mins
java.util.concurrent.TimeoutException: Timeout occurred. Expected true but found false.
	at co.cask.cdap.common.utils.Tasks.waitFor(Tasks.java:70)
	at co.cask.cdap.common.utils.Tasks.waitFor(Tasks.java:91)
	at co.cask.cdap.common.utils.Tasks.waitFor(Tasks.java:130)
	at co.cask.cdap.test.AbstractProgramManager.waitForRuns(AbstractProgramManager.java:96)
	at co.cask.cdap.test.AbstractProgramManager.waitForRun(AbstractProgramManager.java:90)
	at co.cask.cdap.app.etl.batch.RowDenormalizerTest.test(RowDenormalizerTest.java:102)
Collapse Failed TPFSParquetSinkSourceTest testMR History
Distro Tests - CDH 5.5 11 mins
java.util.concurrent.TimeoutException: Timeout occurred. Expected true but found false.
	at co.cask.cdap.common.utils.Tasks.waitFor(Tasks.java:70)
	at co.cask.cdap.common.utils.Tasks.waitFor(Tasks.java:91)
	at co.cask.cdap.common.utils.Tasks.waitFor(Tasks.java:130)
	at co.cask.cdap.test.AbstractProgramManager.waitForRuns(AbstractProgramManager.java:96)
	at co.cask.cdap.test.AbstractProgramManager.waitForRun(AbstractProgramManager.java:90)
	at co.cask.cdap.app.etl.batch.TPFSParquetSinkSourceTest.testTPFSWithProjection(TPFSParquetSinkSourceTest.java:91)
	at co.cask.cdap.app.etl.batch.TPFSParquetSinkSourceTest.testMR(TPFSParquetSinkSourceTest.java:61)
Collapse Failed TPFSParquetSinkSourceTest testSpark History
Distro Tests - CDH 5.5 11 mins
java.util.concurrent.TimeoutException: Timeout occurred. Expected true but found false.
	at co.cask.cdap.common.utils.Tasks.waitFor(Tasks.java:70)
	at co.cask.cdap.common.utils.Tasks.waitFor(Tasks.java:91)
	at co.cask.cdap.common.utils.Tasks.waitFor(Tasks.java:130)
	at co.cask.cdap.test.AbstractProgramManager.waitForRuns(AbstractProgramManager.java:96)
	at co.cask.cdap.test.AbstractProgramManager.waitForRun(AbstractProgramManager.java:90)
	at co.cask.cdap.app.etl.batch.TPFSParquetSinkSourceTest.testTPFSWithProjection(TPFSParquetSinkSourceTest.java:91)
	at co.cask.cdap.app.etl.batch.TPFSParquetSinkSourceTest.testSpark(TPFSParquetSinkSourceTest.java:69)
Collapse Failed ValueMapperTest test History
Distro Tests - CDH 5.5 11 mins
java.util.concurrent.TimeoutException: Timeout occurred. Expected true but found false.
	at co.cask.cdap.common.utils.Tasks.waitFor(Tasks.java:70)
	at co.cask.cdap.common.utils.Tasks.waitFor(Tasks.java:91)
	at co.cask.cdap.common.utils.Tasks.waitFor(Tasks.java:130)
	at co.cask.cdap.test.AbstractProgramManager.waitForRuns(AbstractProgramManager.java:96)
	at co.cask.cdap.test.AbstractProgramManager.waitForRun(AbstractProgramManager.java:90)
	at co.cask.cdap.app.etl.batch.ValueMapperTest.test(ValueMapperTest.java:138)
Collapse Failed XMLReaderTest testInvalidNodePathWithMoveAction History
Distro Tests - CDH 5.5 6 mins
java.util.concurrent.TimeoutException: Timeout occurred. Expected true but found false.
	at co.cask.cdap.common.utils.Tasks.waitFor(Tasks.java:70)
	at co.cask.cdap.common.utils.Tasks.waitFor(Tasks.java:91)
	at co.cask.cdap.common.utils.Tasks.waitFor(Tasks.java:130)
	at co.cask.cdap.test.AbstractProgramManager.waitForRuns(AbstractProgramManager.java:96)
	at co.cask.cdap.test.AbstractProgramManager.waitForRun(AbstractProgramManager.java:90)
	at co.cask.cdap.app.etl.batch.XMLReaderTest.startWorkFlow(XMLReaderTest.java:151)
	at co.cask.cdap.app.etl.batch.XMLReaderTest.testInvalidNodePathWithMoveAction(XMLReaderTest.java:304)
Collapse Failed XMLReaderTest testPreProcessingRequired History
Distro Tests - CDH 5.5 6 mins
java.util.concurrent.TimeoutException: Timeout occurred. Expected true but found false.
	at co.cask.cdap.common.utils.Tasks.waitFor(Tasks.java:70)
	at co.cask.cdap.common.utils.Tasks.waitFor(Tasks.java:91)
	at co.cask.cdap.common.utils.Tasks.waitFor(Tasks.java:130)
	at co.cask.cdap.test.AbstractProgramManager.waitForRuns(AbstractProgramManager.java:96)
	at co.cask.cdap.test.AbstractProgramManager.waitForRun(AbstractProgramManager.java:90)
	at co.cask.cdap.app.etl.batch.XMLReaderTest.startWorkFlow(XMLReaderTest.java:151)
	at co.cask.cdap.app.etl.batch.XMLReaderTest.testPreProcessingRequired(XMLReaderTest.java:252)
Collapse Failed XMLReaderTest testPatternWithDeleteAction History
Distro Tests - CDH 5.5 6 mins
java.util.concurrent.TimeoutException: Timeout occurred. Expected true but found false.
	at co.cask.cdap.common.utils.Tasks.waitFor(Tasks.java:70)
	at co.cask.cdap.common.utils.Tasks.waitFor(Tasks.java:91)
	at co.cask.cdap.common.utils.Tasks.waitFor(Tasks.java:130)
	at co.cask.cdap.test.AbstractProgramManager.waitForRuns(AbstractProgramManager.java:96)
	at co.cask.cdap.test.AbstractProgramManager.waitForRun(AbstractProgramManager.java:90)
	at co.cask.cdap.app.etl.batch.XMLReaderTest.startWorkFlow(XMLReaderTest.java:151)
	at co.cask.cdap.app.etl.batch.XMLReaderTest.testPatternWithDeleteAction(XMLReaderTest.java:354)
Collapse Failed XMLReaderTest testPreProcessingNotRequired History
Distro Tests - CDH 5.5 6 mins
java.util.concurrent.TimeoutException: Timeout occurred. Expected true but found false.
	at co.cask.cdap.common.utils.Tasks.waitFor(Tasks.java:70)
	at co.cask.cdap.common.utils.Tasks.waitFor(Tasks.java:91)
	at co.cask.cdap.common.utils.Tasks.waitFor(Tasks.java:130)
	at co.cask.cdap.test.AbstractProgramManager.waitForRuns(AbstractProgramManager.java:96)
	at co.cask.cdap.test.AbstractProgramManager.waitForRun(AbstractProgramManager.java:90)
	at co.cask.cdap.app.etl.batch.XMLReaderTest.startWorkFlow(XMLReaderTest.java:151)
	at co.cask.cdap.app.etl.batch.XMLReaderTest.testPreProcessingNotRequired(XMLReaderTest.java:192)
Collapse Failed DataStreamsTest testDataStreams History
Distro Tests - CDH 5.5 7 mins
java.util.concurrent.TimeoutException: Timeout occurred. Expected true but found false.
	at co.cask.cdap.common.utils.Tasks.waitFor(Tasks.java:70)
	at co.cask.cdap.common.utils.Tasks.waitFor(Tasks.java:91)
	at co.cask.cdap.app.etl.realtime.DataStreamsTest.verifyOutput(DataStreamsTest.java:156)
	at co.cask.cdap.app.etl.realtime.DataStreamsTest.testDataStreams(DataStreamsTest.java:146)
Collapse Failed WranglerTest testWranglerSpark History
Distro Tests - CDH 5.5 10 mins
java.util.concurrent.TimeoutException: Timeout occurred. Expected true but found false.
	at co.cask.cdap.common.utils.Tasks.waitFor(Tasks.java:70)
	at co.cask.cdap.common.utils.Tasks.waitFor(Tasks.java:91)
	at co.cask.cdap.common.utils.Tasks.waitFor(Tasks.java:130)
	at co.cask.cdap.test.AbstractProgramManager.waitForRuns(AbstractProgramManager.java:96)
	at co.cask.cdap.test.AbstractProgramManager.waitForRun(AbstractProgramManager.java:90)
	at co.cask.cdap.app.etl.wrangler.WranglerTest.testWrangler(WranglerTest.java:166)
	at co.cask.cdap.app.etl.wrangler.WranglerTest.testWranglerSpark(WranglerTest.java:88)
Collapse Failed WranglerTest testWranglerMR History
Distro Tests - CDH 5.5 10 mins
java.util.concurrent.TimeoutException: Timeout occurred. Expected true but found false.
	at co.cask.cdap.common.utils.Tasks.waitFor(Tasks.java:70)
	at co.cask.cdap.common.utils.Tasks.waitFor(Tasks.java:91)
	at co.cask.cdap.common.utils.Tasks.waitFor(Tasks.java:130)
	at co.cask.cdap.test.AbstractProgramManager.waitForRuns(AbstractProgramManager.java:96)
	at co.cask.cdap.test.AbstractProgramManager.waitForRun(AbstractProgramManager.java:90)
	at co.cask.cdap.app.etl.wrangler.WranglerTest.testWrangler(WranglerTest.java:166)
	at co.cask.cdap.app.etl.wrangler.WranglerTest.testWranglerMR(WranglerTest.java:80)
Collapse Failed PermissionTest test History
Distro Tests - CDH 5.5 5 mins
java.util.concurrent.TimeoutException: Timeout occurred. Expected true but found false.
	at co.cask.cdap.common.utils.Tasks.waitFor(Tasks.java:70)
	at co.cask.cdap.common.utils.Tasks.waitFor(Tasks.java:91)
	at co.cask.cdap.common.utils.Tasks.waitFor(Tasks.java:130)
	at co.cask.cdap.test.AbstractProgramManager.waitForRuns(AbstractProgramManager.java:96)
	at co.cask.cdap.app.fileset.PermissionTest.test(PermissionTest.java:160)
Collapse Failed ReadlessIncrementTest testReadlessIncrementsInMapReduce History
Distro Tests - CDH 5.5 5 mins
java.util.concurrent.TimeoutException: Timeout occurred. Expected true but found false.
	at co.cask.cdap.common.utils.Tasks.waitFor(Tasks.java:70)
	at co.cask.cdap.common.utils.Tasks.waitFor(Tasks.java:91)
	at co.cask.cdap.common.utils.Tasks.waitFor(Tasks.java:130)
	at co.cask.cdap.test.AbstractProgramManager.waitForRuns(AbstractProgramManager.java:96)
	at co.cask.cdap.test.AbstractProgramManager.waitForRun(AbstractProgramManager.java:90)
	at co.cask.cdap.app.mapreduce.readless.ReadlessIncrementTest.testReadlessIncrementsInMapReduce(ReadlessIncrementTest.java:67)
Collapse Failed FileSetTest test History
Distro Tests - CDH 5.5 5 mins
java.util.concurrent.TimeoutException: Timeout occurred. Expected true but found false.
	at co.cask.cdap.common.utils.Tasks.waitFor(Tasks.java:70)
	at co.cask.cdap.common.utils.Tasks.waitFor(Tasks.java:91)
	at co.cask.cdap.common.utils.Tasks.waitFor(Tasks.java:130)
	at co.cask.cdap.test.AbstractProgramManager.waitForRuns(AbstractProgramManager.java:96)
	at co.cask.cdap.test.AbstractProgramManager.waitForRun(AbstractProgramManager.java:90)
	at co.cask.cdap.apps.fileset.FileSetTest.test(FileSetTest.java:96)
Collapse Failed ProgramMetadataTest testWithLineage History
Distro Tests - CDH 5.5 5 mins
java.util.concurrent.TimeoutException: Timeout occurred. Expected true but found false.
	at co.cask.cdap.common.utils.Tasks.waitFor(Tasks.java:70)
	at co.cask.cdap.common.utils.Tasks.waitFor(Tasks.java:91)
	at co.cask.cdap.common.utils.Tasks.waitFor(Tasks.java:130)
	at co.cask.cdap.test.AbstractProgramManager.waitForRuns(AbstractProgramManager.java:96)
	at co.cask.cdap.test.AbstractProgramManager.waitForRun(AbstractProgramManager.java:90)
	at co.cask.cdap.apps.metadata.ProgramMetadataTest.testWithLineage(ProgramMetadataTest.java:96)