Build #5

Build: #5 failed Manual run by Rohit Sinha

Build result summary

Details

Completed
Duration
552 minutes
Flags
Custom build
Labels
None
Agent
bamboo-agent19
Revision
1ceebdff4044303d90fb6005f2c84634f95c8909 1ceebdff4044303d90fb6005f2c84634f95c8909
Total tests
55
Failing since
#1 (Manual run by Rohit Sinha)

Responsible

This build has been failing since #1
No one has taken responsibility

Custom variables

Name Value
cdap.cluster up36876-1000.coopr.sh
itn.cdap.password ******
itn.cdap.username cdap

Tests

New test failures 30
Status Test View job Duration
Collapse Failed KVTableWithProjectionTest testKVTableWithProjection History
Default Job 10 mins
java.util.concurrent.TimeoutException: Unable to connect to Authentication service to obtain access token, Connection info : CLIConnectionConfig{hostname=up36876-1000.coopr.sh, port=11015, sslEnabled=false}
	at co.cask.cdap.test.IntegrationTestBase.checkServicesWithRetry(IntegrationTestBase.java:267)
	at co.cask.cdap.test.IntegrationTestBase.fetchAccessToken(IntegrationTestBase.java:235)
	at co.cask.cdap.test.IntegrationTestBase.fetchAccessToken(IntegrationTestBase.java:220)
	at co.cask.cdap.test.IntegrationTestBase.checkSystemServices(IntegrationTestBase.java:198)
	at co.cask.cdap.test.IntegrationTestBase.setUp(IntegrationTestBase.java:99)
	at sun.reflect.GeneratedMethodAccessor1.invoke(Unknown Source)
	at sun.reflect.DelegatingMethodAccessorImpl.invoke(DelegatingMethodAccessorImpl.java:43)
(32 more lines...)
Collapse Failed BatchCubeSinkTest test History
Default Job 10 mins
java.util.concurrent.TimeoutException: Unable to connect to Authentication service to obtain access token, Connection info : CLIConnectionConfig{hostname=up36876-1000.coopr.sh, port=11015, sslEnabled=false}
	at co.cask.cdap.test.IntegrationTestBase.checkServicesWithRetry(IntegrationTestBase.java:267)
	at co.cask.cdap.test.IntegrationTestBase.fetchAccessToken(IntegrationTestBase.java:235)
	at co.cask.cdap.test.IntegrationTestBase.fetchAccessToken(IntegrationTestBase.java:220)
	at co.cask.cdap.test.IntegrationTestBase.checkSystemServices(IntegrationTestBase.java:198)
	at co.cask.cdap.test.IntegrationTestBase.setUp(IntegrationTestBase.java:99)
	at sun.reflect.NativeMethodAccessorImpl.invoke0(Native Method)
	at sun.reflect.NativeMethodAccessorImpl.invoke(NativeMethodAccessorImpl.java:62)
(33 more lines...)
Collapse Failed ETLMapReduceTest testTableToTableWithValidations History
Default Job 10 mins
java.util.concurrent.TimeoutException: Unable to connect to Authentication service to obtain access token, Connection info : CLIConnectionConfig{hostname=up36876-1000.coopr.sh, port=11015, sslEnabled=false}
	at co.cask.cdap.test.IntegrationTestBase.checkServicesWithRetry(IntegrationTestBase.java:267)
	at co.cask.cdap.test.IntegrationTestBase.fetchAccessToken(IntegrationTestBase.java:235)
	at co.cask.cdap.test.IntegrationTestBase.fetchAccessToken(IntegrationTestBase.java:220)
	at co.cask.cdap.test.IntegrationTestBase.checkSystemServices(IntegrationTestBase.java:198)
	at co.cask.cdap.test.IntegrationTestBase.setUp(IntegrationTestBase.java:99)
	at sun.reflect.NativeMethodAccessorImpl.invoke0(Native Method)
	at sun.reflect.NativeMethodAccessorImpl.invoke(NativeMethodAccessorImpl.java:62)
(33 more lines...)
Collapse Failed ETLMapReduceTest testKVToKV History
Default Job 10 mins
java.util.concurrent.TimeoutException: Unable to connect to Authentication service to obtain access token, Connection info : CLIConnectionConfig{hostname=up36876-1000.coopr.sh, port=11015, sslEnabled=false}
	at co.cask.cdap.test.IntegrationTestBase.checkServicesWithRetry(IntegrationTestBase.java:267)
	at co.cask.cdap.test.IntegrationTestBase.fetchAccessToken(IntegrationTestBase.java:235)
	at co.cask.cdap.test.IntegrationTestBase.fetchAccessToken(IntegrationTestBase.java:220)
	at co.cask.cdap.test.IntegrationTestBase.checkSystemServices(IntegrationTestBase.java:198)
	at co.cask.cdap.test.IntegrationTestBase.setUp(IntegrationTestBase.java:99)
	at sun.reflect.NativeMethodAccessorImpl.invoke0(Native Method)
	at sun.reflect.NativeMethodAccessorImpl.invoke(NativeMethodAccessorImpl.java:62)
(33 more lines...)
Collapse Failed ETLMapReduceTest testDAGInvalidSchema History
Default Job 10 mins
java.util.concurrent.TimeoutException: Unable to connect to Authentication service to obtain access token, Connection info : CLIConnectionConfig{hostname=up36876-1000.coopr.sh, port=11015, sslEnabled=false}
	at co.cask.cdap.test.IntegrationTestBase.checkServicesWithRetry(IntegrationTestBase.java:267)
	at co.cask.cdap.test.IntegrationTestBase.fetchAccessToken(IntegrationTestBase.java:235)
	at co.cask.cdap.test.IntegrationTestBase.fetchAccessToken(IntegrationTestBase.java:220)
	at co.cask.cdap.test.IntegrationTestBase.checkSystemServices(IntegrationTestBase.java:198)
	at co.cask.cdap.test.IntegrationTestBase.setUp(IntegrationTestBase.java:99)
	at sun.reflect.NativeMethodAccessorImpl.invoke0(Native Method)
	at sun.reflect.NativeMethodAccessorImpl.invoke(NativeMethodAccessorImpl.java:62)
(33 more lines...)
Collapse Failed ETLMapReduceTest testDAG History
Default Job 10 mins
java.util.concurrent.TimeoutException: Unable to connect to Authentication service to obtain access token, Connection info : CLIConnectionConfig{hostname=up36876-1000.coopr.sh, port=11015, sslEnabled=false}
	at co.cask.cdap.test.IntegrationTestBase.checkServicesWithRetry(IntegrationTestBase.java:267)
	at co.cask.cdap.test.IntegrationTestBase.fetchAccessToken(IntegrationTestBase.java:235)
	at co.cask.cdap.test.IntegrationTestBase.fetchAccessToken(IntegrationTestBase.java:220)
	at co.cask.cdap.test.IntegrationTestBase.checkSystemServices(IntegrationTestBase.java:198)
	at co.cask.cdap.test.IntegrationTestBase.setUp(IntegrationTestBase.java:99)
	at sun.reflect.NativeMethodAccessorImpl.invoke0(Native Method)
	at sun.reflect.NativeMethodAccessorImpl.invoke(NativeMethodAccessorImpl.java:62)
(33 more lines...)
Collapse Failed ExcelInputReaderTest testExcelReaderReprocessFalse History
Default Job 10 mins
java.util.concurrent.TimeoutException: Unable to connect to Authentication service to obtain access token, Connection info : CLIConnectionConfig{hostname=up36876-1000.coopr.sh, port=11015, sslEnabled=false}
	at co.cask.cdap.test.IntegrationTestBase.checkServicesWithRetry(IntegrationTestBase.java:267)
	at co.cask.cdap.test.IntegrationTestBase.fetchAccessToken(IntegrationTestBase.java:235)
	at co.cask.cdap.test.IntegrationTestBase.fetchAccessToken(IntegrationTestBase.java:220)
	at co.cask.cdap.test.IntegrationTestBase.checkSystemServices(IntegrationTestBase.java:198)
	at co.cask.cdap.test.IntegrationTestBase.setUp(IntegrationTestBase.java:99)
	at sun.reflect.NativeMethodAccessorImpl.invoke0(Native Method)
	at sun.reflect.NativeMethodAccessorImpl.invoke(NativeMethodAccessorImpl.java:62)
(33 more lines...)
Collapse Failed ExcelInputReaderTest testExcelReader History
Default Job 10 mins
java.util.concurrent.TimeoutException: Unable to connect to Authentication service to obtain access token, Connection info : CLIConnectionConfig{hostname=up36876-1000.coopr.sh, port=11015, sslEnabled=false}
	at co.cask.cdap.test.IntegrationTestBase.checkServicesWithRetry(IntegrationTestBase.java:267)
	at co.cask.cdap.test.IntegrationTestBase.fetchAccessToken(IntegrationTestBase.java:235)
	at co.cask.cdap.test.IntegrationTestBase.fetchAccessToken(IntegrationTestBase.java:220)
	at co.cask.cdap.test.IntegrationTestBase.checkSystemServices(IntegrationTestBase.java:198)
	at co.cask.cdap.test.IntegrationTestBase.setUp(IntegrationTestBase.java:99)
	at sun.reflect.NativeMethodAccessorImpl.invoke0(Native Method)
	at sun.reflect.NativeMethodAccessorImpl.invoke(NativeMethodAccessorImpl.java:62)
(33 more lines...)
Collapse Failed RowDenormalizerTest test History
Default Job 10 mins
java.util.concurrent.TimeoutException: Unable to connect to Authentication service to obtain access token, Connection info : CLIConnectionConfig{hostname=up36876-1000.coopr.sh, port=11015, sslEnabled=false}
	at co.cask.cdap.test.IntegrationTestBase.checkServicesWithRetry(IntegrationTestBase.java:267)
	at co.cask.cdap.test.IntegrationTestBase.fetchAccessToken(IntegrationTestBase.java:235)
	at co.cask.cdap.test.IntegrationTestBase.fetchAccessToken(IntegrationTestBase.java:220)
	at co.cask.cdap.test.IntegrationTestBase.checkSystemServices(IntegrationTestBase.java:198)
	at co.cask.cdap.test.IntegrationTestBase.setUp(IntegrationTestBase.java:99)
	at sun.reflect.GeneratedMethodAccessor1.invoke(Unknown Source)
	at sun.reflect.DelegatingMethodAccessorImpl.invoke(DelegatingMethodAccessorImpl.java:43)
(32 more lines...)
Collapse Failed TPFSSinkSourceTest testSpark History
Default Job 10 mins
java.util.concurrent.TimeoutException: Unable to connect to Authentication service to obtain access token, Connection info : CLIConnectionConfig{hostname=up36876-1000.coopr.sh, port=11015, sslEnabled=false}
	at co.cask.cdap.test.IntegrationTestBase.checkServicesWithRetry(IntegrationTestBase.java:267)
	at co.cask.cdap.test.IntegrationTestBase.fetchAccessToken(IntegrationTestBase.java:235)
	at co.cask.cdap.test.IntegrationTestBase.fetchAccessToken(IntegrationTestBase.java:220)
	at co.cask.cdap.test.IntegrationTestBase.checkSystemServices(IntegrationTestBase.java:198)
	at co.cask.cdap.test.IntegrationTestBase.setUp(IntegrationTestBase.java:99)
	at sun.reflect.GeneratedMethodAccessor1.invoke(Unknown Source)
	at sun.reflect.DelegatingMethodAccessorImpl.invoke(DelegatingMethodAccessorImpl.java:43)
(32 more lines...)
Collapse Failed TPFSSinkSourceTest testMR History
Default Job 10 mins
java.util.concurrent.TimeoutException: Unable to connect to Authentication service to obtain access token, Connection info : CLIConnectionConfig{hostname=up36876-1000.coopr.sh, port=11015, sslEnabled=false}
	at co.cask.cdap.test.IntegrationTestBase.checkServicesWithRetry(IntegrationTestBase.java:267)
	at co.cask.cdap.test.IntegrationTestBase.fetchAccessToken(IntegrationTestBase.java:235)
	at co.cask.cdap.test.IntegrationTestBase.fetchAccessToken(IntegrationTestBase.java:220)
	at co.cask.cdap.test.IntegrationTestBase.checkSystemServices(IntegrationTestBase.java:198)
	at co.cask.cdap.test.IntegrationTestBase.setUp(IntegrationTestBase.java:99)
	at sun.reflect.GeneratedMethodAccessor1.invoke(Unknown Source)
	at sun.reflect.DelegatingMethodAccessorImpl.invoke(DelegatingMethodAccessorImpl.java:43)
(32 more lines...)
Collapse Failed ValueMapperTest test History
Default Job 10 mins
java.util.concurrent.TimeoutException: Unable to connect to Authentication service to obtain access token, Connection info : CLIConnectionConfig{hostname=up36876-1000.coopr.sh, port=11015, sslEnabled=false}
	at co.cask.cdap.test.IntegrationTestBase.checkServicesWithRetry(IntegrationTestBase.java:267)
	at co.cask.cdap.test.IntegrationTestBase.fetchAccessToken(IntegrationTestBase.java:235)
	at co.cask.cdap.test.IntegrationTestBase.fetchAccessToken(IntegrationTestBase.java:220)
	at co.cask.cdap.test.IntegrationTestBase.checkSystemServices(IntegrationTestBase.java:198)
	at co.cask.cdap.test.IntegrationTestBase.setUp(IntegrationTestBase.java:99)
	at sun.reflect.GeneratedMethodAccessor1.invoke(Unknown Source)
	at sun.reflect.DelegatingMethodAccessorImpl.invoke(DelegatingMethodAccessorImpl.java:43)
(32 more lines...)
Collapse Failed XMLReaderTest testPreProcessingNotRequired History
Default Job 10 mins
java.util.concurrent.TimeoutException: Unable to connect to Authentication service to obtain access token, Connection info : CLIConnectionConfig{hostname=up36876-1000.coopr.sh, port=11015, sslEnabled=false}
	at co.cask.cdap.test.IntegrationTestBase.checkServicesWithRetry(IntegrationTestBase.java:267)
	at co.cask.cdap.test.IntegrationTestBase.fetchAccessToken(IntegrationTestBase.java:235)
	at co.cask.cdap.test.IntegrationTestBase.fetchAccessToken(IntegrationTestBase.java:220)
	at co.cask.cdap.test.IntegrationTestBase.checkSystemServices(IntegrationTestBase.java:198)
	at co.cask.cdap.test.IntegrationTestBase.setUp(IntegrationTestBase.java:99)
	at sun.reflect.GeneratedMethodAccessor1.invoke(Unknown Source)
	at sun.reflect.DelegatingMethodAccessorImpl.invoke(DelegatingMethodAccessorImpl.java:43)
(32 more lines...)
Collapse Failed XMLReaderTest testPatternWithDeleteAction History
Default Job 10 mins
java.util.concurrent.TimeoutException: Unable to connect to Authentication service to obtain access token, Connection info : CLIConnectionConfig{hostname=up36876-1000.coopr.sh, port=11015, sslEnabled=false}
	at co.cask.cdap.test.IntegrationTestBase.checkServicesWithRetry(IntegrationTestBase.java:267)
	at co.cask.cdap.test.IntegrationTestBase.fetchAccessToken(IntegrationTestBase.java:235)
	at co.cask.cdap.test.IntegrationTestBase.fetchAccessToken(IntegrationTestBase.java:220)
	at co.cask.cdap.test.IntegrationTestBase.checkSystemServices(IntegrationTestBase.java:198)
	at co.cask.cdap.test.IntegrationTestBase.setUp(IntegrationTestBase.java:99)
	at sun.reflect.GeneratedMethodAccessor1.invoke(Unknown Source)
	at sun.reflect.DelegatingMethodAccessorImpl.invoke(DelegatingMethodAccessorImpl.java:43)
(32 more lines...)
Collapse Failed XMLReaderTest testInvalidPatternWithDeleteAction History
Default Job 10 mins
java.util.concurrent.TimeoutException: Unable to connect to Authentication service to obtain access token, Connection info : CLIConnectionConfig{hostname=up36876-1000.coopr.sh, port=11015, sslEnabled=false}
	at co.cask.cdap.test.IntegrationTestBase.checkServicesWithRetry(IntegrationTestBase.java:267)
	at co.cask.cdap.test.IntegrationTestBase.fetchAccessToken(IntegrationTestBase.java:235)
	at co.cask.cdap.test.IntegrationTestBase.fetchAccessToken(IntegrationTestBase.java:220)
	at co.cask.cdap.test.IntegrationTestBase.checkSystemServices(IntegrationTestBase.java:198)
	at co.cask.cdap.test.IntegrationTestBase.setUp(IntegrationTestBase.java:99)
	at sun.reflect.GeneratedMethodAccessor1.invoke(Unknown Source)
	at sun.reflect.DelegatingMethodAccessorImpl.invoke(DelegatingMethodAccessorImpl.java:43)
(32 more lines...)
Collapse Failed DataStreamsTest testDataStreams History
Default Job 10 mins
java.util.concurrent.TimeoutException: Unable to connect to Authentication service to obtain access token, Connection info : CLIConnectionConfig{hostname=up36876-1000.coopr.sh, port=11015, sslEnabled=false}
	at co.cask.cdap.test.IntegrationTestBase.checkServicesWithRetry(IntegrationTestBase.java:267)
	at co.cask.cdap.test.IntegrationTestBase.fetchAccessToken(IntegrationTestBase.java:235)
	at co.cask.cdap.test.IntegrationTestBase.fetchAccessToken(IntegrationTestBase.java:220)
	at co.cask.cdap.test.IntegrationTestBase.checkSystemServices(IntegrationTestBase.java:198)
	at co.cask.cdap.test.IntegrationTestBase.setUp(IntegrationTestBase.java:99)
	at sun.reflect.NativeMethodAccessorImpl.invoke0(Native Method)
	at sun.reflect.NativeMethodAccessorImpl.invoke(NativeMethodAccessorImpl.java:62)
(33 more lines...)
Collapse Failed HangingWorkerTest testRestart History
Default Job 10 mins
java.util.concurrent.TimeoutException: Unable to connect to Authentication service to obtain access token, Connection info : CLIConnectionConfig{hostname=up36876-1000.coopr.sh, port=11015, sslEnabled=false}
	at co.cask.cdap.test.IntegrationTestBase.checkServicesWithRetry(IntegrationTestBase.java:267)
	at co.cask.cdap.test.IntegrationTestBase.fetchAccessToken(IntegrationTestBase.java:235)
	at co.cask.cdap.test.IntegrationTestBase.fetchAccessToken(IntegrationTestBase.java:220)
	at co.cask.cdap.test.IntegrationTestBase.checkSystemServices(IntegrationTestBase.java:198)
	at co.cask.cdap.test.IntegrationTestBase.setUp(IntegrationTestBase.java:99)
	at sun.reflect.GeneratedMethodAccessor1.invoke(Unknown Source)
	at sun.reflect.DelegatingMethodAccessorImpl.invoke(DelegatingMethodAccessorImpl.java:43)
(32 more lines...)
Collapse Failed ApplicationTest test History
Default Job 10 mins
java.util.concurrent.TimeoutException: Unable to connect to Authentication service to obtain access token, Connection info : CLIConnectionConfig{hostname=up36876-1000.coopr.sh, port=11015, sslEnabled=false}
	at co.cask.cdap.test.IntegrationTestBase.checkServicesWithRetry(IntegrationTestBase.java:267)
	at co.cask.cdap.test.IntegrationTestBase.fetchAccessToken(IntegrationTestBase.java:235)
	at co.cask.cdap.test.IntegrationTestBase.fetchAccessToken(IntegrationTestBase.java:220)
	at co.cask.cdap.test.IntegrationTestBase.checkSystemServices(IntegrationTestBase.java:198)
	at co.cask.cdap.test.IntegrationTestBase.setUp(IntegrationTestBase.java:99)
	at sun.reflect.NativeMethodAccessorImpl.invoke0(Native Method)
	at sun.reflect.NativeMethodAccessorImpl.invoke(NativeMethodAccessorImpl.java:62)
(33 more lines...)
Collapse Failed ApplicationVersionTest testAppVersionsCreationUpdateDeletion History
Default Job 10 mins
java.util.concurrent.TimeoutException: Unable to connect to Authentication service to obtain access token, Connection info : CLIConnectionConfig{hostname=up36876-1000.coopr.sh, port=11015, sslEnabled=false}
	at co.cask.cdap.test.IntegrationTestBase.checkServicesWithRetry(IntegrationTestBase.java:267)
	at co.cask.cdap.test.IntegrationTestBase.fetchAccessToken(IntegrationTestBase.java:235)
	at co.cask.cdap.test.IntegrationTestBase.fetchAccessToken(IntegrationTestBase.java:220)
	at co.cask.cdap.test.IntegrationTestBase.checkSystemServices(IntegrationTestBase.java:198)
	at co.cask.cdap.test.IntegrationTestBase.setUp(IntegrationTestBase.java:99)
	at sun.reflect.NativeMethodAccessorImpl.invoke0(Native Method)
	at sun.reflect.NativeMethodAccessorImpl.invoke(NativeMethodAccessorImpl.java:62)
(33 more lines...)
Collapse Failed DatasetTest test History
Default Job 10 mins
java.util.concurrent.TimeoutException: Unable to connect to Authentication service to obtain access token, Connection info : CLIConnectionConfig{hostname=up36876-1000.coopr.sh, port=11015, sslEnabled=false}
	at co.cask.cdap.test.IntegrationTestBase.checkServicesWithRetry(IntegrationTestBase.java:267)
	at co.cask.cdap.test.IntegrationTestBase.fetchAccessToken(IntegrationTestBase.java:235)
	at co.cask.cdap.test.IntegrationTestBase.fetchAccessToken(IntegrationTestBase.java:220)
	at co.cask.cdap.test.IntegrationTestBase.checkSystemServices(IntegrationTestBase.java:198)
	at co.cask.cdap.test.IntegrationTestBase.setUp(IntegrationTestBase.java:99)
	at sun.reflect.NativeMethodAccessorImpl.invoke0(Native Method)
	at sun.reflect.NativeMethodAccessorImpl.invoke(NativeMethodAccessorImpl.java:62)
(33 more lines...)
Collapse Failed NamespaceTest testNamespaces History
Default Job 10 mins
java.util.concurrent.TimeoutException: Unable to connect to Authentication service to obtain access token, Connection info : CLIConnectionConfig{hostname=up36876-1000.coopr.sh, port=11015, sslEnabled=false}
	at co.cask.cdap.test.IntegrationTestBase.checkServicesWithRetry(IntegrationTestBase.java:267)
	at co.cask.cdap.test.IntegrationTestBase.fetchAccessToken(IntegrationTestBase.java:235)
	at co.cask.cdap.test.IntegrationTestBase.fetchAccessToken(IntegrationTestBase.java:220)
	at co.cask.cdap.test.IntegrationTestBase.checkSystemServices(IntegrationTestBase.java:198)
	at co.cask.cdap.test.IntegrationTestBase.setUp(IntegrationTestBase.java:99)
	at sun.reflect.GeneratedMethodAccessor1.invoke(Unknown Source)
	at sun.reflect.DelegatingMethodAccessorImpl.invoke(DelegatingMethodAccessorImpl.java:43)
(32 more lines...)
Collapse Failed NamespacedStreamTest testNamespacedStreams History
Default Job 10 mins
java.util.concurrent.TimeoutException: Unable to connect to Authentication service to obtain access token, Connection info : CLIConnectionConfig{hostname=up36876-1000.coopr.sh, port=11015, sslEnabled=false}
	at co.cask.cdap.test.IntegrationTestBase.checkServicesWithRetry(IntegrationTestBase.java:267)
	at co.cask.cdap.test.IntegrationTestBase.fetchAccessToken(IntegrationTestBase.java:235)
	at co.cask.cdap.test.IntegrationTestBase.fetchAccessToken(IntegrationTestBase.java:220)
	at co.cask.cdap.test.IntegrationTestBase.checkSystemServices(IntegrationTestBase.java:198)
	at co.cask.cdap.test.IntegrationTestBase.setUp(IntegrationTestBase.java:99)
	at sun.reflect.GeneratedMethodAccessor1.invoke(Unknown Source)
	at sun.reflect.DelegatingMethodAccessorImpl.invoke(DelegatingMethodAccessorImpl.java:43)
(32 more lines...)
Collapse Failed StreamTest testNonexistentStreams History
Default Job 10 mins
java.util.concurrent.TimeoutException: Unable to connect to Authentication service to obtain access token, Connection info : CLIConnectionConfig{hostname=up36876-1000.coopr.sh, port=11015, sslEnabled=false}
	at co.cask.cdap.test.IntegrationTestBase.checkServicesWithRetry(IntegrationTestBase.java:267)
	at co.cask.cdap.test.IntegrationTestBase.fetchAccessToken(IntegrationTestBase.java:235)
	at co.cask.cdap.test.IntegrationTestBase.fetchAccessToken(IntegrationTestBase.java:220)
	at co.cask.cdap.test.IntegrationTestBase.checkSystemServices(IntegrationTestBase.java:198)
	at co.cask.cdap.test.IntegrationTestBase.setUp(IntegrationTestBase.java:99)
	at sun.reflect.GeneratedMethodAccessor1.invoke(Unknown Source)
	at sun.reflect.DelegatingMethodAccessorImpl.invoke(DelegatingMethodAccessorImpl.java:43)
(32 more lines...)
Collapse Failed StreamTest testStreams History
Default Job 10 mins
java.util.concurrent.TimeoutException: Unable to connect to Authentication service to obtain access token, Connection info : CLIConnectionConfig{hostname=up36876-1000.coopr.sh, port=11015, sslEnabled=false}
	at co.cask.cdap.test.IntegrationTestBase.checkServicesWithRetry(IntegrationTestBase.java:267)
	at co.cask.cdap.test.IntegrationTestBase.fetchAccessToken(IntegrationTestBase.java:235)
	at co.cask.cdap.test.IntegrationTestBase.fetchAccessToken(IntegrationTestBase.java:220)
	at co.cask.cdap.test.IntegrationTestBase.checkSystemServices(IntegrationTestBase.java:198)
	at co.cask.cdap.test.IntegrationTestBase.setUp(IntegrationTestBase.java:99)
	at sun.reflect.GeneratedMethodAccessor1.invoke(Unknown Source)
	at sun.reflect.DelegatingMethodAccessorImpl.invoke(DelegatingMethodAccessorImpl.java:43)
(32 more lines...)
Collapse Failed PurchaseMetadataTest testLineage History
Default Job 10 mins
java.util.concurrent.TimeoutException: Unable to connect to Authentication service to obtain access token, Connection info : CLIConnectionConfig{hostname=up36876-1000.coopr.sh, port=11015, sslEnabled=false}
	at co.cask.cdap.test.IntegrationTestBase.checkServicesWithRetry(IntegrationTestBase.java:267)
	at co.cask.cdap.test.IntegrationTestBase.fetchAccessToken(IntegrationTestBase.java:235)
	at co.cask.cdap.test.IntegrationTestBase.fetchAccessToken(IntegrationTestBase.java:220)
	at co.cask.cdap.test.IntegrationTestBase.checkSystemServices(IntegrationTestBase.java:198)
	at co.cask.cdap.test.IntegrationTestBase.setUp(IntegrationTestBase.java:99)
	at sun.reflect.GeneratedMethodAccessor1.invoke(Unknown Source)
	at sun.reflect.DelegatingMethodAccessorImpl.invoke(DelegatingMethodAccessorImpl.java:43)
(32 more lines...)
Collapse Failed TransactionTimeoutTest testFlowletTimeouts History
Default Job 10 mins
java.util.concurrent.TimeoutException: Unable to connect to Authentication service to obtain access token, Connection info : CLIConnectionConfig{hostname=up36876-1000.coopr.sh, port=11015, sslEnabled=false}
	at co.cask.cdap.test.IntegrationTestBase.checkServicesWithRetry(IntegrationTestBase.java:267)
	at co.cask.cdap.test.IntegrationTestBase.fetchAccessToken(IntegrationTestBase.java:235)
	at co.cask.cdap.test.IntegrationTestBase.fetchAccessToken(IntegrationTestBase.java:220)
	at co.cask.cdap.test.IntegrationTestBase.checkSystemServices(IntegrationTestBase.java:198)
	at co.cask.cdap.test.IntegrationTestBase.setUp(IntegrationTestBase.java:99)
	at sun.reflect.GeneratedMethodAccessor1.invoke(Unknown Source)
	at sun.reflect.DelegatingMethodAccessorImpl.invoke(DelegatingMethodAccessorImpl.java:43)
(32 more lines...)
Collapse Failed WordCountTest test History
Default Job 10 mins
java.util.concurrent.TimeoutException: Unable to connect to Authentication service to obtain access token, Connection info : CLIConnectionConfig{hostname=up36876-1000.coopr.sh, port=11015, sslEnabled=false}
	at co.cask.cdap.test.IntegrationTestBase.checkServicesWithRetry(IntegrationTestBase.java:267)
	at co.cask.cdap.test.IntegrationTestBase.fetchAccessToken(IntegrationTestBase.java:235)
	at co.cask.cdap.test.IntegrationTestBase.fetchAccessToken(IntegrationTestBase.java:220)
	at co.cask.cdap.test.IntegrationTestBase.checkSystemServices(IntegrationTestBase.java:198)
	at co.cask.cdap.test.IntegrationTestBase.setUp(IntegrationTestBase.java:99)
	at sun.reflect.GeneratedMethodAccessor1.invoke(Unknown Source)
	at sun.reflect.DelegatingMethodAccessorImpl.invoke(DelegatingMethodAccessorImpl.java:43)
(32 more lines...)
Collapse Failed OperationalStatsTest testCDAPStats History
Default Job 10 mins
java.util.concurrent.TimeoutException: Unable to connect to Authentication service to obtain access token, Connection info : CLIConnectionConfig{hostname=up36876-1000.coopr.sh, port=11015, sslEnabled=false}
	at co.cask.cdap.test.IntegrationTestBase.checkServicesWithRetry(IntegrationTestBase.java:267)
	at co.cask.cdap.test.IntegrationTestBase.fetchAccessToken(IntegrationTestBase.java:235)
	at co.cask.cdap.test.IntegrationTestBase.fetchAccessToken(IntegrationTestBase.java:220)
	at co.cask.cdap.test.IntegrationTestBase.checkSystemServices(IntegrationTestBase.java:198)
	at co.cask.cdap.test.IntegrationTestBase.setUp(IntegrationTestBase.java:99)
	at sun.reflect.GeneratedMethodAccessor1.invoke(Unknown Source)
	at sun.reflect.DelegatingMethodAccessorImpl.invoke(DelegatingMethodAccessorImpl.java:43)
(32 more lines...)
Collapse Failed RemoteCubeTest test History
Default Job 10 mins
java.util.concurrent.TimeoutException: Unable to connect to Authentication service to obtain access token, Connection info : CLIConnectionConfig{hostname=up36876-1000.coopr.sh, port=11015, sslEnabled=false}
	at co.cask.cdap.test.IntegrationTestBase.checkServicesWithRetry(IntegrationTestBase.java:267)
	at co.cask.cdap.test.IntegrationTestBase.fetchAccessToken(IntegrationTestBase.java:235)
	at co.cask.cdap.test.IntegrationTestBase.fetchAccessToken(IntegrationTestBase.java:220)
	at co.cask.cdap.test.IntegrationTestBase.checkSystemServices(IntegrationTestBase.java:198)
	at co.cask.cdap.test.IntegrationTestBase.setUp(IntegrationTestBase.java:99)
	at sun.reflect.GeneratedMethodAccessor1.invoke(Unknown Source)
	at sun.reflect.DelegatingMethodAccessorImpl.invoke(DelegatingMethodAccessorImpl.java:43)
(32 more lines...)
Collapse Failed RemoteTableTest test History
Default Job 10 mins
java.util.concurrent.TimeoutException: Unable to connect to Authentication service to obtain access token, Connection info : CLIConnectionConfig{hostname=up36876-1000.coopr.sh, port=11015, sslEnabled=false}
	at co.cask.cdap.test.IntegrationTestBase.checkServicesWithRetry(IntegrationTestBase.java:267)
	at co.cask.cdap.test.IntegrationTestBase.fetchAccessToken(IntegrationTestBase.java:235)
	at co.cask.cdap.test.IntegrationTestBase.fetchAccessToken(IntegrationTestBase.java:220)
	at co.cask.cdap.test.IntegrationTestBase.checkSystemServices(IntegrationTestBase.java:198)
	at co.cask.cdap.test.IntegrationTestBase.setUp(IntegrationTestBase.java:99)
	at sun.reflect.GeneratedMethodAccessor1.invoke(Unknown Source)
	at sun.reflect.DelegatingMethodAccessorImpl.invoke(DelegatingMethodAccessorImpl.java:43)
(32 more lines...)
Existing test failures 25
Status Test Failing since View job Duration
java.util.concurrent.TimeoutException: Unable to connect to Authentication service to obtain access token, Connection info : CLIConnectionConfig{hostname=up36876-1000.coopr.sh, port=11015, sslEnabled=false}
	at co.cask.cdap.test.IntegrationTestBase.checkServicesWithRetry(IntegrationTestBase.java:267)
	at co.cask.cdap.test.IntegrationTestBase.fetchAccessToken(IntegrationTestBase.java:235)
	at co.cask.cdap.test.IntegrationTestBase.fetchAccessToken(IntegrationTestBase.java:220)
	at co.cask.cdap.test.IntegrationTestBase.checkSystemServices(IntegrationTestBase.java:198)
	at co.cask.cdap.test.IntegrationTestBase.setUp(IntegrationTestBase.java:99)
	at sun.reflect.GeneratedMethodAccessor1.invoke(Unknown Source)
	at sun.reflect.DelegatingMethodAccessorImpl.invoke(DelegatingMethodAccessorImpl.java:43)
(32 more lines...)
java.util.concurrent.TimeoutException: Unable to connect to Authentication service to obtain access token, Connection info : CLIConnectionConfig{hostname=up36876-1000.coopr.sh, port=11015, sslEnabled=false}
	at co.cask.cdap.test.IntegrationTestBase.checkServicesWithRetry(IntegrationTestBase.java:267)
	at co.cask.cdap.test.IntegrationTestBase.fetchAccessToken(IntegrationTestBase.java:235)
	at co.cask.cdap.test.IntegrationTestBase.fetchAccessToken(IntegrationTestBase.java:220)
	at co.cask.cdap.test.IntegrationTestBase.checkSystemServices(IntegrationTestBase.java:198)
	at co.cask.cdap.test.IntegrationTestBase.setUp(IntegrationTestBase.java:99)
	at sun.reflect.NativeMethodAccessorImpl.invoke0(Native Method)
	at sun.reflect.NativeMethodAccessorImpl.invoke(NativeMethodAccessorImpl.java:62)
(33 more lines...)
java.util.concurrent.TimeoutException: Unable to connect to Authentication service to obtain access token, Connection info : CLIConnectionConfig{hostname=up36876-1000.coopr.sh, port=11015, sslEnabled=false}
	at co.cask.cdap.test.IntegrationTestBase.checkServicesWithRetry(IntegrationTestBase.java:267)
	at co.cask.cdap.test.IntegrationTestBase.fetchAccessToken(IntegrationTestBase.java:235)
	at co.cask.cdap.test.IntegrationTestBase.fetchAccessToken(IntegrationTestBase.java:220)
	at co.cask.cdap.test.IntegrationTestBase.checkSystemServices(IntegrationTestBase.java:198)
	at co.cask.cdap.test.IntegrationTestBase.setUp(IntegrationTestBase.java:99)
	at sun.reflect.NativeMethodAccessorImpl.invoke0(Native Method)
	at sun.reflect.NativeMethodAccessorImpl.invoke(NativeMethodAccessorImpl.java:62)
(33 more lines...)
java.util.concurrent.TimeoutException: Unable to connect to Authentication service to obtain access token, Connection info : CLIConnectionConfig{hostname=up36876-1000.coopr.sh, port=11015, sslEnabled=false}
	at co.cask.cdap.test.IntegrationTestBase.checkServicesWithRetry(IntegrationTestBase.java:267)
	at co.cask.cdap.test.IntegrationTestBase.fetchAccessToken(IntegrationTestBase.java:235)
	at co.cask.cdap.test.IntegrationTestBase.fetchAccessToken(IntegrationTestBase.java:220)
	at co.cask.cdap.test.IntegrationTestBase.checkSystemServices(IntegrationTestBase.java:198)
	at co.cask.cdap.test.IntegrationTestBase.setUp(IntegrationTestBase.java:99)
	at sun.reflect.NativeMethodAccessorImpl.invoke0(Native Method)
	at sun.reflect.NativeMethodAccessorImpl.invoke(NativeMethodAccessorImpl.java:62)
(33 more lines...)
java.util.concurrent.TimeoutException: Unable to connect to Authentication service to obtain access token, Connection info : CLIConnectionConfig{hostname=up36876-1000.coopr.sh, port=11015, sslEnabled=false}
	at co.cask.cdap.test.IntegrationTestBase.checkServicesWithRetry(IntegrationTestBase.java:267)
	at co.cask.cdap.test.IntegrationTestBase.fetchAccessToken(IntegrationTestBase.java:235)
	at co.cask.cdap.test.IntegrationTestBase.fetchAccessToken(IntegrationTestBase.java:220)
	at co.cask.cdap.test.IntegrationTestBase.checkSystemServices(IntegrationTestBase.java:198)
	at co.cask.cdap.test.IntegrationTestBase.setUp(IntegrationTestBase.java:99)
	at sun.reflect.NativeMethodAccessorImpl.invoke0(Native Method)
	at sun.reflect.NativeMethodAccessorImpl.invoke(NativeMethodAccessorImpl.java:62)
(33 more lines...)
java.util.concurrent.TimeoutException: Unable to connect to Authentication service to obtain access token, Connection info : CLIConnectionConfig{hostname=up36876-1000.coopr.sh, port=11015, sslEnabled=false}
	at co.cask.cdap.test.IntegrationTestBase.checkServicesWithRetry(IntegrationTestBase.java:267)
	at co.cask.cdap.test.IntegrationTestBase.fetchAccessToken(IntegrationTestBase.java:235)
	at co.cask.cdap.test.IntegrationTestBase.fetchAccessToken(IntegrationTestBase.java:220)
	at co.cask.cdap.test.IntegrationTestBase.checkSystemServices(IntegrationTestBase.java:198)
	at co.cask.cdap.test.IntegrationTestBase.setUp(IntegrationTestBase.java:99)
	at sun.reflect.GeneratedMethodAccessor1.invoke(Unknown Source)
	at sun.reflect.DelegatingMethodAccessorImpl.invoke(DelegatingMethodAccessorImpl.java:43)
(32 more lines...)
java.util.concurrent.TimeoutException: Unable to connect to Authentication service to obtain access token, Connection info : CLIConnectionConfig{hostname=up36876-1000.coopr.sh, port=11015, sslEnabled=false}
	at co.cask.cdap.test.IntegrationTestBase.checkServicesWithRetry(IntegrationTestBase.java:267)
	at co.cask.cdap.test.IntegrationTestBase.fetchAccessToken(IntegrationTestBase.java:235)
	at co.cask.cdap.test.IntegrationTestBase.fetchAccessToken(IntegrationTestBase.java:220)
	at co.cask.cdap.test.IntegrationTestBase.checkSystemServices(IntegrationTestBase.java:198)
	at co.cask.cdap.test.IntegrationTestBase.setUp(IntegrationTestBase.java:99)
	at sun.reflect.GeneratedMethodAccessor1.invoke(Unknown Source)
	at sun.reflect.DelegatingMethodAccessorImpl.invoke(DelegatingMethodAccessorImpl.java:43)
(33 more lines...)
java.util.concurrent.TimeoutException: Unable to connect to Authentication service to obtain access token, Connection info : CLIConnectionConfig{hostname=up36876-1000.coopr.sh, port=11015, sslEnabled=false}
	at co.cask.cdap.test.IntegrationTestBase.checkServicesWithRetry(IntegrationTestBase.java:267)
	at co.cask.cdap.test.IntegrationTestBase.fetchAccessToken(IntegrationTestBase.java:235)
	at co.cask.cdap.test.IntegrationTestBase.fetchAccessToken(IntegrationTestBase.java:220)
	at co.cask.cdap.test.IntegrationTestBase.checkSystemServices(IntegrationTestBase.java:198)
	at co.cask.cdap.test.IntegrationTestBase.setUp(IntegrationTestBase.java:99)
	at sun.reflect.GeneratedMethodAccessor1.invoke(Unknown Source)
	at sun.reflect.DelegatingMethodAccessorImpl.invoke(DelegatingMethodAccessorImpl.java:43)
(33 more lines...)
java.util.concurrent.TimeoutException: Unable to connect to Authentication service to obtain access token, Connection info : CLIConnectionConfig{hostname=up36876-1000.coopr.sh, port=11015, sslEnabled=false}
	at co.cask.cdap.test.IntegrationTestBase.checkServicesWithRetry(IntegrationTestBase.java:267)
	at co.cask.cdap.test.IntegrationTestBase.fetchAccessToken(IntegrationTestBase.java:235)
	at co.cask.cdap.test.IntegrationTestBase.fetchAccessToken(IntegrationTestBase.java:220)
	at co.cask.cdap.test.IntegrationTestBase.checkSystemServices(IntegrationTestBase.java:198)
	at co.cask.cdap.test.IntegrationTestBase.setUp(IntegrationTestBase.java:99)
	at sun.reflect.GeneratedMethodAccessor1.invoke(Unknown Source)
	at sun.reflect.DelegatingMethodAccessorImpl.invoke(DelegatingMethodAccessorImpl.java:43)
(32 more lines...)
java.util.concurrent.TimeoutException: Unable to connect to Authentication service to obtain access token, Connection info : CLIConnectionConfig{hostname=up36876-1000.coopr.sh, port=11015, sslEnabled=false}
	at co.cask.cdap.test.IntegrationTestBase.checkServicesWithRetry(IntegrationTestBase.java:267)
	at co.cask.cdap.test.IntegrationTestBase.fetchAccessToken(IntegrationTestBase.java:235)
	at co.cask.cdap.test.IntegrationTestBase.fetchAccessToken(IntegrationTestBase.java:220)
	at co.cask.cdap.test.IntegrationTestBase.checkSystemServices(IntegrationTestBase.java:198)
	at co.cask.cdap.test.IntegrationTestBase.setUp(IntegrationTestBase.java:99)
	at sun.reflect.GeneratedMethodAccessor1.invoke(Unknown Source)
	at sun.reflect.DelegatingMethodAccessorImpl.invoke(DelegatingMethodAccessorImpl.java:43)
(32 more lines...)
java.util.concurrent.TimeoutException: Unable to connect to Authentication service to obtain access token, Connection info : CLIConnectionConfig{hostname=up36876-1000.coopr.sh, port=11015, sslEnabled=false}
	at co.cask.cdap.test.IntegrationTestBase.checkServicesWithRetry(IntegrationTestBase.java:267)
	at co.cask.cdap.test.IntegrationTestBase.fetchAccessToken(IntegrationTestBase.java:235)
	at co.cask.cdap.test.IntegrationTestBase.fetchAccessToken(IntegrationTestBase.java:220)
	at co.cask.cdap.test.IntegrationTestBase.checkSystemServices(IntegrationTestBase.java:198)
	at co.cask.cdap.test.IntegrationTestBase.setUp(IntegrationTestBase.java:99)
	at sun.reflect.GeneratedMethodAccessor1.invoke(Unknown Source)
	at sun.reflect.DelegatingMethodAccessorImpl.invoke(DelegatingMethodAccessorImpl.java:43)
(32 more lines...)
java.util.concurrent.TimeoutException: Unable to connect to Authentication service to obtain access token, Connection info : CLIConnectionConfig{hostname=up36876-1000.coopr.sh, port=11015, sslEnabled=false}
	at co.cask.cdap.test.IntegrationTestBase.checkServicesWithRetry(IntegrationTestBase.java:267)
	at co.cask.cdap.test.IntegrationTestBase.fetchAccessToken(IntegrationTestBase.java:235)
	at co.cask.cdap.test.IntegrationTestBase.fetchAccessToken(IntegrationTestBase.java:220)
	at co.cask.cdap.test.IntegrationTestBase.checkSystemServices(IntegrationTestBase.java:198)
	at co.cask.cdap.test.IntegrationTestBase.setUp(IntegrationTestBase.java:99)
	at sun.reflect.GeneratedMethodAccessor1.invoke(Unknown Source)
	at sun.reflect.DelegatingMethodAccessorImpl.invoke(DelegatingMethodAccessorImpl.java:43)
(32 more lines...)
java.util.concurrent.TimeoutException: Unable to connect to Authentication service to obtain access token, Connection info : CLIConnectionConfig{hostname=up36876-1000.coopr.sh, port=11015, sslEnabled=false}
	at co.cask.cdap.test.IntegrationTestBase.checkServicesWithRetry(IntegrationTestBase.java:267)
	at co.cask.cdap.test.IntegrationTestBase.fetchAccessToken(IntegrationTestBase.java:235)
	at co.cask.cdap.test.IntegrationTestBase.fetchAccessToken(IntegrationTestBase.java:220)
	at co.cask.cdap.test.IntegrationTestBase.checkSystemServices(IntegrationTestBase.java:198)
	at co.cask.cdap.test.IntegrationTestBase.setUp(IntegrationTestBase.java:99)
	at sun.reflect.GeneratedMethodAccessor1.invoke(Unknown Source)
	at sun.reflect.DelegatingMethodAccessorImpl.invoke(DelegatingMethodAccessorImpl.java:43)
(32 more lines...)
java.util.concurrent.TimeoutException: Unable to connect to Authentication service to obtain access token, Connection info : CLIConnectionConfig{hostname=up36876-1000.coopr.sh, port=11015, sslEnabled=false}
	at co.cask.cdap.test.IntegrationTestBase.checkServicesWithRetry(IntegrationTestBase.java:267)
	at co.cask.cdap.test.IntegrationTestBase.fetchAccessToken(IntegrationTestBase.java:235)
	at co.cask.cdap.test.IntegrationTestBase.fetchAccessToken(IntegrationTestBase.java:220)
	at co.cask.cdap.test.IntegrationTestBase.checkSystemServices(IntegrationTestBase.java:198)
	at co.cask.cdap.test.IntegrationTestBase.setUp(IntegrationTestBase.java:99)
	at sun.reflect.GeneratedMethodAccessor1.invoke(Unknown Source)
	at sun.reflect.DelegatingMethodAccessorImpl.invoke(DelegatingMethodAccessorImpl.java:43)
(32 more lines...)
java.util.concurrent.TimeoutException: Unable to connect to Authentication service to obtain access token, Connection info : CLIConnectionConfig{hostname=up36876-1000.coopr.sh, port=11015, sslEnabled=false}
	at co.cask.cdap.test.IntegrationTestBase.checkServicesWithRetry(IntegrationTestBase.java:267)
	at co.cask.cdap.test.IntegrationTestBase.fetchAccessToken(IntegrationTestBase.java:235)
	at co.cask.cdap.test.IntegrationTestBase.fetchAccessToken(IntegrationTestBase.java:220)
	at co.cask.cdap.test.IntegrationTestBase.checkSystemServices(IntegrationTestBase.java:198)
	at co.cask.cdap.test.IntegrationTestBase.setUp(IntegrationTestBase.java:99)
	at sun.reflect.GeneratedMethodAccessor1.invoke(Unknown Source)
	at sun.reflect.DelegatingMethodAccessorImpl.invoke(DelegatingMethodAccessorImpl.java:43)
(32 more lines...)
java.util.concurrent.TimeoutException: Unable to connect to Authentication service to obtain access token, Connection info : CLIConnectionConfig{hostname=up36876-1000.coopr.sh, port=11015, sslEnabled=false}
	at co.cask.cdap.test.IntegrationTestBase.checkServicesWithRetry(IntegrationTestBase.java:267)
	at co.cask.cdap.test.IntegrationTestBase.fetchAccessToken(IntegrationTestBase.java:235)
	at co.cask.cdap.test.IntegrationTestBase.fetchAccessToken(IntegrationTestBase.java:220)
	at co.cask.cdap.test.IntegrationTestBase.checkSystemServices(IntegrationTestBase.java:198)
	at co.cask.cdap.test.IntegrationTestBase.setUp(IntegrationTestBase.java:99)
	at sun.reflect.GeneratedMethodAccessor1.invoke(Unknown Source)
	at sun.reflect.DelegatingMethodAccessorImpl.invoke(DelegatingMethodAccessorImpl.java:43)
(32 more lines...)
java.util.concurrent.TimeoutException: Unable to connect to Authentication service to obtain access token, Connection info : CLIConnectionConfig{hostname=up36876-1000.coopr.sh, port=11015, sslEnabled=false}
	at co.cask.cdap.test.IntegrationTestBase.checkServicesWithRetry(IntegrationTestBase.java:267)
	at co.cask.cdap.test.IntegrationTestBase.fetchAccessToken(IntegrationTestBase.java:235)
	at co.cask.cdap.test.IntegrationTestBase.fetchAccessToken(IntegrationTestBase.java:220)
	at co.cask.cdap.test.IntegrationTestBase.checkSystemServices(IntegrationTestBase.java:198)
	at co.cask.cdap.test.IntegrationTestBase.setUp(IntegrationTestBase.java:99)
	at sun.reflect.GeneratedMethodAccessor1.invoke(Unknown Source)
	at sun.reflect.DelegatingMethodAccessorImpl.invoke(DelegatingMethodAccessorImpl.java:43)
(32 more lines...)
java.util.concurrent.TimeoutException: Unable to connect to Authentication service to obtain access token, Connection info : CLIConnectionConfig{hostname=up36876-1000.coopr.sh, port=11015, sslEnabled=false}
	at co.cask.cdap.test.IntegrationTestBase.checkServicesWithRetry(IntegrationTestBase.java:267)
	at co.cask.cdap.test.IntegrationTestBase.fetchAccessToken(IntegrationTestBase.java:235)
	at co.cask.cdap.test.IntegrationTestBase.fetchAccessToken(IntegrationTestBase.java:220)
	at co.cask.cdap.test.IntegrationTestBase.checkSystemServices(IntegrationTestBase.java:198)
	at co.cask.cdap.test.IntegrationTestBase.setUp(IntegrationTestBase.java:99)
	at sun.reflect.NativeMethodAccessorImpl.invoke0(Native Method)
	at sun.reflect.NativeMethodAccessorImpl.invoke(NativeMethodAccessorImpl.java:62)
(33 more lines...)
java.util.concurrent.TimeoutException: Unable to connect to Authentication service to obtain access token, Connection info : CLIConnectionConfig{hostname=up36876-1000.coopr.sh, port=11015, sslEnabled=false}
	at co.cask.cdap.test.IntegrationTestBase.checkServicesWithRetry(IntegrationTestBase.java:267)
	at co.cask.cdap.test.IntegrationTestBase.fetchAccessToken(IntegrationTestBase.java:235)
	at co.cask.cdap.test.IntegrationTestBase.fetchAccessToken(IntegrationTestBase.java:220)
	at co.cask.cdap.test.IntegrationTestBase.checkSystemServices(IntegrationTestBase.java:198)
	at co.cask.cdap.test.IntegrationTestBase.setUp(IntegrationTestBase.java:99)
	at sun.reflect.GeneratedMethodAccessor1.invoke(Unknown Source)
	at sun.reflect.DelegatingMethodAccessorImpl.invoke(DelegatingMethodAccessorImpl.java:43)
(32 more lines...)
java.util.concurrent.TimeoutException: Unable to connect to Authentication service to obtain access token, Connection info : CLIConnectionConfig{hostname=up36876-1000.coopr.sh, port=11015, sslEnabled=false}
	at co.cask.cdap.test.IntegrationTestBase.checkServicesWithRetry(IntegrationTestBase.java:267)
	at co.cask.cdap.test.IntegrationTestBase.fetchAccessToken(IntegrationTestBase.java:235)
	at co.cask.cdap.test.IntegrationTestBase.fetchAccessToken(IntegrationTestBase.java:220)
	at co.cask.cdap.test.IntegrationTestBase.checkSystemServices(IntegrationTestBase.java:198)
	at co.cask.cdap.test.IntegrationTestBase.setUp(IntegrationTestBase.java:99)
	at sun.reflect.GeneratedMethodAccessor1.invoke(Unknown Source)
	at sun.reflect.DelegatingMethodAccessorImpl.invoke(DelegatingMethodAccessorImpl.java:43)
(32 more lines...)
java.util.concurrent.TimeoutException: Unable to connect to Authentication service to obtain access token, Connection info : CLIConnectionConfig{hostname=up36876-1000.coopr.sh, port=11015, sslEnabled=false}
	at co.cask.cdap.test.IntegrationTestBase.checkServicesWithRetry(IntegrationTestBase.java:267)
	at co.cask.cdap.test.IntegrationTestBase.fetchAccessToken(IntegrationTestBase.java:235)
	at co.cask.cdap.test.IntegrationTestBase.fetchAccessToken(IntegrationTestBase.java:220)
	at co.cask.cdap.test.IntegrationTestBase.checkSystemServices(IntegrationTestBase.java:198)
	at co.cask.cdap.test.IntegrationTestBase.setUp(IntegrationTestBase.java:99)
	at sun.reflect.GeneratedMethodAccessor1.invoke(Unknown Source)
	at sun.reflect.DelegatingMethodAccessorImpl.invoke(DelegatingMethodAccessorImpl.java:43)
(32 more lines...)
java.util.concurrent.TimeoutException: Unable to connect to Authentication service to obtain access token, Connection info : CLIConnectionConfig{hostname=up36876-1000.coopr.sh, port=11015, sslEnabled=false}
	at co.cask.cdap.test.IntegrationTestBase.checkServicesWithRetry(IntegrationTestBase.java:267)
	at co.cask.cdap.test.IntegrationTestBase.fetchAccessToken(IntegrationTestBase.java:235)
	at co.cask.cdap.test.IntegrationTestBase.fetchAccessToken(IntegrationTestBase.java:220)
	at co.cask.cdap.test.IntegrationTestBase.checkSystemServices(IntegrationTestBase.java:198)
	at co.cask.cdap.test.IntegrationTestBase.setUp(IntegrationTestBase.java:99)
	at sun.reflect.GeneratedMethodAccessor1.invoke(Unknown Source)
	at sun.reflect.DelegatingMethodAccessorImpl.invoke(DelegatingMethodAccessorImpl.java:43)
(32 more lines...)
java.util.concurrent.TimeoutException: Unable to connect to Authentication service to obtain access token, Connection info : CLIConnectionConfig{hostname=up36876-1000.coopr.sh, port=11015, sslEnabled=false}
	at co.cask.cdap.test.IntegrationTestBase.checkServicesWithRetry(IntegrationTestBase.java:267)
	at co.cask.cdap.test.IntegrationTestBase.fetchAccessToken(IntegrationTestBase.java:235)
	at co.cask.cdap.test.IntegrationTestBase.fetchAccessToken(IntegrationTestBase.java:220)
	at co.cask.cdap.test.IntegrationTestBase.checkSystemServices(IntegrationTestBase.java:198)
	at co.cask.cdap.test.IntegrationTestBase.setUp(IntegrationTestBase.java:99)
	at sun.reflect.GeneratedMethodAccessor1.invoke(Unknown Source)
	at sun.reflect.DelegatingMethodAccessorImpl.invoke(DelegatingMethodAccessorImpl.java:43)
(32 more lines...)
java.util.concurrent.TimeoutException: Unable to connect to Authentication service to obtain access token, Connection info : CLIConnectionConfig{hostname=up36876-1000.coopr.sh, port=11015, sslEnabled=false}
	at co.cask.cdap.test.IntegrationTestBase.checkServicesWithRetry(IntegrationTestBase.java:267)
	at co.cask.cdap.test.IntegrationTestBase.fetchAccessToken(IntegrationTestBase.java:235)
	at co.cask.cdap.test.IntegrationTestBase.fetchAccessToken(IntegrationTestBase.java:220)
	at co.cask.cdap.test.IntegrationTestBase.checkSystemServices(IntegrationTestBase.java:198)
	at co.cask.cdap.test.IntegrationTestBase.setUp(IntegrationTestBase.java:99)
	at sun.reflect.GeneratedMethodAccessor1.invoke(Unknown Source)
	at sun.reflect.DelegatingMethodAccessorImpl.invoke(DelegatingMethodAccessorImpl.java:43)
(32 more lines...)
java.util.concurrent.TimeoutException: Unable to connect to Authentication service to obtain access token, Connection info : CLIConnectionConfig{hostname=up36876-1000.coopr.sh, port=11015, sslEnabled=false}
	at co.cask.cdap.test.IntegrationTestBase.checkServicesWithRetry(IntegrationTestBase.java:267)
	at co.cask.cdap.test.IntegrationTestBase.fetchAccessToken(IntegrationTestBase.java:235)
	at co.cask.cdap.test.IntegrationTestBase.fetchAccessToken(IntegrationTestBase.java:220)
	at co.cask.cdap.test.IntegrationTestBase.checkSystemServices(IntegrationTestBase.java:198)
	at co.cask.cdap.test.IntegrationTestBase.setUp(IntegrationTestBase.java:99)
	at sun.reflect.GeneratedMethodAccessor1.invoke(Unknown Source)
	at sun.reflect.DelegatingMethodAccessorImpl.invoke(DelegatingMethodAccessorImpl.java:43)
(32 more lines...)