Build #3

Build: #3 failed

Job: Default Job failed

Stages & jobs

  1. Default Stage

Build log

The build generated 608 lines of output. Download or view full build log

29-Jun-2018 18:43:36 Build Integration Tests - Custom Cluster - feature-CDAP-13261-meta-prog - Default Job #3 (IT-ITCC3-JOB1-3) started building on agent bamboo-agent05.prod.continuuity.net
29-Jun-2018 18:43:36 Remote Agent
29-Jun-2018 18:43:36 Build working directory is /var/bamboo/xml-data/build-dir/IT-ITCC3-JOB1
29-Jun-2018 18:43:36 Executing build Integration Tests - Custom Cluster - feature-CDAP-13261-meta-prog - Default Job #3 (IT-ITCC3-JOB1-3)
29-Jun-2018 18:43:36 Starting task 'Checkout Default Repository' of type 'com.atlassian.bamboo.plugins.vcs:task.vcs.checkout'
29-Jun-2018 18:43:36 Checking out into /var/bamboo/xml-data/build-dir/IT-ITCC3-JOB1
29-Jun-2018 18:43:36 Updating source code to revision: f79e110cb5600df43682e5d43a256acc87bfdac7
29-Jun-2018 18:43:36 /usr/local/bin/git version
29-Jun-2018 18:43:36 /usr/local/bin/git log -1 --encoding=UTF-8 --format=%H HEAD
29-Jun-2018 18:43:36 /usr/local/bin/git ls-remote ssh://81c5b5f8-3f6a-46ff-9693-f4d1668bbd2b@127.0.0.1:42067/caskdata/cdap-integration-tests.git
29-Jun-2018 18:43:37 Fetching 'refs/heads/feature/CDAP-13261-meta-prog' from 'git@github.com:caskdata/cdap-integration-tests.git'. Will try to do a shallow fetch.
29-Jun-2018 18:43:37 /usr/local/bin/git fetch ssh://81c5b5f8-3f6a-46ff-9693-f4d1668bbd2b@127.0.0.1:42067/caskdata/cdap-integration-tests.git +refs/heads/feature/CDAP-13261-meta-prog:refs/heads/feature/CDAP-13261-meta-prog --update-head-ok --progress --verbose --depth 1
29-Jun-2018 18:43:37 Warning: Permanently added '[127.0.0.1]:42067' (RSA) to the list of known hosts.
29-Jun-2018 18:43:38 remote: Counting objects: 13, done.       
29-Jun-2018 18:43:38 remote: Compressing objects:  10% (1/10)           
29-Jun-2018 18:43:38 remote: Compressing objects:  20% (2/10)           
29-Jun-2018 18:43:38 remote: Compressing objects:  30% (3/10)           
29-Jun-2018 18:43:38 remote: Compressing objects:  40% (4/10)           
29-Jun-2018 18:43:38 remote: Compressing objects:  50% (5/10)           
29-Jun-2018 18:43:38 remote: Compressing objects:  60% (6/10)           
29-Jun-2018 18:43:38 remote: Compressing objects:  70% (7/10)           
29-Jun-2018 18:43:38 remote: Compressing objects:  80% (8/10)           
29-Jun-2018 18:43:38 remote: Compressing objects:  90% (9/10)           
29-Jun-2018 18:43:38 remote: Compressing objects: 100% (10/10)           
29-Jun-2018 18:43:38 remote: Compressing objects: 100% (10/10), done.       
29-Jun-2018 18:43:38 remote: Total 13 (delta 6), reused 7 (delta 0), pack-reused 0       
29-Jun-2018 18:43:38 From ssh://127.0.0.1:42067/caskdata/cdap-integration-tests
29-Jun-2018 18:43:38 + 3fdc1bc...f79e110 feature/CDAP-13261-meta-prog -> feature/CDAP-13261-meta-prog  (forced update)
29-Jun-2018 18:43:38 Checking out revision f79e110cb5600df43682e5d43a256acc87bfdac7.
29-Jun-2018 18:43:38 /usr/local/bin/git show-ref feature/CDAP-13261-meta-prog
29-Jun-2018 18:43:38 /usr/local/bin/git checkout -f feature/CDAP-13261-meta-prog
29-Jun-2018 18:43:38 Already on 'feature/CDAP-13261-meta-prog'
29-Jun-2018 18:43:38 /usr/local/bin/git remote set-url origin file://nothing
29-Jun-2018 18:43:38 Updated source code to revision: f79e110cb5600df43682e5d43a256acc87bfdac7
29-Jun-2018 18:43:38 Finished task 'Checkout Default Repository' with result: Success
29-Jun-2018 18:43:38 Running pre-build action: VCS Version Collector
29-Jun-2018 18:43:38 Skipping execution of task 'Run flush and compactions' as it is disabled
29-Jun-2018 18:43:38
Substituting variable: ${bamboo.cdap.test} with ProgramMetadataTest
29-Jun-2018 18:43:38
Substituting variable: ${bamboo.itn.cdap.username} with rsinha
29-Jun-2018 18:43:38
Substituting password variable: ${bamboo.itn.cdap.password}
29-Jun-2018 18:43:38
Substituting variable: ${bamboo.cdap.cluster} with metprogitn32508-1000.dev.continuuity.net
29-Jun-2018 18:43:38
Substituting variable: ${bamboo.cdap.timeout} with 60
29-Jun-2018 18:43:38
Substituting variable: ${bamboo.test.namespace} with default
29-Jun-2018 18:43:38 Starting task 'Integration test - cluster' of type 'com.atlassian.bamboo.plugins.maven:task.builder.mvn3'
29-Jun-2018 18:43:38
Beginning to execute external process for build 'Integration Tests - Custom Cluster - feature-CDAP-13261-meta-prog - Default Job #3 (IT-ITCC3-JOB1-3)'
... running command line:
/opt/maven/bin/mvn --batch-mode -Djava.io.tmpdir=/tmp/IT-ITCC3-JOB1 clean test -U -Dtest=ProgramMetadataTest -Dcdap.username=rsinha -Dcdap.password=******** -DinstanceUri=metprogitn32508-1000.dev.continuuity.net -DprogramTimeout=60 -Dtest.namespace=default -DverifySSL=false
... in: /var/bamboo/xml-data/build-dir/IT-ITCC3-JOB1
... using extra environment variables:
bamboo_planRepository_1_branch=feature/CDAP-13261-meta-prog
bamboo_planRepository_1_branchDisplayName=feature/CDAP-13261-meta-prog
bamboo_repository_revision_number=f79e110cb5600df43682e5d43a256acc87bfdac7
MAVEN2_HOME=/opt/maven
bamboo_capability_system_builder_command_s3cmd=/usr/bin/s3cmd
bamboo_docs_s3_bucket=docs.cask.co
bamboo_buildKey=IT-ITCC3-JOB1
bamboo_gpg_password=********
bamboo_ops_gpg_password=********
bamboo_shortJobName=Default Job
bamboo_buildResultsUrl=http://builds.cask.co/browse/IT-ITCC3-JOB1-3
bamboo_capability_system_builder_mvn3_Maven_3_1=/opt/maven
bamboo_planRepository_repositoryUrl=git@github.com:caskdata/cdap-integration-tests.git
bamboo_repository_s3_bucket=repository.cask.co
bamboo_aws_secret_access_key_password=********
bamboo_agentId=32243715
bamboo_capability_Swapfile=true
bamboo_planRepository_revision=f79e110cb5600df43682e5d43a256acc87bfdac7
bamboo_planRepository_previousRevision=3fdc1bc23497034122dfef3875d31da146c01db7
bamboo_capability_RHEL=rhel
bamboo_capability_freight=true
bamboo_repository_branch_name=feature/CDAP-13261-meta-prog
bamboo_kdc_address_password=********
bamboo_capability_GPG=GPG
bamboo_capability_system_jdk_Oracle_JDK_8=/usr/lib/jvm/jdk8
JAVA_HOME=/usr/lib/jvm/jdk1.8.0_101
bamboo_capability_system_jdk_Oracle_JDK_7=/usr/lib/jvm/jdk7
bamboo_repository_77005043_git_repositoryUrl=git@github.com:caskdata/cdap-integration-tests.git
bamboo_dependenciesDisabled=false
bamboo_downloads_s3_bucket=downloads.cask.co
bamboo_planRepository_branch=feature/CDAP-13261-meta-prog
bamboo_market_s3_access_key_password=********
bamboo_planRepository_1_type=gitv2
bamboo_planRepository_branchName=feature/CDAP-13261-meta-prog
bamboo_capability_SPHINX=Sphinx
bamboo_capability_rsync=true
bamboo_market_cloudfront_secret_key_password=********
bamboo_capability_system_jdk_JDK=/usr/lib/jvm/jdk1.7.0_75
bamboo_hg_cache_directory=/var/bamboo/xml-data/build-dir/_hg-repositories-cache
bamboo_planRepository_1_username=
bamboo_planRepository_type=gitv2
bamboo_ManualBuildTriggerReason_userName=rsinha
bamboo_capability_expect=true
bamboo_itn_cdap_username=rsinha
bamboo_git_cache_directory=/var/bamboo/xml-data/build-dir/_git-repositories-cache
bamboo_capability_RSYNC=rsync
useMavenReturnCode=false
bamboo_capability_system_builder_node_Node_js=/usr/bin/node
bamboo_capability_system_builder_mvn3_Maven_3=/opt/maven
bamboo_tmp_directory=/var/bamboo/temp
bamboo_planKey=IT-ITCC3
bamboo_hide_jdk_mirror_password=********
bamboo_planRepository_username=
bamboo_cdap_timeout=60
bamboo_capability_s3cmd=true
bamboo_planRepository_1_branchName=feature/CDAP-13261-meta-prog
bamboo_repository_77005043_previous_revision_number=3fdc1bc23497034122dfef3875d31da146c01db7
bamboo_test_namespace=default
bamboo_resultsUrl=http://builds.cask.co/browse/IT-ITCC3-JOB1-3
bamboo_capability_Sphinx=true
bamboo_build_working_directory=/var/bamboo/xml-data/build-dir/IT-ITCC3-JOB1
bamboo_planRepository_1_name=CDAP Integration Tests
bamboo_shortPlanName=feature-CDAP-13261-meta-prog
bamboo_planRepository_name=CDAP Integration Tests
bamboo_cdap_cluster=metprogitn32508-1000.dev.continuuity.net
bamboo_capability_git_lfs=true
bamboo_buildNumber=3
bamboo_planName=Integration Tests - Custom Cluster - feature-CDAP-13261-meta-prog
bamboo_shortPlanKey=ITCC3
bamboo_shortJobKey=JOB1
bamboo_cdap_test=ProgramMetadataTest
bamboo_itn_cdap_password=********
bamboo_repository_77005043_branch_name=feature/CDAP-13261-meta-prog
bamboo_buildTimeStamp=2018-06-29T18:43:36.752Z
bamboo_repository_previous_revision_number=3fdc1bc23497034122dfef3875d31da146c01db7
M2_HOME=/opt/maven
bamboo_s3_bucket=repository.cask.co
bamboo_capability_system_builder_command_Docker=/usr/bin/docker
bamboo_repository_git_branch=feature/CDAP-13261-meta-prog
bamboo_buildResultKey=IT-ITCC3-JOB1-3
bamboo_market_s3_secret_key_password=********
bamboo_buildPlanName=Integration Tests - Custom Cluster - feature-CDAP-13261-meta-prog - Default Job
bamboo_capability_system_jdk_JDK_1_8_0_101=/usr/lib/jvm/jdk1.8.0_101
bamboo_capability_system_builder_command_fpm=/opt/rbenv/shims/fpm
bamboo_capability_Platform=rhel
bamboo_planRepository_1_revision=f79e110cb5600df43682e5d43a256acc87bfdac7
bamboo_repository_name=CDAP Integration Tests
bamboo_buildFailed=false
bamboo_capability_system_docker_executable=/usr/bin/docker
MAVEN_OPTS=-Xmx3056m -XX:MaxPermSize=128m
bamboo_repository_77005043_git_username=
bamboo_agentWorkingDirectory=/var/bamboo/xml-data/build-dir
bamboo_repository_77005043_git_branch=feature/CDAP-13261-meta-prog
bamboo_capability_system_git_executable=/usr/local/bin/git
bamboo_repository_git_username=
bamboo_planRepository_1_previousRevision=3fdc1bc23497034122dfef3875d31da146c01db7
bamboo_capability_system_builder_command_Ruby=/opt/rbenv/shims/ruby
bamboo_planRepository_branchDisplayName=feature/CDAP-13261-meta-prog
bamboo_aws_access_key_password=********
bamboo_capability_system_builder_mvn3_Maven_3_x=/opt/maven
bamboo_plan_storageTag=plan-76808688
bamboo_repository_git_repositoryUrl=git@github.com:caskdata/cdap-integration-tests.git
bamboo_repository_77005043_revision_number=f79e110cb5600df43682e5d43a256acc87bfdac7
bamboo_market_cloudfront_access_key_password=********
bamboo_working_directory=/var/bamboo/xml-data/build-dir/IT-ITCC3-JOB1
bamboo_planRepository_1_repositoryUrl=git@github.com:caskdata/cdap-integration-tests.git
bamboo_capability_createrepo=true
bamboo_capability_system_jdk_JDK_1_8=/usr/lib/jvm/jdk1.8.0_101
bamboo_capability_rpm_build=true
bamboo_capability_system_jdk_JDK_1_7=/usr/lib/jvm/jdk1.7.0_75
bamboo_repository_77005043_name=CDAP Integration Tests
PATH=/usr/lib/jvm/jdk1.8.0_101/bin:/usr/lib/jvm/java/bin:/opt/rbenv/shims:/opt/rbenv/bin:/opt/rbenv/plugins/ruby_build/bin:/usr/local/maven-3.1.1/bin:/usr/local/bin:/bin:/usr/bin:/usr/local/sbin:/usr/sbin:/sbin:/home/bamboo/bin
29-Jun-2018 18:43:38 Java HotSpot(TM) 64-Bit Server VM warning: ignoring option MaxPermSize=128m; support was removed in 8.0
29-Jun-2018 18:43:39 [INFO] Scanning for projects...
29-Jun-2018 18:43:40 [WARNING]
29-Jun-2018 18:43:40 [WARNING] Some problems were encountered while building the effective model for co.cask.cdap.test:integration-test-remote:jar:1.0.0
29-Jun-2018 18:43:40 [WARNING] 'dependencies.dependency.exclusions.exclusion.groupId' for co.cask.hydrator:core-plugins:jar with value '*' does not match a valid id pattern. @ co.cask.cdap.test:integration-test:1.0.0, /var/bamboo/xml-data/build-dir/IT-ITCC3-JOB1/pom.xml, line 110, column 20
29-Jun-2018 18:43:40 [WARNING] 'dependencies.dependency.exclusions.exclusion.artifactId' for co.cask.hydrator:core-plugins:jar with value '*' does not match a valid id pattern. @ co.cask.cdap.test:integration-test:1.0.0, /var/bamboo/xml-data/build-dir/IT-ITCC3-JOB1/pom.xml, line 111, column 23
29-Jun-2018 18:43:40 [WARNING] 'dependencies.dependency.exclusions.exclusion.groupId' for co.cask.tracker:tracker:jar with value '*' does not match a valid id pattern. @ co.cask.cdap.test:integration-test:1.0.0, /var/bamboo/xml-data/build-dir/IT-ITCC3-JOB1/pom.xml, line 121, column 19
29-Jun-2018 18:43:40 [WARNING] 'dependencies.dependency.exclusions.exclusion.artifactId' for co.cask.tracker:tracker:jar with value '*' does not match a valid id pattern. @ co.cask.cdap.test:integration-test:1.0.0, /var/bamboo/xml-data/build-dir/IT-ITCC3-JOB1/pom.xml, line 122, column 22
29-Jun-2018 18:43:40 [WARNING] 'dependencies.dependency.exclusions.exclusion.groupId' for co.cask.hydrator:hydrator-common:jar with value '*' does not match a valid id pattern. @ co.cask.cdap.test:integration-test:1.0.0, /var/bamboo/xml-data/build-dir/IT-ITCC3-JOB1/pom.xml, line 133, column 20
29-Jun-2018 18:43:40 [WARNING] 'dependencies.dependency.exclusions.exclusion.artifactId' for co.cask.hydrator:hydrator-common:jar with value '*' does not match a valid id pattern. @ co.cask.cdap.test:integration-test:1.0.0, /var/bamboo/xml-data/build-dir/IT-ITCC3-JOB1/pom.xml, line 134, column 23
29-Jun-2018 18:43:40 [WARNING]
29-Jun-2018 18:43:40 [WARNING] Some problems were encountered while building the effective model for co.cask.cdap.test:integration-test-standalone:jar:1.0.0
29-Jun-2018 18:43:40 [WARNING] 'dependencies.dependency.exclusions.exclusion.groupId' for co.cask.hydrator:core-plugins:jar with value '*' does not match a valid id pattern. @ co.cask.cdap.test:integration-test:1.0.0, /var/bamboo/xml-data/build-dir/IT-ITCC3-JOB1/pom.xml, line 110, column 20
29-Jun-2018 18:43:40 [WARNING] 'dependencies.dependency.exclusions.exclusion.artifactId' for co.cask.hydrator:core-plugins:jar with value '*' does not match a valid id pattern. @ co.cask.cdap.test:integration-test:1.0.0, /var/bamboo/xml-data/build-dir/IT-ITCC3-JOB1/pom.xml, line 111, column 23
29-Jun-2018 18:43:40 [WARNING] 'dependencies.dependency.exclusions.exclusion.groupId' for co.cask.tracker:tracker:jar with value '*' does not match a valid id pattern. @ co.cask.cdap.test:integration-test:1.0.0, /var/bamboo/xml-data/build-dir/IT-ITCC3-JOB1/pom.xml, line 121, column 19
29-Jun-2018 18:43:40 [WARNING] 'dependencies.dependency.exclusions.exclusion.artifactId' for co.cask.tracker:tracker:jar with value '*' does not match a valid id pattern. @ co.cask.cdap.test:integration-test:1.0.0, /var/bamboo/xml-data/build-dir/IT-ITCC3-JOB1/pom.xml, line 122, column 22
29-Jun-2018 18:43:40 [WARNING] 'dependencies.dependency.exclusions.exclusion.groupId' for co.cask.hydrator:hydrator-common:jar with value '*' does not match a valid id pattern. @ co.cask.cdap.test:integration-test:1.0.0, /var/bamboo/xml-data/build-dir/IT-ITCC3-JOB1/pom.xml, line 133, column 20
29-Jun-2018 18:43:40 [WARNING] 'dependencies.dependency.exclusions.exclusion.artifactId' for co.cask.hydrator:hydrator-common:jar with value '*' does not match a valid id pattern. @ co.cask.cdap.test:integration-test:1.0.0, /var/bamboo/xml-data/build-dir/IT-ITCC3-JOB1/pom.xml, line 134, column 23
29-Jun-2018 18:43:40 [WARNING]
29-Jun-2018 18:43:40 [WARNING] Some problems were encountered while building the effective model for co.cask.cdap.test:upgrade-test:jar:1.0.0
29-Jun-2018 18:43:40 [WARNING] 'dependencies.dependency.exclusions.exclusion.groupId' for co.cask.hydrator:core-plugins:jar with value '*' does not match a valid id pattern. @ co.cask.cdap.test:integration-test:1.0.0, /var/bamboo/xml-data/build-dir/IT-ITCC3-JOB1/pom.xml, line 110, column 20
29-Jun-2018 18:43:40 [WARNING] 'dependencies.dependency.exclusions.exclusion.artifactId' for co.cask.hydrator:core-plugins:jar with value '*' does not match a valid id pattern. @ co.cask.cdap.test:integration-test:1.0.0, /var/bamboo/xml-data/build-dir/IT-ITCC3-JOB1/pom.xml, line 111, column 23
29-Jun-2018 18:43:40 [WARNING] 'dependencies.dependency.exclusions.exclusion.groupId' for co.cask.tracker:tracker:jar with value '*' does not match a valid id pattern. @ co.cask.cdap.test:integration-test:1.0.0, /var/bamboo/xml-data/build-dir/IT-ITCC3-JOB1/pom.xml, line 121, column 19
29-Jun-2018 18:43:40 [WARNING] 'dependencies.dependency.exclusions.exclusion.artifactId' for co.cask.tracker:tracker:jar with value '*' does not match a valid id pattern. @ co.cask.cdap.test:integration-test:1.0.0, /var/bamboo/xml-data/build-dir/IT-ITCC3-JOB1/pom.xml, line 122, column 22
29-Jun-2018 18:43:40 [WARNING] 'dependencies.dependency.exclusions.exclusion.groupId' for co.cask.hydrator:hydrator-common:jar with value '*' does not match a valid id pattern. @ co.cask.cdap.test:integration-test:1.0.0, /var/bamboo/xml-data/build-dir/IT-ITCC3-JOB1/pom.xml, line 133, column 20
29-Jun-2018 18:43:40 [WARNING] 'dependencies.dependency.exclusions.exclusion.artifactId' for co.cask.hydrator:hydrator-common:jar with value '*' does not match a valid id pattern. @ co.cask.cdap.test:integration-test:1.0.0, /var/bamboo/xml-data/build-dir/IT-ITCC3-JOB1/pom.xml, line 134, column 23
29-Jun-2018 18:43:40 [WARNING]
29-Jun-2018 18:43:40 [WARNING] Some problems were encountered while building the effective model for co.cask.cdap.test:long-running-test:jar:1.0.0
29-Jun-2018 18:43:40 [WARNING] 'dependencies.dependency.exclusions.exclusion.groupId' for co.cask.hydrator:core-plugins:jar with value '*' does not match a valid id pattern. @ co.cask.cdap.test:integration-test:1.0.0, /var/bamboo/xml-data/build-dir/IT-ITCC3-JOB1/pom.xml, line 110, column 20
29-Jun-2018 18:43:40 [WARNING] 'dependencies.dependency.exclusions.exclusion.artifactId' for co.cask.hydrator:core-plugins:jar with value '*' does not match a valid id pattern. @ co.cask.cdap.test:integration-test:1.0.0, /var/bamboo/xml-data/build-dir/IT-ITCC3-JOB1/pom.xml, line 111, column 23
29-Jun-2018 18:43:40 [WARNING] 'dependencies.dependency.exclusions.exclusion.groupId' for co.cask.tracker:tracker:jar with value '*' does not match a valid id pattern. @ co.cask.cdap.test:integration-test:1.0.0, /var/bamboo/xml-data/build-dir/IT-ITCC3-JOB1/pom.xml, line 121, column 19
29-Jun-2018 18:43:40 [WARNING] 'dependencies.dependency.exclusions.exclusion.artifactId' for co.cask.tracker:tracker:jar with value '*' does not match a valid id pattern. @ co.cask.cdap.test:integration-test:1.0.0, /var/bamboo/xml-data/build-dir/IT-ITCC3-JOB1/pom.xml, line 122, column 22
29-Jun-2018 18:43:40 [WARNING] 'dependencies.dependency.exclusions.exclusion.groupId' for co.cask.hydrator:hydrator-common:jar with value '*' does not match a valid id pattern. @ co.cask.cdap.test:integration-test:1.0.0, /var/bamboo/xml-data/build-dir/IT-ITCC3-JOB1/pom.xml, line 133, column 20
29-Jun-2018 18:43:40 [WARNING] 'dependencies.dependency.exclusions.exclusion.artifactId' for co.cask.hydrator:hydrator-common:jar with value '*' does not match a valid id pattern. @ co.cask.cdap.test:integration-test:1.0.0, /var/bamboo/xml-data/build-dir/IT-ITCC3-JOB1/pom.xml, line 134, column 23
29-Jun-2018 18:43:40 [WARNING]
29-Jun-2018 18:43:40 [WARNING] Some problems were encountered while building the effective model for co.cask.cdap.test:integration-test-core:jar:1.0.0
29-Jun-2018 18:43:40 [WARNING] 'dependencies.dependency.exclusions.exclusion.groupId' for co.cask.hydrator:core-plugins:jar with value '*' does not match a valid id pattern. @ co.cask.cdap.test:integration-test:1.0.0, /var/bamboo/xml-data/build-dir/IT-ITCC3-JOB1/pom.xml, line 110, column 20
29-Jun-2018 18:43:40 [WARNING] 'dependencies.dependency.exclusions.exclusion.artifactId' for co.cask.hydrator:core-plugins:jar with value '*' does not match a valid id pattern. @ co.cask.cdap.test:integration-test:1.0.0, /var/bamboo/xml-data/build-dir/IT-ITCC3-JOB1/pom.xml, line 111, column 23
29-Jun-2018 18:43:40 [WARNING] 'dependencies.dependency.exclusions.exclusion.groupId' for co.cask.tracker:tracker:jar with value '*' does not match a valid id pattern. @ co.cask.cdap.test:integration-test:1.0.0, /var/bamboo/xml-data/build-dir/IT-ITCC3-JOB1/pom.xml, line 121, column 19
29-Jun-2018 18:43:40 [WARNING] 'dependencies.dependency.exclusions.exclusion.artifactId' for co.cask.tracker:tracker:jar with value '*' does not match a valid id pattern. @ co.cask.cdap.test:integration-test:1.0.0, /var/bamboo/xml-data/build-dir/IT-ITCC3-JOB1/pom.xml, line 122, column 22
29-Jun-2018 18:43:40 [WARNING] 'dependencies.dependency.exclusions.exclusion.groupId' for co.cask.hydrator:hydrator-common:jar with value '*' does not match a valid id pattern. @ co.cask.cdap.test:integration-test:1.0.0, /var/bamboo/xml-data/build-dir/IT-ITCC3-JOB1/pom.xml, line 133, column 20
29-Jun-2018 18:43:40 [WARNING] 'dependencies.dependency.exclusions.exclusion.artifactId' for co.cask.hydrator:hydrator-common:jar with value '*' does not match a valid id pattern. @ co.cask.cdap.test:integration-test:1.0.0, /var/bamboo/xml-data/build-dir/IT-ITCC3-JOB1/pom.xml, line 134, column 23
29-Jun-2018 18:43:40 [WARNING]
29-Jun-2018 18:43:40 [WARNING] Some problems were encountered while building the effective model for co.cask.cdap.test:integration-test:pom:1.0.0
29-Jun-2018 18:43:40 [WARNING] 'dependencies.dependency.exclusions.exclusion.groupId' for co.cask.hydrator:core-plugins:jar with value '*' does not match a valid id pattern. @ line 110, column 20
29-Jun-2018 18:43:40 [WARNING] 'dependencies.dependency.exclusions.exclusion.artifactId' for co.cask.hydrator:core-plugins:jar with value '*' does not match a valid id pattern. @ line 111, column 23
29-Jun-2018 18:43:40 [WARNING] 'dependencies.dependency.exclusions.exclusion.groupId' for co.cask.tracker:tracker:jar with value '*' does not match a valid id pattern. @ line 121, column 19
29-Jun-2018 18:43:40 [WARNING] 'dependencies.dependency.exclusions.exclusion.artifactId' for co.cask.tracker:tracker:jar with value '*' does not match a valid id pattern. @ line 122, column 22
29-Jun-2018 18:43:40 [WARNING] 'dependencies.dependency.exclusions.exclusion.groupId' for co.cask.hydrator:hydrator-common:jar with value '*' does not match a valid id pattern. @ line 133, column 20
29-Jun-2018 18:43:40 [WARNING] 'dependencies.dependency.exclusions.exclusion.artifactId' for co.cask.hydrator:hydrator-common:jar with value '*' does not match a valid id pattern. @ line 134, column 23
29-Jun-2018 18:43:40 [WARNING]
29-Jun-2018 18:43:40 [WARNING] It is highly recommended to fix these problems because they threaten the stability of your build.
29-Jun-2018 18:43:40 [WARNING]
29-Jun-2018 18:43:40 [WARNING] For this reason, future Maven versions might no longer support building such malformed projects.
29-Jun-2018 18:43:40 [WARNING]
29-Jun-2018 18:43:40 [INFO] ------------------------------------------------------------------------
29-Jun-2018 18:43:40 [INFO] Reactor Build Order:
29-Jun-2018 18:43:40 [INFO]
29-Jun-2018 18:43:40 [INFO] integration-test
29-Jun-2018 18:43:40 [INFO] integration-test-core
29-Jun-2018 18:43:40 [INFO] integration-test-remote
29-Jun-2018 18:43:40 [INFO] integration-test-standalone
29-Jun-2018 18:43:40 [INFO] upgrade-test
29-Jun-2018 18:43:40 [INFO] long-running-test
29-Jun-2018 18:43:40 [INFO]                                                                         
29-Jun-2018 18:43:40 [INFO] ------------------------------------------------------------------------
29-Jun-2018 18:43:40 [INFO] Building integration-test 1.0.0
29-Jun-2018 18:43:40 [INFO] ------------------------------------------------------------------------
29-Jun-2018 18:43:40 [INFO] Downloading: https://oss.sonatype.org/content/repositories/snapshots/co/cask/cdap/HelloWorld/5.0.0-SNAPSHOT/maven-metadata.xml
29-Jun-2018 18:43:40 [INFO] Downloaded: https://oss.sonatype.org/content/repositories/snapshots/co/cask/cdap/HelloWorld/5.0.0-SNAPSHOT/maven-metadata.xml (2 KB at 2.6 KB/sec)
29-Jun-2018 18:43:40 [INFO] Downloading: https://oss.sonatype.org/content/repositories/snapshots/co/cask/cdap/cdap-examples/5.0.0-SNAPSHOT/maven-metadata.xml
29-Jun-2018 18:43:40 [INFO] Downloaded: https://oss.sonatype.org/content/repositories/snapshots/co/cask/cdap/cdap-examples/5.0.0-SNAPSHOT/maven-metadata.xml (606 B at 4.6 KB/sec)
29-Jun-2018 18:43:40 [INFO] Downloading: https://oss.sonatype.org/content/repositories/snapshots/co/cask/cdap/cdap/5.0.0-SNAPSHOT/maven-metadata.xml
29-Jun-2018 18:43:40 [INFO] Downloaded: https://oss.sonatype.org/content/repositories/snapshots/co/cask/cdap/cdap/5.0.0-SNAPSHOT/maven-metadata.xml (597 B at 4.9 KB/sec)
29-Jun-2018 18:43:40 [INFO] Downloading: https://oss.sonatype.org/content/repositories/snapshots/co/cask/cdap/FileSetExample/5.0.0-SNAPSHOT/maven-metadata.xml
29-Jun-2018 18:43:41 [INFO] Downloaded: https://oss.sonatype.org/content/repositories/snapshots/co/cask/cdap/FileSetExample/5.0.0-SNAPSHOT/maven-metadata.xml (2 KB at 9.4 KB/sec)
29-Jun-2018 18:43:41 [INFO] Downloading: https://oss.sonatype.org/content/repositories/snapshots/co/cask/cdap/Purchase/5.0.0-SNAPSHOT/maven-metadata.xml
29-Jun-2018 18:43:41 [INFO] Downloaded: https://oss.sonatype.org/content/repositories/snapshots/co/cask/cdap/Purchase/5.0.0-SNAPSHOT/maven-metadata.xml (2 KB at 9.9 KB/sec)
29-Jun-2018 18:43:41 [INFO] Downloading: https://oss.sonatype.org/content/repositories/snapshots/co/cask/common/common-http/0.11.0-SNAPSHOT/maven-metadata.xml
29-Jun-2018 18:43:41 [INFO] Downloading: https://repository.apache.org/content/repositories/snapshots/co/cask/common/common-http/0.11.0-SNAPSHOT/maven-metadata.xml
29-Jun-2018 18:43:41 [INFO] Downloaded: https://oss.sonatype.org/content/repositories/snapshots/co/cask/common/common-http/0.11.0-SNAPSHOT/maven-metadata.xml (2 KB at 11.1 KB/sec)
29-Jun-2018 18:43:41 [INFO] Downloading: https://repository.apache.org/content/repositories/snapshots/co/cask/common/common/0.11.0-SNAPSHOT/maven-metadata.xml
29-Jun-2018 18:43:41 [INFO] Downloading: https://oss.sonatype.org/content/repositories/snapshots/co/cask/common/common/0.11.0-SNAPSHOT/maven-metadata.xml
29-Jun-2018 18:43:41 [INFO] Downloaded: https://oss.sonatype.org/content/repositories/snapshots/co/cask/common/common/0.11.0-SNAPSHOT/maven-metadata.xml (599 B at 4.5 KB/sec)
29-Jun-2018 18:43:41 [INFO] Downloading: https://repository.apache.org/content/repositories/snapshots/co/cask/common/common-io/0.11.0-SNAPSHOT/maven-metadata.xml
29-Jun-2018 18:43:41 [INFO] Downloading: https://oss.sonatype.org/content/repositories/snapshots/co/cask/common/common-io/0.11.0-SNAPSHOT/maven-metadata.xml
29-Jun-2018 18:43:41 [INFO] Downloaded: https://oss.sonatype.org/content/repositories/snapshots/co/cask/common/common-io/0.11.0-SNAPSHOT/maven-metadata.xml (2 KB at 11.2 KB/sec)
29-Jun-2018 18:43:41 [INFO] Downloading: https://repository.apache.org/content/repositories/snapshots/co/cask/common/common-lang/0.11.0-SNAPSHOT/maven-metadata.xml
29-Jun-2018 18:43:41 [INFO] Downloading: https://oss.sonatype.org/content/repositories/snapshots/co/cask/common/common-lang/0.11.0-SNAPSHOT/maven-metadata.xml
29-Jun-2018 18:43:41 [INFO] Downloaded: https://oss.sonatype.org/content/repositories/snapshots/co/cask/common/common-lang/0.11.0-SNAPSHOT/maven-metadata.xml (2 KB at 10.9 KB/sec)
29-Jun-2018 18:43:41 [INFO] Downloading: https://oss.sonatype.org/content/repositories/snapshots/co/cask/cdap/SparkPageRank/5.0.0-SNAPSHOT/maven-metadata.xml
29-Jun-2018 18:43:41 [INFO] Downloaded: https://oss.sonatype.org/content/repositories/snapshots/co/cask/cdap/SparkPageRank/5.0.0-SNAPSHOT/maven-metadata.xml (2 KB at 10.0 KB/sec)
29-Jun-2018 18:43:41 [INFO] Downloading: https://oss.sonatype.org/content/repositories/snapshots/co/cask/cdap/WordCount/5.0.0-SNAPSHOT/maven-metadata.xml
29-Jun-2018 18:43:42 [INFO] Downloaded: https://oss.sonatype.org/content/repositories/snapshots/co/cask/cdap/WordCount/5.0.0-SNAPSHOT/maven-metadata.xml (2 KB at 8.0 KB/sec)
29-Jun-2018 18:43:42 [INFO] Downloading: https://oss.sonatype.org/content/repositories/snapshots/co/cask/cdap/WikipediaPipeline/5.0.0-SNAPSHOT/maven-metadata.xml
29-Jun-2018 18:43:42 [INFO] Downloaded: https://oss.sonatype.org/content/repositories/snapshots/co/cask/cdap/WikipediaPipeline/5.0.0-SNAPSHOT/maven-metadata.xml (2 KB at 9.5 KB/sec)
29-Jun-2018 18:43:42 [INFO] Downloading: https://oss.sonatype.org/content/repositories/snapshots/co/cask/cdap/cdap-api/5.0.0-SNAPSHOT/maven-metadata.xml
29-Jun-2018 18:43:42 [INFO] Downloading: https://repository.apache.org/content/repositories/snapshots/co/cask/cdap/cdap-api/5.0.0-SNAPSHOT/maven-metadata.xml
29-Jun-2018 18:43:42 [INFO] Downloaded: https://oss.sonatype.org/content/repositories/snapshots/co/cask/cdap/cdap-api/5.0.0-SNAPSHOT/maven-metadata.xml (2 KB at 10.0 KB/sec)
29-Jun-2018 18:43:42 [INFO] Downloading: https://repository.apache.org/content/repositories/snapshots/co/cask/cdap/cdap-api-common/5.0.0-SNAPSHOT/maven-metadata.xml
29-Jun-2018 18:43:42 [INFO] Downloading: https://oss.sonatype.org/content/repositories/snapshots/co/cask/cdap/cdap-api-common/5.0.0-SNAPSHOT/maven-metadata.xml
29-Jun-2018 18:43:42 [INFO] Downloaded: https://oss.sonatype.org/content/repositories/snapshots/co/cask/cdap/cdap-api-common/5.0.0-SNAPSHOT/maven-metadata.xml (2 KB at 8.5 KB/sec)
29-Jun-2018 18:43:42 [INFO] Downloading: https://repository.apache.org/content/repositories/snapshots/org/apache/twill/twill-api/0.13.0-SNAPSHOT/maven-metadata.xml
29-Jun-2018 18:43:42 [INFO] Downloading: https://oss.sonatype.org/content/repositories/snapshots/org/apache/twill/twill-api/0.13.0-SNAPSHOT/maven-metadata.xml
29-Jun-2018 18:43:42 [INFO] Downloaded: https://repository.apache.org/content/repositories/snapshots/org/apache/twill/twill-api/0.13.0-SNAPSHOT/maven-metadata.xml (2 KB at 5.3 KB/sec)
29-Jun-2018 18:43:42 [INFO] Downloading: https://repository.apache.org/content/repositories/snapshots/org/apache/twill/twill-parent/0.13.0-SNAPSHOT/maven-metadata.xml
29-Jun-2018 18:43:42 [INFO] Downloading: https://oss.sonatype.org/content/repositories/snapshots/org/apache/twill/twill-parent/0.13.0-SNAPSHOT/maven-metadata.xml
29-Jun-2018 18:43:43 [INFO] Downloaded: https://repository.apache.org/content/repositories/snapshots/org/apache/twill/twill-parent/0.13.0-SNAPSHOT/maven-metadata.xml (832 B at 3.6 KB/sec)
29-Jun-2018 18:43:43 [INFO] Downloading: https://oss.sonatype.org/content/repositories/snapshots/org/apache/twill/twill-common/0.13.0-SNAPSHOT/maven-metadata.xml
29-Jun-2018 18:43:43 [INFO] Downloading: https://repository.apache.org/content/repositories/snapshots/org/apache/twill/twill-common/0.13.0-SNAPSHOT/maven-metadata.xml
29-Jun-2018 18:43:43 [INFO] Downloading: http://repository.apache.org/snapshots/org/apache/twill/twill-common/0.13.0-SNAPSHOT/maven-metadata.xml
29-Jun-2018 18:43:43 [INFO] Downloaded: http://repository.apache.org/snapshots/org/apache/twill/twill-common/0.13.0-SNAPSHOT/maven-metadata.xml (2 KB at 7.6 KB/sec)
29-Jun-2018 18:43:43 [INFO] Downloaded: https://repository.apache.org/content/repositories/snapshots/org/apache/twill/twill-common/0.13.0-SNAPSHOT/maven-metadata.xml (2 KB at 5.1 KB/sec)
29-Jun-2018 18:43:43 [INFO] Downloading: https://oss.sonatype.org/content/repositories/snapshots/org/apache/twill/twill-discovery-api/0.13.0-SNAPSHOT/maven-metadata.xml
29-Jun-2018 18:43:43 [INFO] Downloading: https://repository.apache.org/content/repositories/snapshots/org/apache/twill/twill-discovery-api/0.13.0-SNAPSHOT/maven-metadata.xml
29-Jun-2018 18:43:43 [INFO] Downloading: http://repository.apache.org/snapshots/org/apache/twill/twill-discovery-api/0.13.0-SNAPSHOT/maven-metadata.xml
29-Jun-2018 18:43:43 [INFO] Downloaded: http://repository.apache.org/snapshots/org/apache/twill/twill-discovery-api/0.13.0-SNAPSHOT/maven-metadata.xml (2 KB at 7.7 KB/sec)
29-Jun-2018 18:43:43 [INFO] Downloaded: https://repository.apache.org/content/repositories/snapshots/org/apache/twill/twill-discovery-api/0.13.0-SNAPSHOT/maven-metadata.xml (2 KB at 4.6 KB/sec)
29-Jun-2018 18:43:43 [INFO] Downloading: https://oss.sonatype.org/content/repositories/snapshots/co/cask/cdap/DataCleansing/5.0.0-SNAPSHOT/maven-metadata.xml
29-Jun-2018 18:43:43 [INFO] Downloaded: https://oss.sonatype.org/content/repositories/snapshots/co/cask/cdap/DataCleansing/5.0.0-SNAPSHOT/maven-metadata.xml (2 KB at 6.4 KB/sec)
29-Jun-2018 18:43:43 [INFO] Downloading: https://oss.sonatype.org/content/repositories/snapshots/co/cask/cdap/cdap-data-pipeline/5.0.0-SNAPSHOT/maven-metadata.xml
29-Jun-2018 18:43:43 [INFO] Downloaded: https://oss.sonatype.org/content/repositories/snapshots/co/cask/cdap/cdap-data-pipeline/5.0.0-SNAPSHOT/maven-metadata.xml (2 KB at 9.7 KB/sec)
29-Jun-2018 18:43:43 [INFO] Downloading: https://oss.sonatype.org/content/repositories/snapshots/co/cask/cdap/cdap-etl/5.0.0-SNAPSHOT/maven-metadata.xml
29-Jun-2018 18:43:44 [INFO] Downloaded: https://oss.sonatype.org/content/repositories/snapshots/co/cask/cdap/cdap-etl/5.0.0-SNAPSHOT/maven-metadata.xml (601 B at 5.1 KB/sec)
29-Jun-2018 18:43:44 [INFO] Downloading: https://oss.sonatype.org/content/repositories/snapshots/co/cask/cdap/cdap-app-templates/5.0.0-SNAPSHOT/maven-metadata.xml
29-Jun-2018 18:43:44 [INFO] Downloaded: https://oss.sonatype.org/content/repositories/snapshots/co/cask/cdap/cdap-app-templates/5.0.0-SNAPSHOT/maven-metadata.xml (611 B at 4.3 KB/sec)
29-Jun-2018 18:43:44 [INFO] Downloading: https://repository.apache.org/content/repositories/snapshots/co/cask/cdap/cdap-etl-batch/5.0.0-SNAPSHOT/maven-metadata.xml
29-Jun-2018 18:43:44 [INFO] Downloading: https://oss.sonatype.org/content/repositories/snapshots/co/cask/cdap/cdap-etl-batch/5.0.0-SNAPSHOT/maven-metadata.xml
29-Jun-2018 18:43:44 [INFO] Downloaded: https://oss.sonatype.org/content/repositories/snapshots/co/cask/cdap/cdap-etl-batch/5.0.0-SNAPSHOT/maven-metadata.xml (2 KB at 10.4 KB/sec)
29-Jun-2018 18:43:44 [INFO] Downloading: https://repository.apache.org/content/repositories/snapshots/co/cask/cdap/cdap-etl-api/5.0.0-SNAPSHOT/maven-metadata.xml
29-Jun-2018 18:43:44 [INFO] Downloading: https://oss.sonatype.org/content/repositories/snapshots/co/cask/cdap/cdap-etl-api/5.0.0-SNAPSHOT/maven-metadata.xml
29-Jun-2018 18:43:44 [INFO] Downloaded: https://oss.sonatype.org/content/repositories/snapshots/co/cask/cdap/cdap-etl-api/5.0.0-SNAPSHOT/maven-metadata.xml (2 KB at 7.2 KB/sec)
29-Jun-2018 18:43:44 [INFO] Downloading: https://oss.sonatype.org/content/repositories/snapshots/co/cask/cdap/cdap-etl-api-spark/5.0.0-SNAPSHOT/maven-metadata.xml
29-Jun-2018 18:43:44 [INFO] Downloading: https://repository.apache.org/content/repositories/snapshots/co/cask/cdap/cdap-etl-api-spark/5.0.0-SNAPSHOT/maven-metadata.xml
29-Jun-2018 18:43:44 [INFO] Downloaded: https://oss.sonatype.org/content/repositories/snapshots/co/cask/cdap/cdap-etl-api-spark/5.0.0-SNAPSHOT/maven-metadata.xml (2 KB at 10.4 KB/sec)
29-Jun-2018 18:43:44 [INFO] Downloading: https://repository.apache.org/content/repositories/snapshots/co/cask/cdap/cdap-etl-core/5.0.0-SNAPSHOT/maven-metadata.xml
29-Jun-2018 18:43:44 [INFO] Downloading: https://oss.sonatype.org/content/repositories/snapshots/co/cask/cdap/cdap-etl-core/5.0.0-SNAPSHOT/maven-metadata.xml
29-Jun-2018 18:43:44 [INFO] Downloaded: https://oss.sonatype.org/content/repositories/snapshots/co/cask/cdap/cdap-etl-core/5.0.0-SNAPSHOT/maven-metadata.xml (2 KB at 9.6 KB/sec)
29-Jun-2018 18:43:44 [INFO] Downloading: https://oss.sonatype.org/content/repositories/snapshots/co/cask/cdap/cdap-etl-proto/5.0.0-SNAPSHOT/maven-metadata.xml
29-Jun-2018 18:43:44 [INFO] Downloading: https://repository.apache.org/content/repositories/snapshots/co/cask/cdap/cdap-etl-proto/5.0.0-SNAPSHOT/maven-metadata.xml
29-Jun-2018 18:43:44 [INFO] Downloaded: https://oss.sonatype.org/content/repositories/snapshots/co/cask/cdap/cdap-etl-proto/5.0.0-SNAPSHOT/maven-metadata.xml (2 KB at 10.5 KB/sec)
29-Jun-2018 18:43:44 [INFO] Downloading: https://oss.sonatype.org/content/repositories/snapshots/co/cask/cdap/cdap-formats/5.0.0-SNAPSHOT/maven-metadata.xml
29-Jun-2018 18:43:44 [INFO] Downloading: https://repository.apache.org/content/repositories/snapshots/co/cask/cdap/cdap-formats/5.0.0-SNAPSHOT/maven-metadata.xml
29-Jun-2018 18:43:44 [INFO] Downloaded: https://oss.sonatype.org/content/repositories/snapshots/co/cask/cdap/cdap-formats/5.0.0-SNAPSHOT/maven-metadata.xml (2 KB at 9.9 KB/sec)
29-Jun-2018 18:43:45 [INFO] Downloading: https://oss.sonatype.org/content/repositories/snapshots/co/cask/cdap/cdap-spi/5.0.0-SNAPSHOT/maven-metadata.xml
29-Jun-2018 18:43:45 [INFO] Downloading: https://repository.apache.org/content/repositories/snapshots/co/cask/cdap/cdap-spi/5.0.0-SNAPSHOT/maven-metadata.xml
29-Jun-2018 18:43:45 [INFO] Downloaded: https://oss.sonatype.org/content/repositories/snapshots/co/cask/cdap/cdap-spi/5.0.0-SNAPSHOT/maven-metadata.xml (2 KB at 10.3 KB/sec)
29-Jun-2018 18:43:45 [INFO] Downloading: https://oss.sonatype.org/content/repositories/snapshots/co/cask/cdap/cdap-proto/5.0.0-SNAPSHOT/maven-metadata.xml
29-Jun-2018 18:43:45 [INFO] Downloading: https://repository.apache.org/content/repositories/snapshots/co/cask/cdap/cdap-proto/5.0.0-SNAPSHOT/maven-metadata.xml
29-Jun-2018 18:43:45 [INFO] Downloaded: https://oss.sonatype.org/content/repositories/snapshots/co/cask/cdap/cdap-proto/5.0.0-SNAPSHOT/maven-metadata.xml (2 KB at 10.8 KB/sec)
29-Jun-2018 18:43:45 [INFO] Downloading: https://oss.sonatype.org/content/repositories/snapshots/co/cask/cdap/cdap-runtime-spi/5.0.0-SNAPSHOT/maven-metadata.xml
29-Jun-2018 18:43:45 [INFO] Downloading: https://repository.apache.org/content/repositories/snapshots/co/cask/cdap/cdap-runtime-spi/5.0.0-SNAPSHOT/maven-metadata.xml
29-Jun-2018 18:43:45 [INFO] Downloaded: https://oss.sonatype.org/content/repositories/snapshots/co/cask/cdap/cdap-runtime-spi/5.0.0-SNAPSHOT/maven-metadata.xml (2 KB at 10.1 KB/sec)
29-Jun-2018 18:43:45 [INFO] Downloading: https://repository.apache.org/content/repositories/snapshots/co/cask/cdap/hydrator-spark-core/5.0.0-SNAPSHOT/maven-metadata.xml
29-Jun-2018 18:43:45 [INFO] Downloading: https://oss.sonatype.org/content/repositories/snapshots/co/cask/cdap/hydrator-spark-core/5.0.0-SNAPSHOT/maven-metadata.xml
29-Jun-2018 18:43:45 [INFO] Downloaded: https://oss.sonatype.org/content/repositories/snapshots/co/cask/cdap/hydrator-spark-core/5.0.0-SNAPSHOT/maven-metadata.xml (2 KB at 9.8 KB/sec)
29-Jun-2018 18:43:45 [INFO] Downloading: https://oss.sonatype.org/content/repositories/snapshots/co/cask/cdap/cdap-api-spark/5.0.0-SNAPSHOT/maven-metadata.xml
29-Jun-2018 18:43:45 [INFO] Downloading: https://repository.apache.org/content/repositories/snapshots/co/cask/cdap/cdap-api-spark/5.0.0-SNAPSHOT/maven-metadata.xml
29-Jun-2018 18:43:45 [INFO] Downloaded: https://oss.sonatype.org/content/repositories/snapshots/co/cask/cdap/cdap-api-spark/5.0.0-SNAPSHOT/maven-metadata.xml (2 KB at 8.8 KB/sec)
29-Jun-2018 18:43:45 [INFO] Downloading: https://oss.sonatype.org/content/repositories/snapshots/co/cask/hydrator/core-plugins/2.0.0-SNAPSHOT/maven-metadata.xml
29-Jun-2018 18:43:45 [INFO] Downloaded: https://oss.sonatype.org/content/repositories/snapshots/co/cask/hydrator/core-plugins/2.0.0-SNAPSHOT/maven-metadata.xml (2 KB at 7.1 KB/sec)
29-Jun-2018 18:43:45 [INFO] Downloading: https://oss.sonatype.org/content/repositories/snapshots/co/cask/hydrator/hydrator-plugins/2.0.0-SNAPSHOT/maven-metadata.xml
29-Jun-2018 18:43:45 [INFO] Downloaded: https://oss.sonatype.org/content/repositories/snapshots/co/cask/hydrator/hydrator-plugins/2.0.0-SNAPSHOT/maven-metadata.xml (613 B at 5.2 KB/sec)
29-Jun-2018 18:43:45 [INFO] Downloading: https://oss.sonatype.org/content/repositories/snapshots/co/cask/tracker/tracker/0.6.0-SNAPSHOT/maven-metadata.xml
29-Jun-2018 18:43:46 [INFO] Downloaded: https://oss.sonatype.org/content/repositories/snapshots/co/cask/tracker/tracker/0.6.0-SNAPSHOT/maven-metadata.xml (2 KB at 8.6 KB/sec)
29-Jun-2018 18:43:46 [INFO] Downloading: https://oss.sonatype.org/content/repositories/snapshots/co/cask/hydrator/hydrator-common/2.0.0-SNAPSHOT/maven-metadata.xml
29-Jun-2018 18:43:46 [INFO] Downloaded: https://oss.sonatype.org/content/repositories/snapshots/co/cask/hydrator/hydrator-common/2.0.0-SNAPSHOT/maven-metadata.xml (2 KB at 10.7 KB/sec)
29-Jun-2018 18:43:46 [INFO] Downloading: https://oss.sonatype.org/content/repositories/snapshots/co/cask/cdap/cdap-common/5.0.0-SNAPSHOT/maven-metadata.xml
29-Jun-2018 18:43:46 [INFO] Downloaded: https://oss.sonatype.org/content/repositories/snapshots/co/cask/cdap/cdap-common/5.0.0-SNAPSHOT/maven-metadata.xml (2 KB at 10.9 KB/sec)
29-Jun-2018 18:43:46 [INFO] Downloading: https://oss.sonatype.org/content/repositories/snapshots/co/cask/cdap/cdap-watchdog-api/5.0.0-SNAPSHOT/maven-metadata.xml
29-Jun-2018 18:43:46 [INFO] Downloading: https://repository.apache.org/content/repositories/snapshots/co/cask/cdap/cdap-watchdog-api/5.0.0-SNAPSHOT/maven-metadata.xml
29-Jun-2018 18:43:46 [INFO] Downloaded: https://oss.sonatype.org/content/repositories/snapshots/co/cask/cdap/cdap-watchdog-api/5.0.0-SNAPSHOT/maven-metadata.xml (2 KB at 8.9 KB/sec)
29-Jun-2018 18:43:46 [INFO] Downloading: https://oss.sonatype.org/content/repositories/snapshots/co/cask/cdap/cdap-security-spi/5.0.0-SNAPSHOT/maven-metadata.xml
29-Jun-2018 18:43:46 [INFO] Downloading: https://repository.apache.org/content/repositories/snapshots/co/cask/cdap/cdap-security-spi/5.0.0-SNAPSHOT/maven-metadata.xml
29-Jun-2018 18:43:46 [INFO] Downloaded: https://oss.sonatype.org/content/repositories/snapshots/co/cask/cdap/cdap-security-spi/5.0.0-SNAPSHOT/maven-metadata.xml (2 KB at 11.0 KB/sec)
29-Jun-2018 18:43:46 [INFO] Downloading: https://oss.sonatype.org/content/repositories/snapshots/org/apache/twill/twill-discovery-core/0.13.0-SNAPSHOT/maven-metadata.xml
29-Jun-2018 18:43:46 [INFO] Downloading: https://repository.apache.org/content/repositories/snapshots/org/apache/twill/twill-discovery-core/0.13.0-SNAPSHOT/maven-metadata.xml
29-Jun-2018 18:43:46 [INFO] Downloaded: https://repository.apache.org/content/repositories/snapshots/org/apache/twill/twill-discovery-core/0.13.0-SNAPSHOT/maven-metadata.xml (2 KB at 5.3 KB/sec)
29-Jun-2018 18:43:46 [INFO] Downloading: https://oss.sonatype.org/content/repositories/snapshots/org/apache/twill/twill-zookeeper/0.13.0-SNAPSHOT/maven-metadata.xml
29-Jun-2018 18:43:46 [INFO] Downloading: http://repository.apache.org/snapshots/org/apache/twill/twill-zookeeper/0.13.0-SNAPSHOT/maven-metadata.xml
29-Jun-2018 18:43:46 [INFO] Downloading: https://repository.apache.org/content/repositories/snapshots/org/apache/twill/twill-zookeeper/0.13.0-SNAPSHOT/maven-metadata.xml
29-Jun-2018 18:43:47 [INFO] Downloaded: http://repository.apache.org/snapshots/org/apache/twill/twill-zookeeper/0.13.0-SNAPSHOT/maven-metadata.xml (2 KB at 7.7 KB/sec)
29-Jun-2018 18:43:47 [INFO] Downloaded: https://repository.apache.org/content/repositories/snapshots/org/apache/twill/twill-zookeeper/0.13.0-SNAPSHOT/maven-metadata.xml (2 KB at 5.0 KB/sec)
29-Jun-2018 18:43:47 [INFO] Downloading: https://oss.sonatype.org/content/repositories/snapshots/org/apache/twill/twill-yarn/0.13.0-SNAPSHOT/maven-metadata.xml
29-Jun-2018 18:43:47 [INFO] Downloading: https://repository.apache.org/content/repositories/snapshots/org/apache/twill/twill-yarn/0.13.0-SNAPSHOT/maven-metadata.xml
29-Jun-2018 18:43:47 [INFO] Downloaded: https://repository.apache.org/content/repositories/snapshots/org/apache/twill/twill-yarn/0.13.0-SNAPSHOT/maven-metadata.xml (2 KB at 6.3 KB/sec)
29-Jun-2018 18:43:47 [INFO] Downloading: https://oss.sonatype.org/content/repositories/snapshots/org/apache/twill/twill-core/0.13.0-SNAPSHOT/maven-metadata.xml
29-Jun-2018 18:43:47 [INFO] Downloading: https://repository.apache.org/content/repositories/snapshots/org/apache/twill/twill-core/0.13.0-SNAPSHOT/maven-metadata.xml
29-Jun-2018 18:43:47 [INFO] Downloading: http://repository.apache.org/snapshots/org/apache/twill/twill-core/0.13.0-SNAPSHOT/maven-metadata.xml
29-Jun-2018 18:43:47 [INFO] Downloaded: http://repository.apache.org/snapshots/org/apache/twill/twill-core/0.13.0-SNAPSHOT/maven-metadata.xml (2 KB at 7.7 KB/sec)
29-Jun-2018 18:43:47 [INFO] Downloaded: https://repository.apache.org/content/repositories/snapshots/org/apache/twill/twill-core/0.13.0-SNAPSHOT/maven-metadata.xml (2 KB at 5.1 KB/sec)
29-Jun-2018 18:43:47 [INFO] Downloading: https://oss.sonatype.org/content/repositories/snapshots/co/cask/cdap/cdap-integration-test/5.0.0-SNAPSHOT/maven-metadata.xml
29-Jun-2018 18:43:48 [INFO] Downloaded: https://oss.sonatype.org/content/repositories/snapshots/co/cask/cdap/cdap-integration-test/5.0.0-SNAPSHOT/maven-metadata.xml (2 KB at 6.5 KB/sec)
29-Jun-2018 18:43:48 [INFO] Downloading: https://repository.apache.org/content/repositories/snapshots/co/cask/cdap/cdap-common/5.0.0-SNAPSHOT/maven-metadata.xml
29-Jun-2018 18:43:48 [INFO] Downloading: https://repository.apache.org/content/repositories/snapshots/co/cask/cdap/cdap-test/5.0.0-SNAPSHOT/maven-metadata.xml
29-Jun-2018 18:43:48 [INFO] Downloading: https://oss.sonatype.org/content/repositories/snapshots/co/cask/cdap/cdap-test/5.0.0-SNAPSHOT/maven-metadata.xml
29-Jun-2018 18:43:48 [INFO] Downloaded: https://oss.sonatype.org/content/repositories/snapshots/co/cask/cdap/cdap-test/5.0.0-SNAPSHOT/maven-metadata.xml (2 KB at 9.8 KB/sec)
29-Jun-2018 18:43:48 [INFO] Downloading: https://repository.apache.org/content/repositories/snapshots/co/cask/cdap/cdap-gateway/5.0.0-SNAPSHOT/maven-metadata.xml
29-Jun-2018 18:43:48 [INFO] Downloading: https://oss.sonatype.org/content/repositories/snapshots/co/cask/cdap/cdap-gateway/5.0.0-SNAPSHOT/maven-metadata.xml
29-Jun-2018 18:43:48 [INFO] Downloaded: https://oss.sonatype.org/content/repositories/snapshots/co/cask/cdap/cdap-gateway/5.0.0-SNAPSHOT/maven-metadata.xml (2 KB at 10.1 KB/sec)
29-Jun-2018 18:43:48 [INFO] Downloading: https://repository.apache.org/content/repositories/snapshots/co/cask/cdap/cdap-data-fabric/5.0.0-SNAPSHOT/maven-metadata.xml
29-Jun-2018 18:43:48 [INFO] Downloading: https://oss.sonatype.org/content/repositories/snapshots/co/cask/cdap/cdap-data-fabric/5.0.0-SNAPSHOT/maven-metadata.xml
29-Jun-2018 18:43:48 [INFO] Downloaded: https://oss.sonatype.org/content/repositories/snapshots/co/cask/cdap/cdap-data-fabric/5.0.0-SNAPSHOT/maven-metadata.xml (2 KB at 12.4 KB/sec)
29-Jun-2018 18:43:48 [INFO] Downloading: https://repository.apache.org/content/repositories/snapshots/co/cask/cdap/cdap-notifications-api/5.0.0-SNAPSHOT/maven-metadata.xml
29-Jun-2018 18:43:48 [INFO] Downloading: https://oss.sonatype.org/content/repositories/snapshots/co/cask/cdap/cdap-notifications-api/5.0.0-SNAPSHOT/maven-metadata.xml
29-Jun-2018 18:43:48 [INFO] Downloaded: https://oss.sonatype.org/content/repositories/snapshots/co/cask/cdap/cdap-notifications-api/5.0.0-SNAPSHOT/maven-metadata.xml (2 KB at 10.8 KB/sec)
29-Jun-2018 18:43:48 [INFO] Downloading: https://oss.sonatype.org/content/repositories/snapshots/co/cask/cdap/cdap-security/5.0.0-SNAPSHOT/maven-metadata.xml
29-Jun-2018 18:43:48 [INFO] Downloading: https://repository.apache.org/content/repositories/snapshots/co/cask/cdap/cdap-security/5.0.0-SNAPSHOT/maven-metadata.xml
29-Jun-2018 18:43:48 [INFO] Downloaded: https://oss.sonatype.org/content/repositories/snapshots/co/cask/cdap/cdap-security/5.0.0-SNAPSHOT/maven-metadata.xml (2 KB at 11.0 KB/sec)
29-Jun-2018 18:43:49 [INFO] Downloading: https://oss.sonatype.org/content/repositories/snapshots/co/cask/cdap/cdap-tms/5.0.0-SNAPSHOT/maven-metadata.xml
29-Jun-2018 18:43:49 [INFO] Downloading: https://repository.apache.org/content/repositories/snapshots/co/cask/cdap/cdap-tms/5.0.0-SNAPSHOT/maven-metadata.xml
29-Jun-2018 18:43:49 [INFO] Downloaded: https://oss.sonatype.org/content/repositories/snapshots/co/cask/cdap/cdap-tms/5.0.0-SNAPSHOT/maven-metadata.xml (2 KB at 11.5 KB/sec)
29-Jun-2018 18:43:49 [INFO] Downloading: https://repository.apache.org/content/repositories/snapshots/co/cask/cdap/cdap-hbase-compat-base/5.0.0-SNAPSHOT/maven-metadata.xml
29-Jun-2018 18:43:49 [INFO] Downloading: https://oss.sonatype.org/content/repositories/snapshots/co/cask/cdap/cdap-hbase-compat-base/5.0.0-SNAPSHOT/maven-metadata.xml
29-Jun-2018 18:43:49 [INFO] Downloaded: https://oss.sonatype.org/content/repositories/snapshots/co/cask/cdap/cdap-hbase-compat-base/5.0.0-SNAPSHOT/maven-metadata.xml (2 KB at 12.0 KB/sec)
29-Jun-2018 18:43:49 [INFO] Downloading: https://oss.sonatype.org/content/repositories/snapshots/co/cask/cdap/cdap-hbase-spi/5.0.0-SNAPSHOT/maven-metadata.xml
29-Jun-2018 18:43:49 [INFO] Downloading: https://repository.apache.org/content/repositories/snapshots/co/cask/cdap/cdap-hbase-spi/5.0.0-SNAPSHOT/maven-metadata.xml
29-Jun-2018 18:43:49 [INFO] Downloaded: https://oss.sonatype.org/content/repositories/snapshots/co/cask/cdap/cdap-hbase-spi/5.0.0-SNAPSHOT/maven-metadata.xml (2 KB at 10.7 KB/sec)
29-Jun-2018 18:43:49 [INFO] Downloading: https://oss.sonatype.org/content/repositories/snapshots/co/cask/cdap/cdap-explore-client/5.0.0-SNAPSHOT/maven-metadata.xml
29-Jun-2018 18:43:49 [INFO] Downloading: https://repository.apache.org/content/repositories/snapshots/co/cask/cdap/cdap-explore-client/5.0.0-SNAPSHOT/maven-metadata.xml
29-Jun-2018 18:43:49 [INFO] Downloaded: https://oss.sonatype.org/content/repositories/snapshots/co/cask/cdap/cdap-explore-client/5.0.0-SNAPSHOT/maven-metadata.xml (2 KB at 8.2 KB/sec)
29-Jun-2018 18:43:49 [INFO] Downloading: https://oss.sonatype.org/content/repositories/snapshots/co/cask/cdap/cdap-watchdog/5.0.0-SNAPSHOT/maven-metadata.xml
29-Jun-2018 18:43:49 [INFO] Downloading: https://repository.apache.org/content/repositories/snapshots/co/cask/cdap/cdap-watchdog/5.0.0-SNAPSHOT/maven-metadata.xml
29-Jun-2018 18:43:49 [INFO] Downloaded: https://oss.sonatype.org/content/repositories/snapshots/co/cask/cdap/cdap-watchdog/5.0.0-SNAPSHOT/maven-metadata.xml (2 KB at 10.0 KB/sec)
29-Jun-2018 18:43:49 [INFO] Downloading: https://oss.sonatype.org/content/repositories/snapshots/co/cask/cdap/cdap-app-fabric/5.0.0-SNAPSHOT/maven-metadata.xml
29-Jun-2018 18:43:49 [INFO] Downloading: https://repository.apache.org/content/repositories/snapshots/co/cask/cdap/cdap-app-fabric/5.0.0-SNAPSHOT/maven-metadata.xml
29-Jun-2018 18:43:50 [INFO] Downloaded: https://oss.sonatype.org/content/repositories/snapshots/co/cask/cdap/cdap-app-fabric/5.0.0-SNAPSHOT/maven-metadata.xml (2 KB at 12.1 KB/sec)
29-Jun-2018 18:43:50 [INFO] Downloading: https://oss.sonatype.org/content/repositories/snapshots/co/cask/cdap/cdap-notifications/5.0.0-SNAPSHOT/maven-metadata.xml
29-Jun-2018 18:43:50 [INFO] Downloading: https://repository.apache.org/content/repositories/snapshots/co/cask/cdap/cdap-notifications/5.0.0-SNAPSHOT/maven-metadata.xml
29-Jun-2018 18:43:50 [INFO] Downloaded: https://oss.sonatype.org/content/repositories/snapshots/co/cask/cdap/cdap-notifications/5.0.0-SNAPSHOT/maven-metadata.xml (2 KB at 9.8 KB/sec)
29-Jun-2018 18:43:50 [INFO] Downloading: https://oss.sonatype.org/content/repositories/snapshots/co/cask/cdap/cdap-client/5.0.0-SNAPSHOT/maven-metadata.xml
29-Jun-2018 18:43:50 [INFO] Downloading: https://repository.apache.org/content/repositories/snapshots/co/cask/cdap/cdap-client/5.0.0-SNAPSHOT/maven-metadata.xml
29-Jun-2018 18:43:50 [INFO] Downloaded: https://oss.sonatype.org/content/repositories/snapshots/co/cask/cdap/cdap-client/5.0.0-SNAPSHOT/maven-metadata.xml (2 KB at 8.8 KB/sec)
29-Jun-2018 18:43:50 [INFO] Downloading: https://repository.apache.org/content/repositories/snapshots/co/cask/cdap/cdap-explore/5.0.0-SNAPSHOT/maven-metadata.xml
29-Jun-2018 18:43:50 [INFO] Downloading: https://oss.sonatype.org/content/repositories/snapshots/co/cask/cdap/cdap-explore/5.0.0-SNAPSHOT/maven-metadata.xml
29-Jun-2018 18:43:50 [INFO] Downloaded: https://oss.sonatype.org/content/repositories/snapshots/co/cask/cdap/cdap-explore/5.0.0-SNAPSHOT/maven-metadata.xml (2 KB at 7.5 KB/sec)
29-Jun-2018 18:43:50 [INFO] Downloading: https://repository.apache.org/content/repositories/snapshots/co/cask/cdap/cdap-standalone/5.0.0-SNAPSHOT/maven-metadata.xml
29-Jun-2018 18:43:50 [INFO] Downloading: https://oss.sonatype.org/content/repositories/snapshots/co/cask/cdap/cdap-standalone/5.0.0-SNAPSHOT/maven-metadata.xml
29-Jun-2018 18:43:50 [INFO] Downloaded: https://oss.sonatype.org/content/repositories/snapshots/co/cask/cdap/cdap-standalone/5.0.0-SNAPSHOT/maven-metadata.xml (2 KB at 11.1 KB/sec)
29-Jun-2018 18:43:50 [INFO] Downloading: https://oss.sonatype.org/content/repositories/snapshots/co/cask/cdap/cdap-cli/5.0.0-SNAPSHOT/maven-metadata.xml
29-Jun-2018 18:43:50 [INFO] Downloading: https://repository.apache.org/content/repositories/snapshots/co/cask/cdap/cdap-cli/5.0.0-SNAPSHOT/maven-metadata.xml
29-Jun-2018 18:43:50 [INFO] Downloaded: https://oss.sonatype.org/content/repositories/snapshots/co/cask/cdap/cdap-cli/5.0.0-SNAPSHOT/maven-metadata.xml (2 KB at 9.7 KB/sec)
29-Jun-2018 18:43:51 [INFO] Downloading: https://oss.sonatype.org/content/repositories/snapshots/co/cask/cdap/cdap-explore-jdbc/5.0.0-SNAPSHOT/maven-metadata.xml
29-Jun-2018 18:43:51 [INFO] Downloading: https://repository.apache.org/content/repositories/snapshots/co/cask/cdap/cdap-explore-jdbc/5.0.0-SNAPSHOT/maven-metadata.xml
29-Jun-2018 18:43:51 [INFO] Downloaded: https://oss.sonatype.org/content/repositories/snapshots/co/cask/cdap/cdap-explore-jdbc/5.0.0-SNAPSHOT/maven-metadata.xml (2 KB at 10.2 KB/sec)
29-Jun-2018 18:43:51 [INFO] Downloading: https://repository.apache.org/content/repositories/snapshots/co/cask/cdap/cdap-api-spark2_2.11/5.0.0-SNAPSHOT/maven-metadata.xml
29-Jun-2018 18:43:51 [INFO] Downloading: https://oss.sonatype.org/content/repositories/snapshots/co/cask/cdap/cdap-api-spark2_2.11/5.0.0-SNAPSHOT/maven-metadata.xml
29-Jun-2018 18:43:51 [INFO] Downloaded: https://oss.sonatype.org/content/repositories/snapshots/co/cask/cdap/cdap-api-spark2_2.11/5.0.0-SNAPSHOT/maven-metadata.xml (2 KB at 10.6 KB/sec)
29-Jun-2018 18:43:51 [INFO] Downloading: https://repository.apache.org/content/repositories/snapshots/co/cask/cdap/cdap-spark-core2_2.11/5.0.0-SNAPSHOT/maven-metadata.xml
29-Jun-2018 18:43:51 [INFO] Downloading: https://oss.sonatype.org/content/repositories/snapshots/co/cask/cdap/cdap-spark-core2_2.11/5.0.0-SNAPSHOT/maven-metadata.xml
29-Jun-2018 18:43:51 [INFO] Downloaded: https://oss.sonatype.org/content/repositories/snapshots/co/cask/cdap/cdap-spark-core2_2.11/5.0.0-SNAPSHOT/maven-metadata.xml (2 KB at 10.6 KB/sec)
29-Jun-2018 18:43:51 [INFO] Downloading: https://oss.sonatype.org/content/repositories/snapshots/co/cask/cdap/cdap-spark-python/5.0.0-SNAPSHOT/maven-metadata.xml
29-Jun-2018 18:43:51 [INFO] Downloading: https://repository.apache.org/content/repositories/snapshots/co/cask/cdap/cdap-spark-python/5.0.0-SNAPSHOT/maven-metadata.xml
29-Jun-2018 18:43:51 [INFO] Downloaded: https://oss.sonatype.org/content/repositories/snapshots/co/cask/cdap/cdap-spark-python/5.0.0-SNAPSHOT/maven-metadata.xml (2 KB at 10.9 KB/sec)
29-Jun-2018 18:43:51 [INFO] Downloading: https://repository.apache.org/content/repositories/snapshots/co/cask/cdap/cdap-ui/5.0.0-SNAPSHOT/maven-metadata.xml
29-Jun-2018 18:43:51 [INFO] Downloading: https://oss.sonatype.org/content/repositories/snapshots/co/cask/cdap/cdap-ui/5.0.0-SNAPSHOT/maven-metadata.xml
29-Jun-2018 18:43:51 [INFO] Downloaded: https://oss.sonatype.org/content/repositories/snapshots/co/cask/cdap/cdap-ui/5.0.0-SNAPSHOT/maven-metadata.xml (2 KB at 11.1 KB/sec)
29-Jun-2018 18:43:51 [INFO] Downloading: https://repository.apache.org/content/repositories/snapshots/co/cask/cdap/cdap-spark-core/5.0.0-SNAPSHOT/maven-metadata.xml
29-Jun-2018 18:43:51 [INFO] Downloading: https://oss.sonatype.org/content/repositories/snapshots/co/cask/cdap/cdap-spark-core/5.0.0-SNAPSHOT/maven-metadata.xml
29-Jun-2018 18:43:52 [INFO] Downloaded: https://oss.sonatype.org/content/repositories/snapshots/co/cask/cdap/cdap-spark-core/5.0.0-SNAPSHOT/maven-metadata.xml (2 KB at 10.7 KB/sec)
29-Jun-2018 18:43:52 [INFO] Downloading: https://oss.sonatype.org/content/repositories/snapshots/co/cask/cdap/cdap-common-unit-test/5.0.0-SNAPSHOT/maven-metadata.xml
29-Jun-2018 18:43:52 [INFO] Downloading: https://repository.apache.org/content/repositories/snapshots/co/cask/cdap/cdap-common-unit-test/5.0.0-SNAPSHOT/maven-metadata.xml
29-Jun-2018 18:43:52 [INFO] Downloaded: https://oss.sonatype.org/content/repositories/snapshots/co/cask/cdap/cdap-common-unit-test/5.0.0-SNAPSHOT/maven-metadata.xml (2 KB at 10.6 KB/sec)
29-Jun-2018 18:43:52 [INFO] Downloading: https://oss.sonatype.org/content/repositories/snapshots/co/cask/chaosmonkey/chaos-monkey-standalone/0.1.0-SNAPSHOT/maven-metadata.xml
29-Jun-2018 18:43:52 [INFO] Downloaded: https://oss.sonatype.org/content/repositories/snapshots/co/cask/chaosmonkey/chaos-monkey-standalone/0.1.0-SNAPSHOT/maven-metadata.xml (2 KB at 9.0 KB/sec)
29-Jun-2018 18:43:52 [INFO] Downloading: https://oss.sonatype.org/content/repositories/snapshots/co/cask/chaosmonkey/chaos-monkey/0.1.0-SNAPSHOT/maven-metadata.xml
29-Jun-2018 18:43:52 [INFO] Downloaded: https://oss.sonatype.org/content/repositories/snapshots/co/cask/chaosmonkey/chaos-monkey/0.1.0-SNAPSHOT/maven-metadata.xml (610 B at 5.6 KB/sec)
29-Jun-2018 18:43:52 [INFO] Downloading: https://oss.sonatype.org/content/repositories/snapshots/co/cask/chaosmonkey/chaos-monkey-common/0.1.0-SNAPSHOT/maven-metadata.xml
29-Jun-2018 18:43:52 [INFO] Downloading: https://oss.sonatype.org/content/repositories/snapshots/co/cask/chaosmonkey/chaos-monkey-common/0.1.0-SNAPSHOT/maven-metadata.xml
29-Jun-2018 18:43:52 [INFO] Downloaded: https://oss.sonatype.org/content/repositories/snapshots/co/cask/chaosmonkey/chaos-monkey-common/0.1.0-SNAPSHOT/maven-metadata.xml (2 KB at 11.1 KB/sec)
29-Jun-2018 18:43:52 [INFO] Downloaded: https://oss.sonatype.org/content/repositories/snapshots/co/cask/chaosmonkey/chaos-monkey-common/0.1.0-SNAPSHOT/maven-metadata.xml (2 KB at 7.1 KB/sec)
29-Jun-2018 18:43:52 [INFO] Downloading: https://oss.sonatype.org/content/repositories/snapshots/co/cask/chaosmonkey/chaos-monkey-proto/0.1.0-SNAPSHOT/maven-metadata.xml
29-Jun-2018 18:43:52 [INFO] Downloading: https://oss.sonatype.org/content/repositories/snapshots/co/cask/chaosmonkey/chaos-monkey-proto/0.1.0-SNAPSHOT/maven-metadata.xml
29-Jun-2018 18:43:52 [INFO] Downloaded: https://oss.sonatype.org/content/repositories/snapshots/co/cask/chaosmonkey/chaos-monkey-proto/0.1.0-SNAPSHOT/maven-metadata.xml (2 KB at 10.8 KB/sec)
29-Jun-2018 18:43:52 [INFO] Downloaded: https://oss.sonatype.org/content/repositories/snapshots/co/cask/chaosmonkey/chaos-monkey-proto/0.1.0-SNAPSHOT/maven-metadata.xml (2 KB at 10.6 KB/sec)
29-Jun-2018 18:43:53 [INFO]
29-Jun-2018 18:43:53 [INFO] --- maven-clean-plugin:2.5:clean (default-clean) @ integration-test ---
29-Jun-2018 18:43:53 [INFO] Deleting /var/bamboo/xml-data/build-dir/IT-ITCC3-JOB1/target
29-Jun-2018 18:43:53 [INFO]
29-Jun-2018 18:43:53 [INFO] --- apache-rat-plugin:0.10:check (rat-check) @ integration-test ---
29-Jun-2018 18:43:53 [INFO] 56 implicit excludes (use -debug for more details).
29-Jun-2018 18:43:53 [INFO] Exclude: LICENSE*.txt
29-Jun-2018 18:43:53 [INFO] Exclude: **/Apache-LICENSE-2.0
29-Jun-2018 18:43:53 [INFO] Exclude: **/*.state
29-Jun-2018 18:43:53 [INFO] Exclude: **/*.json
29-Jun-2018 18:43:53 [INFO] Exclude: **/*.csv
29-Jun-2018 18:43:53 [INFO] Exclude: **/*.conf
29-Jun-2018 18:43:53 [INFO] 13 resources included (use -debug for more details)
29-Jun-2018 18:43:53 Warning:  org.apache.xerces.jaxp.SAXParserImpl$JAXPSAXParser: Property 'http://www.oracle.com/xml/jaxp/properties/entityExpansionLimit' is not recognized.
29-Jun-2018 18:43:53 Compiler warnings:
29-Jun-2018 18:43:53   WARNING:  'org.apache.xerces.jaxp.SAXParserImpl: Property 'http://javax.xml.XMLConstants/property/accessExternalDTD' is not recognized.'
29-Jun-2018 18:43:53 Warning:  org.apache.xerces.parsers.SAXParser: Feature 'http://javax.xml.XMLConstants/feature/secure-processing' is not recognized.
29-Jun-2018 18:43:53 Warning:  org.apache.xerces.parsers.SAXParser: Property 'http://javax.xml.XMLConstants/property/accessExternalDTD' is not recognized.
29-Jun-2018 18:43:53 Warning:  org.apache.xerces.parsers.SAXParser: Property 'http://www.oracle.com/xml/jaxp/properties/entityExpansionLimit' is not recognized.
29-Jun-2018 18:43:53 [INFO] Rat check: Summary of files. Unapproved: 0 unknown: 0 generated: 0 approved: 10 licence.
29-Jun-2018 18:43:53 [INFO]
29-Jun-2018 18:43:53 [INFO] --- maven-checkstyle-plugin:2.12.1:check (validate) @ integration-test ---
29-Jun-2018 18:43:54 [INFO] Starting audit...
29-Jun-2018 18:43:54 Audit done.
29-Jun-2018 18:43:54
29-Jun-2018 18:43:54 [INFO]                                                                         
29-Jun-2018 18:43:54 [INFO] ------------------------------------------------------------------------
29-Jun-2018 18:43:54 [INFO] Building integration-test-core 1.0.0
29-Jun-2018 18:43:54 [INFO] ------------------------------------------------------------------------
29-Jun-2018 18:43:55 [INFO]
29-Jun-2018 18:43:55 [INFO] --- maven-clean-plugin:2.5:clean (default-clean) @ integration-test-core ---
29-Jun-2018 18:43:55 [INFO] Deleting /var/bamboo/xml-data/build-dir/IT-ITCC3-JOB1/integration-test-core/target
29-Jun-2018 18:43:55 [INFO]
29-Jun-2018 18:43:55 [INFO] --- apache-rat-plugin:0.10:check (rat-check) @ integration-test-core ---
29-Jun-2018 18:43:55 [INFO] 51 implicit excludes (use -debug for more details).
29-Jun-2018 18:43:55 [INFO] Exclude: LICENSE*.txt
29-Jun-2018 18:43:55 [INFO] Exclude: **/Apache-LICENSE-2.0
29-Jun-2018 18:43:55 [INFO] Exclude: **/*.state
29-Jun-2018 18:43:55 [INFO] Exclude: **/*.json
29-Jun-2018 18:43:55 [INFO] Exclude: **/*.csv
29-Jun-2018 18:43:55 [INFO] Exclude: **/*.conf
29-Jun-2018 18:43:55 [INFO] 22 resources included (use -debug for more details)
29-Jun-2018 18:43:55 Warning:  org.apache.xerces.jaxp.SAXParserImpl$JAXPSAXParser: Property 'http://www.oracle.com/xml/jaxp/properties/entityExpansionLimit' is not recognized.
29-Jun-2018 18:43:55 Compiler warnings:
29-Jun-2018 18:43:55   WARNING:  'org.apache.xerces.jaxp.SAXParserImpl: Property 'http://javax.xml.XMLConstants/property/accessExternalDTD' is not recognized.'
29-Jun-2018 18:43:55 Warning:  org.apache.xerces.parsers.SAXParser: Feature 'http://javax.xml.XMLConstants/feature/secure-processing' is not recognized.
29-Jun-2018 18:43:55 Warning:  org.apache.xerces.parsers.SAXParser: Property 'http://javax.xml.XMLConstants/property/accessExternalDTD' is not recognized.
29-Jun-2018 18:43:55 Warning:  org.apache.xerces.parsers.SAXParser: Property 'http://www.oracle.com/xml/jaxp/properties/entityExpansionLimit' is not recognized.
29-Jun-2018 18:43:55 [INFO] Rat check: Summary of files. Unapproved: 0 unknown: 0 generated: 0 approved: 22 licence.
29-Jun-2018 18:43:55 [INFO]
29-Jun-2018 18:43:55 [INFO] --- maven-resources-plugin:2.6:resources (default-resources) @ integration-test-core ---
29-Jun-2018 18:43:55 [INFO] Using 'UTF-8' encoding to copy filtered resources.
29-Jun-2018 18:43:55 [INFO] skip non existing resourceDirectory /var/bamboo/xml-data/build-dir/IT-ITCC3-JOB1/integration-test-core/src/main/resources
29-Jun-2018 18:43:55 [INFO]
29-Jun-2018 18:43:55 [INFO] --- maven-compiler-plugin:3.1:compile (default-compile) @ integration-test-core ---
29-Jun-2018 18:43:55 [INFO] Changes detected - recompiling the module!
29-Jun-2018 18:43:55 [INFO] Compiling 21 source files to /var/bamboo/xml-data/build-dir/IT-ITCC3-JOB1/integration-test-core/target/classes
29-Jun-2018 18:43:57 [INFO]
29-Jun-2018 18:43:57 [INFO] --- maven-resources-plugin:2.6:testResources (default-testResources) @ integration-test-core ---
29-Jun-2018 18:43:57 [INFO] Using 'UTF-8' encoding to copy filtered resources.
29-Jun-2018 18:43:57 [INFO] skip non existing resourceDirectory /var/bamboo/xml-data/build-dir/IT-ITCC3-JOB1/integration-test-core/src/test/resources
29-Jun-2018 18:43:57 [INFO]
29-Jun-2018 18:43:57 [INFO] --- maven-compiler-plugin:3.1:testCompile (default-testCompile) @ integration-test-core ---
29-Jun-2018 18:43:57 [INFO] No sources to compile
29-Jun-2018 18:43:57 [INFO]
29-Jun-2018 18:43:57 [INFO] --- maven-checkstyle-plugin:2.12.1:check (validate) @ integration-test-core ---
29-Jun-2018 18:43:57 [INFO] Starting audit...
29-Jun-2018 18:43:57 Audit done.
29-Jun-2018 18:43:57
29-Jun-2018 18:43:57 [INFO]
29-Jun-2018 18:43:57 [INFO] --- maven-surefire-plugin:2.18.1:test (default-test) @ integration-test-core ---
29-Jun-2018 18:43:58 [INFO] No tests to run.
29-Jun-2018 18:43:58 [INFO]                                                                         
29-Jun-2018 18:43:58 [INFO] ------------------------------------------------------------------------
29-Jun-2018 18:43:58 [INFO] Building integration-test-remote 1.0.0
29-Jun-2018 18:43:58 [INFO] ------------------------------------------------------------------------
29-Jun-2018 18:43:58 [INFO]
29-Jun-2018 18:43:58 [INFO] --- maven-clean-plugin:2.5:clean (default-clean) @ integration-test-remote ---
29-Jun-2018 18:43:58 [INFO] Deleting /var/bamboo/xml-data/build-dir/IT-ITCC3-JOB1/integration-test-remote/target
29-Jun-2018 18:43:58 [INFO]
29-Jun-2018 18:43:58 [INFO] --- apache-rat-plugin:0.10:check (rat-check) @ integration-test-remote ---
29-Jun-2018 18:43:58 [INFO] 51 implicit excludes (use -debug for more details).
29-Jun-2018 18:43:58 [INFO] Exclude: LICENSE*.txt
29-Jun-2018 18:43:58 [INFO] Exclude: **/Apache-LICENSE-2.0
29-Jun-2018 18:43:58 [INFO] Exclude: **/*.state
29-Jun-2018 18:43:58 [INFO] Exclude: **/*.json
29-Jun-2018 18:43:58 [INFO] Exclude: **/*.csv
29-Jun-2018 18:43:58 [INFO] Exclude: **/*.conf
29-Jun-2018 18:43:58 [INFO] 150 resources included (use -debug for more details)
29-Jun-2018 18:43:58 Warning:  org.apache.xerces.jaxp.SAXParserImpl$JAXPSAXParser: Property 'http://www.oracle.com/xml/jaxp/properties/entityExpansionLimit' is not recognized.
29-Jun-2018 18:43:58 Compiler warnings:
29-Jun-2018 18:43:58   WARNING:  'org.apache.xerces.jaxp.SAXParserImpl: Property 'http://javax.xml.XMLConstants/property/accessExternalDTD' is not recognized.'
29-Jun-2018 18:43:58 Warning:  org.apache.xerces.parsers.SAXParser: Feature 'http://javax.xml.XMLConstants/feature/secure-processing' is not recognized.
29-Jun-2018 18:43:58 Warning:  org.apache.xerces.parsers.SAXParser: Property 'http://javax.xml.XMLConstants/property/accessExternalDTD' is not recognized.
29-Jun-2018 18:43:58 Warning:  org.apache.xerces.parsers.SAXParser: Property 'http://www.oracle.com/xml/jaxp/properties/entityExpansionLimit' is not recognized.
29-Jun-2018 18:43:58 [INFO] Rat check: Summary of files. Unapproved: 0 unknown: 0 generated: 0 approved: 146 licence.
29-Jun-2018 18:43:58 [INFO]
29-Jun-2018 18:43:58 [INFO] --- maven-resources-plugin:2.6:resources (default-resources) @ integration-test-remote ---
29-Jun-2018 18:43:58 [INFO] Using 'UTF-8' encoding to copy filtered resources.
29-Jun-2018 18:43:58 [INFO] skip non existing resourceDirectory /var/bamboo/xml-data/build-dir/IT-ITCC3-JOB1/integration-test-remote/src/main/resources
29-Jun-2018 18:43:58 [INFO]
29-Jun-2018 18:43:58 [INFO] --- maven-compiler-plugin:3.1:compile (default-compile) @ integration-test-remote ---
29-Jun-2018 18:43:58 [INFO] Changes detected - recompiling the module!
29-Jun-2018 18:43:58 [INFO] Compiling 1 source file to /var/bamboo/xml-data/build-dir/IT-ITCC3-JOB1/integration-test-remote/target/classes
29-Jun-2018 18:43:59 [INFO]
29-Jun-2018 18:43:59 [INFO] --- maven-resources-plugin:2.6:testResources (default-testResources) @ integration-test-remote ---
29-Jun-2018 18:43:59 [INFO] Using 'UTF-8' encoding to copy filtered resources.
29-Jun-2018 18:43:59 [INFO] Copying 10 resources
29-Jun-2018 18:43:59 [INFO]
29-Jun-2018 18:43:59 [INFO] --- maven-compiler-plugin:3.1:testCompile (default-testCompile) @ integration-test-remote ---
29-Jun-2018 18:43:59 [INFO] Changes detected - recompiling the module!
29-Jun-2018 18:43:59 [INFO] Compiling 140 source files to /var/bamboo/xml-data/build-dir/IT-ITCC3-JOB1/integration-test-remote/target/test-classes
29-Jun-2018 18:44:01 [INFO] -------------------------------------------------------------
29-Jun-2018 18:44:01 [WARNING] COMPILATION WARNING :
29-Jun-2018 18:44:01 [INFO] -------------------------------------------------------------
29-Jun-2018 18:44:01 [WARNING] /var/bamboo/xml-data/build-dir/IT-ITCC3-JOB1/integration-test-remote/src/test/java/co/cask/cdap/apps/metadata/PurchaseMetadataTest.java: Some input files use or override a deprecated API.
29-Jun-2018 18:44:01 [WARNING] /var/bamboo/xml-data/build-dir/IT-ITCC3-JOB1/integration-test-remote/src/test/java/co/cask/cdap/apps/metadata/PurchaseMetadataTest.java: Recompile with -Xlint:deprecation for details.
29-Jun-2018 18:44:01 [WARNING] /var/bamboo/xml-data/build-dir/IT-ITCC3-JOB1/integration-test-remote/src/test/java/co/cask/cdap/apps/metadata/ProgramMetadataApp.java: Some input files use unchecked or unsafe operations.
29-Jun-2018 18:44:01 [WARNING] /var/bamboo/xml-data/build-dir/IT-ITCC3-JOB1/integration-test-remote/src/test/java/co/cask/cdap/apps/metadata/ProgramMetadataApp.java: Recompile with -Xlint:unchecked for details.
29-Jun-2018 18:44:01 [INFO] 4 warnings
29-Jun-2018 18:44:01 [INFO] -------------------------------------------------------------
29-Jun-2018 18:44:01 [INFO] -------------------------------------------------------------
29-Jun-2018 18:44:01 [ERROR] COMPILATION ERROR :
29-Jun-2018 18:44:01 [INFO] -------------------------------------------------------------
29-Jun-2018 18:44:01 [ERROR] /var/bamboo/xml-data/build-dir/IT-ITCC3-JOB1/integration-test-remote/src/test/java/co/cask/cdap/apps/metadata/ProgramMetadataApp.java:[84,16] cannot find symbol
29-Jun-2018 18:44:01   symbol:   method getMetadata(co.cask.cdap.api.metadata.MetadataEntity)
29-Jun-2018 18:44:01   location: variable context of type co.cask.cdap.api.mapreduce.MapReduceContext
29-Jun-2018 18:44:01 [ERROR] /var/bamboo/xml-data/build-dir/IT-ITCC3-JOB1/integration-test-remote/src/test/java/co/cask/cdap/apps/metadata/ProgramMetadataApp.java:[106,16] cannot find symbol
29-Jun-2018 18:44:01   symbol:   method getMetadata(co.cask.cdap.api.metadata.MetadataEntity)
29-Jun-2018 18:44:01   location: variable context of type co.cask.cdap.api.mapreduce.MapReduceContext
29-Jun-2018 18:44:01 [ERROR] /var/bamboo/xml-data/build-dir/IT-ITCC3-JOB1/integration-test-remote/src/test/java/co/cask/cdap/apps/metadata/ProgramMetadataApp.java:[118,32] cannot find symbol
29-Jun-2018 18:44:01   symbol:   method getMetadata(co.cask.cdap.api.metadata.MetadataEntity)
29-Jun-2018 18:44:01   location: variable context of type co.cask.cdap.api.mapreduce.MapReduceContext
29-Jun-2018 18:44:01 [ERROR] /var/bamboo/xml-data/build-dir/IT-ITCC3-JOB1/integration-test-remote/src/test/java/co/cask/cdap/apps/metadata/ProgramMetadataApp.java:[130,32] cannot find symbol
29-Jun-2018 18:44:01   symbol:   method getMetadata(co.cask.cdap.api.metadata.MetadataEntity)
29-Jun-2018 18:44:01   location: variable context of type co.cask.cdap.api.mapreduce.MapReduceContext
29-Jun-2018 18:44:01 [ERROR] /var/bamboo/xml-data/build-dir/IT-ITCC3-JOB1/integration-test-remote/src/test/java/co/cask/cdap/apps/metadata/ProgramMetadataApp.java:[137,32] cannot find symbol
29-Jun-2018 18:44:01   symbol:   method getMetadata(co.cask.cdap.api.metadata.MetadataEntity)
29-Jun-2018 18:44:01   location: variable context of type co.cask.cdap.api.mapreduce.MapReduceContext
29-Jun-2018 18:44:01 [ERROR] /var/bamboo/xml-data/build-dir/IT-ITCC3-JOB1/integration-test-remote/src/test/java/co/cask/cdap/apps/metadata/ProgramMetadataApp.java:[145,16] cannot find symbol
29-Jun-2018 18:44:01   symbol:   method addTags(co.cask.cdap.api.metadata.MetadataEntity,java.lang.String)
29-Jun-2018 18:44:01   location: variable context of type co.cask.cdap.api.mapreduce.MapReduceContext
29-Jun-2018 18:44:01 [ERROR] /var/bamboo/xml-data/build-dir/IT-ITCC3-JOB1/integration-test-remote/src/test/java/co/cask/cdap/apps/metadata/ProgramMetadataApp.java:[151,25] cannot find symbol
29-Jun-2018 18:44:01   symbol:   method getMetadata(co.cask.cdap.api.metadata.MetadataEntity)
29-Jun-2018 18:44:01   location: interface co.cask.cdap.api.mapreduce.MapReduceContext
29-Jun-2018 18:44:01 [ERROR] /var/bamboo/xml-data/build-dir/IT-ITCC3-JOB1/integration-test-remote/src/test/java/co/cask/cdap/apps/metadata/ProgramMetadataApp.java:[159,14] cannot find symbol
29-Jun-2018 18:44:01   symbol:   method addProperties(co.cask.cdap.api.metadata.MetadataEntity,java.util.Map<java.lang.String,java.lang.String>)
29-Jun-2018 18:44:01   location: variable context of type co.cask.cdap.api.mapreduce.MapReduceContext
29-Jun-2018 18:44:01 [ERROR] /var/bamboo/xml-data/build-dir/IT-ITCC3-JOB1/integration-test-remote/src/test/java/co/cask/cdap/apps/metadata/ProgramMetadataApp.java:[164,20] cannot find symbol
29-Jun-2018 18:44:01   symbol:   method getMetadata(co.cask.cdap.api.metadata.MetadataEntity)
29-Jun-2018 18:44:01   location: variable context of type co.cask.cdap.api.mapreduce.MapReduceContext
29-Jun-2018 18:44:01 [ERROR] /var/bamboo/xml-data/build-dir/IT-ITCC3-JOB1/integration-test-remote/src/test/java/co/cask/cdap/apps/metadata/ProgramMetadataApp.java:[173,14] cannot find symbol
29-Jun-2018 18:44:01   symbol:   method removeTags(co.cask.cdap.api.metadata.MetadataEntity,java.lang.String)
29-Jun-2018 18:44:01   location: variable context of type co.cask.cdap.api.mapreduce.MapReduceContext
29-Jun-2018 18:44:01 [ERROR] /var/bamboo/xml-data/build-dir/IT-ITCC3-JOB1/integration-test-remote/src/test/java/co/cask/cdap/apps/metadata/ProgramMetadataApp.java:[179,20] cannot find symbol
29-Jun-2018 18:44:01   symbol:   method getMetadata(co.cask.cdap.api.metadata.MetadataEntity)
29-Jun-2018 18:44:01   location: variable context of type co.cask.cdap.api.mapreduce.MapReduceContext
29-Jun-2018 18:44:01 [ERROR] /var/bamboo/xml-data/build-dir/IT-ITCC3-JOB1/integration-test-remote/src/test/java/co/cask/cdap/apps/metadata/ProgramMetadataApp.java:[187,14] cannot find symbol
29-Jun-2018 18:44:01   symbol:   method removeTags(co.cask.cdap.api.metadata.MetadataEntity)
29-Jun-2018 18:44:01   location: variable context of type co.cask.cdap.api.mapreduce.MapReduceContext
29-Jun-2018 18:44:01 [ERROR] /var/bamboo/xml-data/build-dir/IT-ITCC3-JOB1/integration-test-remote/src/test/java/co/cask/cdap/apps/metadata/ProgramMetadataApp.java:[193,20] cannot find symbol
29-Jun-2018 18:44:01   symbol:   method getMetadata(co.cask.cdap.api.metadata.MetadataEntity)
29-Jun-2018 18:44:01   location: variable context of type co.cask.cdap.api.mapreduce.MapReduceContext
29-Jun-2018 18:44:01 [ERROR] /var/bamboo/xml-data/build-dir/IT-ITCC3-JOB1/integration-test-remote/src/test/java/co/cask/cdap/apps/metadata/ProgramMetadataApp.java:[201,14] cannot find symbol
29-Jun-2018 18:44:01   symbol:   method removeProperties(co.cask.cdap.api.metadata.MetadataEntity,java.lang.String)
29-Jun-2018 18:44:01   location: variable context of type co.cask.cdap.api.mapreduce.MapReduceContext
29-Jun-2018 18:44:01 [ERROR] /var/bamboo/xml-data/build-dir/IT-ITCC3-JOB1/integration-test-remote/src/test/java/co/cask/cdap/apps/metadata/ProgramMetadataApp.java:[207,20] cannot find symbol
29-Jun-2018 18:44:01   symbol:   method getMetadata(co.cask.cdap.api.metadata.MetadataEntity)
29-Jun-2018 18:44:01   location: variable context of type co.cask.cdap.api.mapreduce.MapReduceContext
29-Jun-2018 18:44:01 [ERROR] /var/bamboo/xml-data/build-dir/IT-ITCC3-JOB1/integration-test-remote/src/test/java/co/cask/cdap/apps/metadata/ProgramMetadataApp.java:[215,14] cannot find symbol
29-Jun-2018 18:44:01   symbol:   method removeProperties(co.cask.cdap.api.metadata.MetadataEntity)
29-Jun-2018 18:44:01   location: variable context of type co.cask.cdap.api.mapreduce.MapReduceContext
29-Jun-2018 18:44:01 [ERROR] /var/bamboo/xml-data/build-dir/IT-ITCC3-JOB1/integration-test-remote/src/test/java/co/cask/cdap/apps/metadata/ProgramMetadataApp.java:[221,20] cannot find symbol
29-Jun-2018 18:44:01   symbol:   method getMetadata(co.cask.cdap.api.metadata.MetadataEntity)
29-Jun-2018 18:44:01   location: variable context of type co.cask.cdap.api.mapreduce.MapReduceContext
29-Jun-2018 18:44:01 [ERROR] /var/bamboo/xml-data/build-dir/IT-ITCC3-JOB1/integration-test-remote/src/test/java/co/cask/cdap/apps/metadata/ProgramMetadataApp.java:[229,14] cannot find symbol
29-Jun-2018 18:44:01   symbol:   method removeMetadata(co.cask.cdap.api.metadata.MetadataEntity)
29-Jun-2018 18:44:01   location: variable context of type co.cask.cdap.api.mapreduce.MapReduceContext
29-Jun-2018 18:44:01 [ERROR] /var/bamboo/xml-data/build-dir/IT-ITCC3-JOB1/integration-test-remote/src/test/java/co/cask/cdap/apps/metadata/ProgramMetadataApp.java:[235,20] cannot find symbol
29-Jun-2018 18:44:01   symbol:   method getMetadata(co.cask.cdap.api.metadata.MetadataEntity)
29-Jun-2018 18:44:01   location: variable context of type co.cask.cdap.api.mapreduce.MapReduceContext
29-Jun-2018 18:44:01 [INFO] 19 errors
29-Jun-2018 18:44:01 [INFO] -------------------------------------------------------------
29-Jun-2018 18:44:01 [INFO] ------------------------------------------------------------------------
29-Jun-2018 18:44:01 [INFO] Reactor Summary:
29-Jun-2018 18:44:01 [INFO]
29-Jun-2018 18:44:01 [INFO] integration-test .................................. SUCCESS [14.678s]
29-Jun-2018 18:44:01 [INFO] integration-test-core ............................. SUCCESS [3.327s]
29-Jun-2018 18:44:01 [INFO] integration-test-remote ........................... FAILURE [3.799s]
29-Jun-2018 18:44:01 [INFO] integration-test-standalone ....................... SKIPPED
29-Jun-2018 18:44:01 [INFO] upgrade-test ...................................... SKIPPED
29-Jun-2018 18:44:01 [INFO] long-running-test ................................. SKIPPED
29-Jun-2018 18:44:01 [INFO] ------------------------------------------------------------------------
29-Jun-2018 18:44:01 [INFO] BUILD FAILURE
29-Jun-2018 18:44:01 [INFO] ------------------------------------------------------------------------
29-Jun-2018 18:44:01 [INFO] Total time: 22.135s
29-Jun-2018 18:44:01 [INFO] Finished at: Fri Jun 29 18:44:01 UTC 2018
29-Jun-2018 18:44:02 [INFO] Final Memory: 108M/765M
29-Jun-2018 18:44:02 [INFO] ------------------------------------------------------------------------
29-Jun-2018 18:44:02 [ERROR] Failed to execute goal org.apache.maven.plugins:maven-compiler-plugin:3.1:testCompile (default-testCompile) on project integration-test-remote: Compilation failure: Compilation failure:
29-Jun-2018 18:44:02 [ERROR] /var/bamboo/xml-data/build-dir/IT-ITCC3-JOB1/integration-test-remote/src/test/java/co/cask/cdap/apps/metadata/ProgramMetadataApp.java:[84,16] cannot find symbol
29-Jun-2018 18:44:02 [ERROR] symbol:   method getMetadata(co.cask.cdap.api.metadata.MetadataEntity)
29-Jun-2018 18:44:02 [ERROR] location: variable context of type co.cask.cdap.api.mapreduce.MapReduceContext
29-Jun-2018 18:44:02 [ERROR] /var/bamboo/xml-data/build-dir/IT-ITCC3-JOB1/integration-test-remote/src/test/java/co/cask/cdap/apps/metadata/ProgramMetadataApp.java:[106,16] cannot find symbol
29-Jun-2018 18:44:02 [ERROR] symbol:   method getMetadata(co.cask.cdap.api.metadata.MetadataEntity)
29-Jun-2018 18:44:02 [ERROR] location: variable context of type co.cask.cdap.api.mapreduce.MapReduceContext
29-Jun-2018 18:44:02 [ERROR] /var/bamboo/xml-data/build-dir/IT-ITCC3-JOB1/integration-test-remote/src/test/java/co/cask/cdap/apps/metadata/ProgramMetadataApp.java:[118,32] cannot find symbol
29-Jun-2018 18:44:02 [ERROR] symbol:   method getMetadata(co.cask.cdap.api.metadata.MetadataEntity)
29-Jun-2018 18:44:02 [ERROR] location: variable context of type co.cask.cdap.api.mapreduce.MapReduceContext
29-Jun-2018 18:44:02 [ERROR] /var/bamboo/xml-data/build-dir/IT-ITCC3-JOB1/integration-test-remote/src/test/java/co/cask/cdap/apps/metadata/ProgramMetadataApp.java:[130,32] cannot find symbol
29-Jun-2018 18:44:02 [ERROR] symbol:   method getMetadata(co.cask.cdap.api.metadata.MetadataEntity)
29-Jun-2018 18:44:02 [ERROR] location: variable context of type co.cask.cdap.api.mapreduce.MapReduceContext
29-Jun-2018 18:44:02 [ERROR] /var/bamboo/xml-data/build-dir/IT-ITCC3-JOB1/integration-test-remote/src/test/java/co/cask/cdap/apps/metadata/ProgramMetadataApp.java:[137,32] cannot find symbol
29-Jun-2018 18:44:02 [ERROR] symbol:   method getMetadata(co.cask.cdap.api.metadata.MetadataEntity)
29-Jun-2018 18:44:02 [ERROR] location: variable context of type co.cask.cdap.api.mapreduce.MapReduceContext
29-Jun-2018 18:44:02 [ERROR] /var/bamboo/xml-data/build-dir/IT-ITCC3-JOB1/integration-test-remote/src/test/java/co/cask/cdap/apps/metadata/ProgramMetadataApp.java:[145,16] cannot find symbol
29-Jun-2018 18:44:02 [ERROR] symbol:   method addTags(co.cask.cdap.api.metadata.MetadataEntity,java.lang.String)
29-Jun-2018 18:44:02 [ERROR] location: variable context of type co.cask.cdap.api.mapreduce.MapReduceContext
29-Jun-2018 18:44:02 [ERROR] /var/bamboo/xml-data/build-dir/IT-ITCC3-JOB1/integration-test-remote/src/test/java/co/cask/cdap/apps/metadata/ProgramMetadataApp.java:[151,25] cannot find symbol
29-Jun-2018 18:44:02 [ERROR] symbol:   method getMetadata(co.cask.cdap.api.metadata.MetadataEntity)
29-Jun-2018 18:44:02 [ERROR] location: interface co.cask.cdap.api.mapreduce.MapReduceContext
29-Jun-2018 18:44:02 [ERROR] /var/bamboo/xml-data/build-dir/IT-ITCC3-JOB1/integration-test-remote/src/test/java/co/cask/cdap/apps/metadata/ProgramMetadataApp.java:[159,14] cannot find symbol
29-Jun-2018 18:44:02 [ERROR] symbol:   method addProperties(co.cask.cdap.api.metadata.MetadataEntity,java.util.Map<java.lang.String,java.lang.String>)
29-Jun-2018 18:44:02 [ERROR] location: variable context of type co.cask.cdap.api.mapreduce.MapReduceContext
29-Jun-2018 18:44:02 [ERROR] /var/bamboo/xml-data/build-dir/IT-ITCC3-JOB1/integration-test-remote/src/test/java/co/cask/cdap/apps/metadata/ProgramMetadataApp.java:[164,20] cannot find symbol
29-Jun-2018 18:44:02 [ERROR] symbol:   method getMetadata(co.cask.cdap.api.metadata.MetadataEntity)
29-Jun-2018 18:44:02 [ERROR] location: variable context of type co.cask.cdap.api.mapreduce.MapReduceContext
29-Jun-2018 18:44:02 [ERROR] /var/bamboo/xml-data/build-dir/IT-ITCC3-JOB1/integration-test-remote/src/test/java/co/cask/cdap/apps/metadata/ProgramMetadataApp.java:[173,14] cannot find symbol
29-Jun-2018 18:44:02 [ERROR] symbol:   method removeTags(co.cask.cdap.api.metadata.MetadataEntity,java.lang.String)
29-Jun-2018 18:44:02 [ERROR] location: variable context of type co.cask.cdap.api.mapreduce.MapReduceContext
29-Jun-2018 18:44:02 [ERROR] /var/bamboo/xml-data/build-dir/IT-ITCC3-JOB1/integration-test-remote/src/test/java/co/cask/cdap/apps/metadata/ProgramMetadataApp.java:[179,20] cannot find symbol
29-Jun-2018 18:44:02 [ERROR] symbol:   method getMetadata(co.cask.cdap.api.metadata.MetadataEntity)
29-Jun-2018 18:44:02 [ERROR] location: variable context of type co.cask.cdap.api.mapreduce.MapReduceContext
29-Jun-2018 18:44:02 [ERROR] /var/bamboo/xml-data/build-dir/IT-ITCC3-JOB1/integration-test-remote/src/test/java/co/cask/cdap/apps/metadata/ProgramMetadataApp.java:[187,14] cannot find symbol
29-Jun-2018 18:44:02 [ERROR] symbol:   method removeTags(co.cask.cdap.api.metadata.MetadataEntity)
29-Jun-2018 18:44:02 [ERROR] location: variable context of type co.cask.cdap.api.mapreduce.MapReduceContext
29-Jun-2018 18:44:02 [ERROR] /var/bamboo/xml-data/build-dir/IT-ITCC3-JOB1/integration-test-remote/src/test/java/co/cask/cdap/apps/metadata/ProgramMetadataApp.java:[193,20] cannot find symbol
29-Jun-2018 18:44:02 [ERROR] symbol:   method getMetadata(co.cask.cdap.api.metadata.MetadataEntity)
29-Jun-2018 18:44:02 [ERROR] location: variable context of type co.cask.cdap.api.mapreduce.MapReduceContext
29-Jun-2018 18:44:02 [ERROR] /var/bamboo/xml-data/build-dir/IT-ITCC3-JOB1/integration-test-remote/src/test/java/co/cask/cdap/apps/metadata/ProgramMetadataApp.java:[201,14] cannot find symbol
29-Jun-2018 18:44:02 [ERROR] symbol:   method removeProperties(co.cask.cdap.api.metadata.MetadataEntity,java.lang.String)
29-Jun-2018 18:44:02 [ERROR] location: variable context of type co.cask.cdap.api.mapreduce.MapReduceContext
29-Jun-2018 18:44:02 [ERROR] /var/bamboo/xml-data/build-dir/IT-ITCC3-JOB1/integration-test-remote/src/test/java/co/cask/cdap/apps/metadata/ProgramMetadataApp.java:[207,20] cannot find symbol
29-Jun-2018 18:44:02 [ERROR] symbol:   method getMetadata(co.cask.cdap.api.metadata.MetadataEntity)
29-Jun-2018 18:44:02 [ERROR] location: variable context of type co.cask.cdap.api.mapreduce.MapReduceContext
29-Jun-2018 18:44:02 [ERROR] /var/bamboo/xml-data/build-dir/IT-ITCC3-JOB1/integration-test-remote/src/test/java/co/cask/cdap/apps/metadata/ProgramMetadataApp.java:[215,14] cannot find symbol
29-Jun-2018 18:44:02 [ERROR] symbol:   method removeProperties(co.cask.cdap.api.metadata.MetadataEntity)
29-Jun-2018 18:44:02 [ERROR] location: variable context of type co.cask.cdap.api.mapreduce.MapReduceContext
29-Jun-2018 18:44:02 [ERROR] /var/bamboo/xml-data/build-dir/IT-ITCC3-JOB1/integration-test-remote/src/test/java/co/cask/cdap/apps/metadata/ProgramMetadataApp.java:[221,20] cannot find symbol
29-Jun-2018 18:44:02 [ERROR] symbol:   method getMetadata(co.cask.cdap.api.metadata.MetadataEntity)
29-Jun-2018 18:44:02 [ERROR] location: variable context of type co.cask.cdap.api.mapreduce.MapReduceContext
29-Jun-2018 18:44:02 [ERROR] /var/bamboo/xml-data/build-dir/IT-ITCC3-JOB1/integration-test-remote/src/test/java/co/cask/cdap/apps/metadata/ProgramMetadataApp.java:[229,14] cannot find symbol
29-Jun-2018 18:44:02 [ERROR] symbol:   method removeMetadata(co.cask.cdap.api.metadata.MetadataEntity)
29-Jun-2018 18:44:02 [ERROR] location: variable context of type co.cask.cdap.api.mapreduce.MapReduceContext
29-Jun-2018 18:44:02 [ERROR] /var/bamboo/xml-data/build-dir/IT-ITCC3-JOB1/integration-test-remote/src/test/java/co/cask/cdap/apps/metadata/ProgramMetadataApp.java:[235,20] cannot find symbol
29-Jun-2018 18:44:02 [ERROR] symbol:   method getMetadata(co.cask.cdap.api.metadata.MetadataEntity)
29-Jun-2018 18:44:02 [ERROR] location: variable context of type co.cask.cdap.api.mapreduce.MapReduceContext
29-Jun-2018 18:44:02 [ERROR] -> [Help 1]
29-Jun-2018 18:44:02 [ERROR]
29-Jun-2018 18:44:02 [ERROR] To see the full stack trace of the errors, re-run Maven with the -e switch.
29-Jun-2018 18:44:02 [ERROR] Re-run Maven using the -X switch to enable full debug logging.
29-Jun-2018 18:44:02 [ERROR]
29-Jun-2018 18:44:02 [ERROR] For more information about the errors and possible solutions, please read the following articles:
29-Jun-2018 18:44:02 [ERROR] [Help 1] http://cwiki.apache.org/confluence/display/MAVEN/MojoFailureException
29-Jun-2018 18:44:02 [ERROR]
29-Jun-2018 18:44:02 [ERROR] After correcting the problems, you can resume the build with the command
29-Jun-2018 18:44:02 [ERROR]   mvn <goals> -rf :integration-test-remote
29-Jun-2018 18:44:02 Failing task since return code of [/opt/maven/bin/mvn --batch-mode -Djava.io.tmpdir=/tmp/IT-ITCC3-JOB1 clean test -U -Dtest=ProgramMetadataTest -Dcdap.username=rsinha -Dcdap.password=******** -DinstanceUri=metprogitn32508-1000.dev.continuuity.net -DprogramTimeout=60 -Dtest.namespace=default -DverifySSL=false] was 1 while expected 0
29-Jun-2018 18:44:02 Parsing test results under /var/bamboo/xml-data/build-dir/IT-ITCC3-JOB1...
29-Jun-2018 18:44:02 Finished task 'Integration test - cluster' with result: Failed
29-Jun-2018 18:44:02 Running post build plugin 'Docker Container Cleanup'
29-Jun-2018 18:44:02 Running post build plugin 'NCover Results Collector'
29-Jun-2018 18:44:02 Running post build plugin 'Clover Results Collector'
29-Jun-2018 18:44:02 Running post build plugin 'npm Cache Cleanup'
29-Jun-2018 18:44:02 Running post build plugin 'Artifact Copier'
29-Jun-2018 18:44:02 Finalising the build...
29-Jun-2018 18:44:02 Stopping timer.
29-Jun-2018 18:44:02 Build IT-ITCC3-JOB1-3 completed.
29-Jun-2018 18:44:02 Running on server: post build plugin 'NCover Results Collector'
29-Jun-2018 18:44:02 Running on server: post build plugin 'Build Hanging Detection Configuration'
29-Jun-2018 18:44:02 Running on server: post build plugin 'Clover Delta Calculator'
29-Jun-2018 18:44:02 Running on server: post build plugin 'Maven Dependencies Postprocessor'
29-Jun-2018 18:44:02 All post build plugins have finished
29-Jun-2018 18:44:02 Generating build results summary...
29-Jun-2018 18:44:02 Saving build results to disk...
29-Jun-2018 18:44:02 Logging substituted variables...
29-Jun-2018 18:44:03 Indexing build results...
29-Jun-2018 18:44:03 Finished building IT-ITCC3-JOB1-3.