Build #3

Build: #3 failed Manual run by Rohit Sinha

Logs

The following logs have been generated by the jobs in this branch.
  • Expand all
  • Collapse all
Job Logs
Collapse Default Job Default Stage Download or View
29-Jun-2018 18:44:02 [ERROR] /var/bamboo/xml-data/build-dir/IT-ITCC3-JOB1/integration-test-remote/src/test/java/co/cask/cdap/apps/metadata/ProgramMetadataApp.java:[207,20] cannot find symbol
29-Jun-2018 18:44:02 [ERROR] symbol:   method getMetadata(co.cask.cdap.api.metadata.MetadataEntity)
29-Jun-2018 18:44:02 [ERROR] location: variable context of type co.cask.cdap.api.mapreduce.MapReduceContext
29-Jun-2018 18:44:02 [ERROR] /var/bamboo/xml-data/build-dir/IT-ITCC3-JOB1/integration-test-remote/src/test/java/co/cask/cdap/apps/metadata/ProgramMetadataApp.java:[215,14] cannot find symbol
29-Jun-2018 18:44:02 [ERROR] symbol:   method removeProperties(co.cask.cdap.api.metadata.MetadataEntity)
29-Jun-2018 18:44:02 [ERROR] location: variable context of type co.cask.cdap.api.mapreduce.MapReduceContext
29-Jun-2018 18:44:02 [ERROR] /var/bamboo/xml-data/build-dir/IT-ITCC3-JOB1/integration-test-remote/src/test/java/co/cask/cdap/apps/metadata/ProgramMetadataApp.java:[221,20] cannot find symbol
29-Jun-2018 18:44:02 [ERROR] symbol:   method getMetadata(co.cask.cdap.api.metadata.MetadataEntity)
29-Jun-2018 18:44:02 [ERROR] location: variable context of type co.cask.cdap.api.mapreduce.MapReduceContext
29-Jun-2018 18:44:02 [ERROR] /var/bamboo/xml-data/build-dir/IT-ITCC3-JOB1/integration-test-remote/src/test/java/co/cask/cdap/apps/metadata/ProgramMetadataApp.java:[229,14] cannot find symbol
29-Jun-2018 18:44:02 [ERROR] symbol:   method removeMetadata(co.cask.cdap.api.metadata.MetadataEntity)
29-Jun-2018 18:44:02 [ERROR] location: variable context of type co.cask.cdap.api.mapreduce.MapReduceContext
29-Jun-2018 18:44:02 [ERROR] /var/bamboo/xml-data/build-dir/IT-ITCC3-JOB1/integration-test-remote/src/test/java/co/cask/cdap/apps/metadata/ProgramMetadataApp.java:[235,20] cannot find symbol
29-Jun-2018 18:44:02 [ERROR] symbol:   method getMetadata(co.cask.cdap.api.metadata.MetadataEntity)
29-Jun-2018 18:44:02 [ERROR] location: variable context of type co.cask.cdap.api.mapreduce.MapReduceContext
29-Jun-2018 18:44:02 [ERROR] -> [Help 1]
29-Jun-2018 18:44:02 [ERROR]
29-Jun-2018 18:44:02 [ERROR] To see the full stack trace of the errors, re-run Maven with the -e switch.
29-Jun-2018 18:44:02 [ERROR] Re-run Maven using the -X switch to enable full debug logging.
29-Jun-2018 18:44:02 [ERROR]
29-Jun-2018 18:44:02 [ERROR] For more information about the errors and possible solutions, please read the following articles:
29-Jun-2018 18:44:02 [ERROR] [Help 1] http://cwiki.apache.org/confluence/display/MAVEN/MojoFailureException
29-Jun-2018 18:44:02 [ERROR]
29-Jun-2018 18:44:02 [ERROR] After correcting the problems, you can resume the build with the command
29-Jun-2018 18:44:02 [ERROR]   mvn <goals> -rf :integration-test-remote