Build #4

Build: #4 failed Manual run by Vinisha Shah

Build result summary

Details

Completed
Duration
34 seconds
Flags
Custom build
Labels
None
Agent
bamboo-agent06
Revision
a33af4c05ba0c15debbbd0f3a4088f1f17415f5e a33af4c05ba0c15debbbd0f3a4088f1f17415f5e
Total tests
46

Responsible

No one has taken responsibility for this failure

Custom variables

Name Value
cdap.cluster u1443559-1000.coopr.sh:11015

Tests

New test failures 46
Status Test View job Duration
Collapse Failed KVTableWithProjectionTest testKVTableWithProjection History
Default Job < 1 sec
io.cdap.common.http.exception.HttpFailureException: Unauthorized
	at io.cdap.cdap.security.authentication.client.AbstractAuthenticationClient.execute(AbstractAuthenticationClient.java:193)
	at io.cdap.cdap.security.authentication.client.AbstractAuthenticationClient.fetchAccessToken(AbstractAuthenticationClient.java:214)
	at io.cdap.cdap.security.authentication.client.AbstractAuthenticationClient.getAccessToken(AbstractAuthenticationClient.java:106)
	at io.cdap.cdap.test.IntegrationTestBase$2.call(IntegrationTestBase.java:236)
	at io.cdap.cdap.test.IntegrationTestBase$2.call(IntegrationTestBase.java:233)
	at io.cdap.cdap.test.IntegrationTestBase.checkServicesWithRetry(IntegrationTestBase.java:248)
	at io.cdap.cdap.test.IntegrationTestBase.fetchAccessToken(IntegrationTestBase.java:233)
(37 more lines...)
Collapse Failed TPFSAvroSinkSourceTest testTPFSWithProjection History
Default Job < 1 sec
io.cdap.common.http.exception.HttpFailureException: Unauthorized
	at io.cdap.cdap.security.authentication.client.AbstractAuthenticationClient.execute(AbstractAuthenticationClient.java:193)
	at io.cdap.cdap.security.authentication.client.AbstractAuthenticationClient.fetchAccessToken(AbstractAuthenticationClient.java:214)
	at io.cdap.cdap.security.authentication.client.AbstractAuthenticationClient.getAccessToken(AbstractAuthenticationClient.java:106)
	at io.cdap.cdap.test.IntegrationTestBase$2.call(IntegrationTestBase.java:236)
	at io.cdap.cdap.test.IntegrationTestBase$2.call(IntegrationTestBase.java:233)
	at io.cdap.cdap.test.IntegrationTestBase.checkServicesWithRetry(IntegrationTestBase.java:248)
	at io.cdap.cdap.test.IntegrationTestBase.fetchAccessToken(IntegrationTestBase.java:233)
(37 more lines...)
Collapse Failed BatchAggregatorTest test History
Default Job < 1 sec
io.cdap.common.http.exception.HttpFailureException: Unauthorized
	at io.cdap.cdap.security.authentication.client.AbstractAuthenticationClient.execute(AbstractAuthenticationClient.java:193)
	at io.cdap.cdap.security.authentication.client.AbstractAuthenticationClient.fetchAccessToken(AbstractAuthenticationClient.java:214)
	at io.cdap.cdap.security.authentication.client.AbstractAuthenticationClient.getAccessToken(AbstractAuthenticationClient.java:106)
	at io.cdap.cdap.test.IntegrationTestBase$2.call(IntegrationTestBase.java:236)
	at io.cdap.cdap.test.IntegrationTestBase$2.call(IntegrationTestBase.java:233)
	at io.cdap.cdap.test.IntegrationTestBase.checkServicesWithRetry(IntegrationTestBase.java:248)
	at io.cdap.cdap.test.IntegrationTestBase.fetchAccessToken(IntegrationTestBase.java:233)
(38 more lines...)
Collapse Failed BatchCubeSinkTest test History
Default Job < 1 sec
io.cdap.common.http.exception.HttpFailureException: Unauthorized
	at io.cdap.cdap.security.authentication.client.AbstractAuthenticationClient.execute(AbstractAuthenticationClient.java:193)
	at io.cdap.cdap.security.authentication.client.AbstractAuthenticationClient.fetchAccessToken(AbstractAuthenticationClient.java:214)
	at io.cdap.cdap.security.authentication.client.AbstractAuthenticationClient.getAccessToken(AbstractAuthenticationClient.java:106)
	at io.cdap.cdap.test.IntegrationTestBase$2.call(IntegrationTestBase.java:236)
	at io.cdap.cdap.test.IntegrationTestBase$2.call(IntegrationTestBase.java:233)
	at io.cdap.cdap.test.IntegrationTestBase.checkServicesWithRetry(IntegrationTestBase.java:248)
	at io.cdap.cdap.test.IntegrationTestBase.fetchAccessToken(IntegrationTestBase.java:233)
(38 more lines...)
Collapse Failed BatchJoinerTest testJoinerSpark History
Default Job < 1 sec
io.cdap.common.http.exception.HttpFailureException: Unauthorized
	at io.cdap.cdap.security.authentication.client.AbstractAuthenticationClient.execute(AbstractAuthenticationClient.java:193)
	at io.cdap.cdap.security.authentication.client.AbstractAuthenticationClient.fetchAccessToken(AbstractAuthenticationClient.java:214)
	at io.cdap.cdap.security.authentication.client.AbstractAuthenticationClient.getAccessToken(AbstractAuthenticationClient.java:106)
	at io.cdap.cdap.test.IntegrationTestBase$2.call(IntegrationTestBase.java:236)
	at io.cdap.cdap.test.IntegrationTestBase$2.call(IntegrationTestBase.java:233)
	at io.cdap.cdap.test.IntegrationTestBase.checkServicesWithRetry(IntegrationTestBase.java:248)
	at io.cdap.cdap.test.IntegrationTestBase.fetchAccessToken(IntegrationTestBase.java:233)
(38 more lines...)
Collapse Failed BatchJoinerTest testJoinerMR History
Default Job < 1 sec
io.cdap.common.http.exception.HttpFailureException: Unauthorized
	at io.cdap.cdap.security.authentication.client.AbstractAuthenticationClient.execute(AbstractAuthenticationClient.java:193)
	at io.cdap.cdap.security.authentication.client.AbstractAuthenticationClient.fetchAccessToken(AbstractAuthenticationClient.java:214)
	at io.cdap.cdap.security.authentication.client.AbstractAuthenticationClient.getAccessToken(AbstractAuthenticationClient.java:106)
	at io.cdap.cdap.test.IntegrationTestBase$2.call(IntegrationTestBase.java:236)
	at io.cdap.cdap.test.IntegrationTestBase$2.call(IntegrationTestBase.java:233)
	at io.cdap.cdap.test.IntegrationTestBase.checkServicesWithRetry(IntegrationTestBase.java:248)
	at io.cdap.cdap.test.IntegrationTestBase.fetchAccessToken(IntegrationTestBase.java:233)
(38 more lines...)
Collapse Failed ETLMapReduceTest testKVToKV History
Default Job < 1 sec
io.cdap.common.http.exception.HttpFailureException: Unauthorized
	at io.cdap.cdap.security.authentication.client.AbstractAuthenticationClient.execute(AbstractAuthenticationClient.java:193)
	at io.cdap.cdap.security.authentication.client.AbstractAuthenticationClient.fetchAccessToken(AbstractAuthenticationClient.java:214)
	at io.cdap.cdap.security.authentication.client.AbstractAuthenticationClient.getAccessToken(AbstractAuthenticationClient.java:106)
	at io.cdap.cdap.test.IntegrationTestBase$2.call(IntegrationTestBase.java:236)
	at io.cdap.cdap.test.IntegrationTestBase$2.call(IntegrationTestBase.java:233)
	at io.cdap.cdap.test.IntegrationTestBase.checkServicesWithRetry(IntegrationTestBase.java:248)
	at io.cdap.cdap.test.IntegrationTestBase.fetchAccessToken(IntegrationTestBase.java:233)
(38 more lines...)
Collapse Failed ETLMapReduceTest testDAGInvalidSchema History
Default Job < 1 sec
io.cdap.common.http.exception.HttpFailureException: Unauthorized
	at io.cdap.cdap.security.authentication.client.AbstractAuthenticationClient.execute(AbstractAuthenticationClient.java:193)
	at io.cdap.cdap.security.authentication.client.AbstractAuthenticationClient.fetchAccessToken(AbstractAuthenticationClient.java:214)
	at io.cdap.cdap.security.authentication.client.AbstractAuthenticationClient.getAccessToken(AbstractAuthenticationClient.java:106)
	at io.cdap.cdap.test.IntegrationTestBase$2.call(IntegrationTestBase.java:236)
	at io.cdap.cdap.test.IntegrationTestBase$2.call(IntegrationTestBase.java:233)
	at io.cdap.cdap.test.IntegrationTestBase.checkServicesWithRetry(IntegrationTestBase.java:248)
	at io.cdap.cdap.test.IntegrationTestBase.fetchAccessToken(IntegrationTestBase.java:233)
(38 more lines...)
Collapse Failed ETLMapReduceTest testDAG History
Default Job < 1 sec
io.cdap.common.http.exception.HttpFailureException: Unauthorized
	at io.cdap.cdap.security.authentication.client.AbstractAuthenticationClient.execute(AbstractAuthenticationClient.java:193)
	at io.cdap.cdap.security.authentication.client.AbstractAuthenticationClient.fetchAccessToken(AbstractAuthenticationClient.java:214)
	at io.cdap.cdap.security.authentication.client.AbstractAuthenticationClient.getAccessToken(AbstractAuthenticationClient.java:106)
	at io.cdap.cdap.test.IntegrationTestBase$2.call(IntegrationTestBase.java:236)
	at io.cdap.cdap.test.IntegrationTestBase$2.call(IntegrationTestBase.java:233)
	at io.cdap.cdap.test.IntegrationTestBase.checkServicesWithRetry(IntegrationTestBase.java:248)
	at io.cdap.cdap.test.IntegrationTestBase.fetchAccessToken(IntegrationTestBase.java:233)
(38 more lines...)
Collapse Failed ETLMapReduceTest testTableToTableWithValidations History
Default Job < 1 sec
io.cdap.common.http.exception.HttpFailureException: Unauthorized
	at io.cdap.cdap.security.authentication.client.AbstractAuthenticationClient.execute(AbstractAuthenticationClient.java:193)
	at io.cdap.cdap.security.authentication.client.AbstractAuthenticationClient.fetchAccessToken(AbstractAuthenticationClient.java:214)
	at io.cdap.cdap.security.authentication.client.AbstractAuthenticationClient.getAccessToken(AbstractAuthenticationClient.java:106)
	at io.cdap.cdap.test.IntegrationTestBase$2.call(IntegrationTestBase.java:236)
	at io.cdap.cdap.test.IntegrationTestBase$2.call(IntegrationTestBase.java:233)
	at io.cdap.cdap.test.IntegrationTestBase.checkServicesWithRetry(IntegrationTestBase.java:248)
	at io.cdap.cdap.test.IntegrationTestBase.fetchAccessToken(IntegrationTestBase.java:233)
(38 more lines...)
Collapse Failed ETLMapReduceTest testDAGSchemaChanges History
Default Job < 1 sec
io.cdap.common.http.exception.HttpFailureException: Unauthorized
	at io.cdap.cdap.security.authentication.client.AbstractAuthenticationClient.execute(AbstractAuthenticationClient.java:193)
	at io.cdap.cdap.security.authentication.client.AbstractAuthenticationClient.fetchAccessToken(AbstractAuthenticationClient.java:214)
	at io.cdap.cdap.security.authentication.client.AbstractAuthenticationClient.getAccessToken(AbstractAuthenticationClient.java:106)
	at io.cdap.cdap.test.IntegrationTestBase$2.call(IntegrationTestBase.java:236)
	at io.cdap.cdap.test.IntegrationTestBase$2.call(IntegrationTestBase.java:233)
	at io.cdap.cdap.test.IntegrationTestBase.checkServicesWithRetry(IntegrationTestBase.java:248)
	at io.cdap.cdap.test.IntegrationTestBase.fetchAccessToken(IntegrationTestBase.java:233)
(38 more lines...)
Collapse Failed ExcelInputReaderTest testExcelReaderReprocessFalse History
Default Job < 1 sec
io.cdap.common.http.exception.HttpFailureException: Unauthorized
	at io.cdap.cdap.security.authentication.client.AbstractAuthenticationClient.execute(AbstractAuthenticationClient.java:193)
	at io.cdap.cdap.security.authentication.client.AbstractAuthenticationClient.fetchAccessToken(AbstractAuthenticationClient.java:214)
	at io.cdap.cdap.security.authentication.client.AbstractAuthenticationClient.getAccessToken(AbstractAuthenticationClient.java:106)
	at io.cdap.cdap.test.IntegrationTestBase$2.call(IntegrationTestBase.java:236)
	at io.cdap.cdap.test.IntegrationTestBase$2.call(IntegrationTestBase.java:233)
	at io.cdap.cdap.test.IntegrationTestBase.checkServicesWithRetry(IntegrationTestBase.java:248)
	at io.cdap.cdap.test.IntegrationTestBase.fetchAccessToken(IntegrationTestBase.java:233)
(38 more lines...)
Collapse Failed ExcelInputReaderTest testExcelReader History
Default Job < 1 sec
io.cdap.common.http.exception.HttpFailureException: Unauthorized
	at io.cdap.cdap.security.authentication.client.AbstractAuthenticationClient.execute(AbstractAuthenticationClient.java:193)
	at io.cdap.cdap.security.authentication.client.AbstractAuthenticationClient.fetchAccessToken(AbstractAuthenticationClient.java:214)
	at io.cdap.cdap.security.authentication.client.AbstractAuthenticationClient.getAccessToken(AbstractAuthenticationClient.java:106)
	at io.cdap.cdap.test.IntegrationTestBase$2.call(IntegrationTestBase.java:236)
	at io.cdap.cdap.test.IntegrationTestBase$2.call(IntegrationTestBase.java:233)
	at io.cdap.cdap.test.IntegrationTestBase.checkServicesWithRetry(IntegrationTestBase.java:248)
	at io.cdap.cdap.test.IntegrationTestBase.fetchAccessToken(IntegrationTestBase.java:233)
(38 more lines...)
Collapse Failed HivePluginTest testHivePlugins History

Failing on the develop branch.

Default Job < 1 sec
io.cdap.common.http.exception.HttpFailureException: Unauthorized
	at io.cdap.cdap.security.authentication.client.AbstractAuthenticationClient.execute(AbstractAuthenticationClient.java:193)
	at io.cdap.cdap.security.authentication.client.AbstractAuthenticationClient.fetchAccessToken(AbstractAuthenticationClient.java:214)
	at io.cdap.cdap.security.authentication.client.AbstractAuthenticationClient.getAccessToken(AbstractAuthenticationClient.java:106)
	at io.cdap.cdap.test.IntegrationTestBase$2.call(IntegrationTestBase.java:236)
	at io.cdap.cdap.test.IntegrationTestBase$2.call(IntegrationTestBase.java:233)
	at io.cdap.cdap.test.IntegrationTestBase.checkServicesWithRetry(IntegrationTestBase.java:248)
	at io.cdap.cdap.test.IntegrationTestBase.fetchAccessToken(IntegrationTestBase.java:233)
(37 more lines...)
Collapse Failed NormalizeTest testNormalize History
Default Job < 1 sec
io.cdap.common.http.exception.HttpFailureException: Unauthorized
	at io.cdap.cdap.security.authentication.client.AbstractAuthenticationClient.execute(AbstractAuthenticationClient.java:193)
	at io.cdap.cdap.security.authentication.client.AbstractAuthenticationClient.fetchAccessToken(AbstractAuthenticationClient.java:214)
	at io.cdap.cdap.security.authentication.client.AbstractAuthenticationClient.getAccessToken(AbstractAuthenticationClient.java:106)
	at io.cdap.cdap.test.IntegrationTestBase$2.call(IntegrationTestBase.java:236)
	at io.cdap.cdap.test.IntegrationTestBase$2.call(IntegrationTestBase.java:233)
	at io.cdap.cdap.test.IntegrationTestBase.checkServicesWithRetry(IntegrationTestBase.java:248)
	at io.cdap.cdap.test.IntegrationTestBase.fetchAccessToken(IntegrationTestBase.java:233)
(38 more lines...)
Collapse Failed NormalizeTest testNormalizeWithEmptyAttributeValue History
Default Job < 1 sec
io.cdap.common.http.exception.HttpFailureException: Unauthorized
	at io.cdap.cdap.security.authentication.client.AbstractAuthenticationClient.execute(AbstractAuthenticationClient.java:193)
	at io.cdap.cdap.security.authentication.client.AbstractAuthenticationClient.fetchAccessToken(AbstractAuthenticationClient.java:214)
	at io.cdap.cdap.security.authentication.client.AbstractAuthenticationClient.getAccessToken(AbstractAuthenticationClient.java:106)
	at io.cdap.cdap.test.IntegrationTestBase$2.call(IntegrationTestBase.java:236)
	at io.cdap.cdap.test.IntegrationTestBase$2.call(IntegrationTestBase.java:233)
	at io.cdap.cdap.test.IntegrationTestBase.checkServicesWithRetry(IntegrationTestBase.java:248)
	at io.cdap.cdap.test.IntegrationTestBase.fetchAccessToken(IntegrationTestBase.java:233)
(38 more lines...)
Collapse Failed RowDenormalizerTest test History
Default Job < 1 sec
io.cdap.common.http.exception.HttpFailureException: Unauthorized
	at io.cdap.cdap.security.authentication.client.AbstractAuthenticationClient.execute(AbstractAuthenticationClient.java:193)
	at io.cdap.cdap.security.authentication.client.AbstractAuthenticationClient.fetchAccessToken(AbstractAuthenticationClient.java:214)
	at io.cdap.cdap.security.authentication.client.AbstractAuthenticationClient.getAccessToken(AbstractAuthenticationClient.java:106)
	at io.cdap.cdap.test.IntegrationTestBase$2.call(IntegrationTestBase.java:236)
	at io.cdap.cdap.test.IntegrationTestBase$2.call(IntegrationTestBase.java:233)
	at io.cdap.cdap.test.IntegrationTestBase.checkServicesWithRetry(IntegrationTestBase.java:248)
	at io.cdap.cdap.test.IntegrationTestBase.fetchAccessToken(IntegrationTestBase.java:233)
(37 more lines...)
Collapse Failed TPFSParquetSinkSourceTest testMR History
Default Job < 1 sec
io.cdap.common.http.exception.HttpFailureException: Unauthorized
	at io.cdap.cdap.security.authentication.client.AbstractAuthenticationClient.execute(AbstractAuthenticationClient.java:193)
	at io.cdap.cdap.security.authentication.client.AbstractAuthenticationClient.fetchAccessToken(AbstractAuthenticationClient.java:214)
	at io.cdap.cdap.security.authentication.client.AbstractAuthenticationClient.getAccessToken(AbstractAuthenticationClient.java:106)
	at io.cdap.cdap.test.IntegrationTestBase$2.call(IntegrationTestBase.java:236)
	at io.cdap.cdap.test.IntegrationTestBase$2.call(IntegrationTestBase.java:233)
	at io.cdap.cdap.test.IntegrationTestBase.checkServicesWithRetry(IntegrationTestBase.java:248)
	at io.cdap.cdap.test.IntegrationTestBase.fetchAccessToken(IntegrationTestBase.java:233)
(37 more lines...)
Collapse Failed TPFSParquetSinkSourceTest testSpark History
Default Job < 1 sec
io.cdap.common.http.exception.HttpFailureException: Unauthorized
	at io.cdap.cdap.security.authentication.client.AbstractAuthenticationClient.execute(AbstractAuthenticationClient.java:193)
	at io.cdap.cdap.security.authentication.client.AbstractAuthenticationClient.fetchAccessToken(AbstractAuthenticationClient.java:214)
	at io.cdap.cdap.security.authentication.client.AbstractAuthenticationClient.getAccessToken(AbstractAuthenticationClient.java:106)
	at io.cdap.cdap.test.IntegrationTestBase$2.call(IntegrationTestBase.java:236)
	at io.cdap.cdap.test.IntegrationTestBase$2.call(IntegrationTestBase.java:233)
	at io.cdap.cdap.test.IntegrationTestBase.checkServicesWithRetry(IntegrationTestBase.java:248)
	at io.cdap.cdap.test.IntegrationTestBase.fetchAccessToken(IntegrationTestBase.java:233)
(37 more lines...)
Collapse Failed ValueMapperTest test History
Default Job < 1 sec
io.cdap.common.http.exception.HttpFailureException: Unauthorized
	at io.cdap.cdap.security.authentication.client.AbstractAuthenticationClient.execute(AbstractAuthenticationClient.java:193)
	at io.cdap.cdap.security.authentication.client.AbstractAuthenticationClient.fetchAccessToken(AbstractAuthenticationClient.java:214)
	at io.cdap.cdap.security.authentication.client.AbstractAuthenticationClient.getAccessToken(AbstractAuthenticationClient.java:106)
	at io.cdap.cdap.test.IntegrationTestBase$2.call(IntegrationTestBase.java:236)
	at io.cdap.cdap.test.IntegrationTestBase$2.call(IntegrationTestBase.java:233)
	at io.cdap.cdap.test.IntegrationTestBase.checkServicesWithRetry(IntegrationTestBase.java:248)
	at io.cdap.cdap.test.IntegrationTestBase.fetchAccessToken(IntegrationTestBase.java:233)
(37 more lines...)
Collapse Failed XMLReaderTest testPreProcessingNotRequired History
Default Job < 1 sec
io.cdap.common.http.exception.HttpFailureException: Unauthorized
	at io.cdap.cdap.security.authentication.client.AbstractAuthenticationClient.execute(AbstractAuthenticationClient.java:193)
	at io.cdap.cdap.security.authentication.client.AbstractAuthenticationClient.fetchAccessToken(AbstractAuthenticationClient.java:214)
	at io.cdap.cdap.security.authentication.client.AbstractAuthenticationClient.getAccessToken(AbstractAuthenticationClient.java:106)
	at io.cdap.cdap.test.IntegrationTestBase$2.call(IntegrationTestBase.java:236)
	at io.cdap.cdap.test.IntegrationTestBase$2.call(IntegrationTestBase.java:233)
	at io.cdap.cdap.test.IntegrationTestBase.checkServicesWithRetry(IntegrationTestBase.java:248)
	at io.cdap.cdap.test.IntegrationTestBase.fetchAccessToken(IntegrationTestBase.java:233)
(37 more lines...)
Collapse Failed XMLReaderTest testInvalidNodePathWithMoveAction History
Default Job < 1 sec
io.cdap.common.http.exception.HttpFailureException: Unauthorized
	at io.cdap.cdap.security.authentication.client.AbstractAuthenticationClient.execute(AbstractAuthenticationClient.java:193)
	at io.cdap.cdap.security.authentication.client.AbstractAuthenticationClient.fetchAccessToken(AbstractAuthenticationClient.java:214)
	at io.cdap.cdap.security.authentication.client.AbstractAuthenticationClient.getAccessToken(AbstractAuthenticationClient.java:106)
	at io.cdap.cdap.test.IntegrationTestBase$2.call(IntegrationTestBase.java:236)
	at io.cdap.cdap.test.IntegrationTestBase$2.call(IntegrationTestBase.java:233)
	at io.cdap.cdap.test.IntegrationTestBase.checkServicesWithRetry(IntegrationTestBase.java:248)
	at io.cdap.cdap.test.IntegrationTestBase.fetchAccessToken(IntegrationTestBase.java:233)
(37 more lines...)
Collapse Failed XMLReaderTest testPatternWithDeleteAction History
Default Job < 1 sec
io.cdap.common.http.exception.HttpFailureException: Unauthorized
	at io.cdap.cdap.security.authentication.client.AbstractAuthenticationClient.execute(AbstractAuthenticationClient.java:193)
	at io.cdap.cdap.security.authentication.client.AbstractAuthenticationClient.fetchAccessToken(AbstractAuthenticationClient.java:214)
	at io.cdap.cdap.security.authentication.client.AbstractAuthenticationClient.getAccessToken(AbstractAuthenticationClient.java:106)
	at io.cdap.cdap.test.IntegrationTestBase$2.call(IntegrationTestBase.java:236)
	at io.cdap.cdap.test.IntegrationTestBase$2.call(IntegrationTestBase.java:233)
	at io.cdap.cdap.test.IntegrationTestBase.checkServicesWithRetry(IntegrationTestBase.java:248)
	at io.cdap.cdap.test.IntegrationTestBase.fetchAccessToken(IntegrationTestBase.java:233)
(37 more lines...)
Collapse Failed XMLReaderTest testPreProcessingRequired History
Default Job < 1 sec
io.cdap.common.http.exception.HttpFailureException: Unauthorized
	at io.cdap.cdap.security.authentication.client.AbstractAuthenticationClient.execute(AbstractAuthenticationClient.java:193)
	at io.cdap.cdap.security.authentication.client.AbstractAuthenticationClient.fetchAccessToken(AbstractAuthenticationClient.java:214)
	at io.cdap.cdap.security.authentication.client.AbstractAuthenticationClient.getAccessToken(AbstractAuthenticationClient.java:106)
	at io.cdap.cdap.test.IntegrationTestBase$2.call(IntegrationTestBase.java:236)
	at io.cdap.cdap.test.IntegrationTestBase$2.call(IntegrationTestBase.java:233)
	at io.cdap.cdap.test.IntegrationTestBase.checkServicesWithRetry(IntegrationTestBase.java:248)
	at io.cdap.cdap.test.IntegrationTestBase.fetchAccessToken(IntegrationTestBase.java:233)
(37 more lines...)
Collapse Failed XMLReaderTest testInvalidPatternWithDeleteAction History
Default Job < 1 sec
io.cdap.common.http.exception.HttpFailureException: Unauthorized
	at io.cdap.cdap.security.authentication.client.AbstractAuthenticationClient.execute(AbstractAuthenticationClient.java:193)
	at io.cdap.cdap.security.authentication.client.AbstractAuthenticationClient.fetchAccessToken(AbstractAuthenticationClient.java:214)
	at io.cdap.cdap.security.authentication.client.AbstractAuthenticationClient.getAccessToken(AbstractAuthenticationClient.java:106)
	at io.cdap.cdap.test.IntegrationTestBase$2.call(IntegrationTestBase.java:236)
	at io.cdap.cdap.test.IntegrationTestBase$2.call(IntegrationTestBase.java:233)
	at io.cdap.cdap.test.IntegrationTestBase.checkServicesWithRetry(IntegrationTestBase.java:248)
	at io.cdap.cdap.test.IntegrationTestBase.fetchAccessToken(IntegrationTestBase.java:233)
(37 more lines...)
Collapse Failed DataStreamsTest testDataStreams History
Default Job < 1 sec
io.cdap.common.http.exception.HttpFailureException: Unauthorized
	at io.cdap.cdap.security.authentication.client.AbstractAuthenticationClient.execute(AbstractAuthenticationClient.java:193)
	at io.cdap.cdap.security.authentication.client.AbstractAuthenticationClient.fetchAccessToken(AbstractAuthenticationClient.java:214)
	at io.cdap.cdap.security.authentication.client.AbstractAuthenticationClient.getAccessToken(AbstractAuthenticationClient.java:106)
	at io.cdap.cdap.test.IntegrationTestBase$2.call(IntegrationTestBase.java:236)
	at io.cdap.cdap.test.IntegrationTestBase$2.call(IntegrationTestBase.java:233)
	at io.cdap.cdap.test.IntegrationTestBase.checkServicesWithRetry(IntegrationTestBase.java:248)
	at io.cdap.cdap.test.IntegrationTestBase.fetchAccessToken(IntegrationTestBase.java:233)
(38 more lines...)
Collapse Failed WranglerServiceTest test History
Default Job < 1 sec
io.cdap.common.http.exception.HttpFailureException: Unauthorized
	at io.cdap.cdap.security.authentication.client.AbstractAuthenticationClient.execute(AbstractAuthenticationClient.java:193)
	at io.cdap.cdap.security.authentication.client.AbstractAuthenticationClient.fetchAccessToken(AbstractAuthenticationClient.java:214)
	at io.cdap.cdap.security.authentication.client.AbstractAuthenticationClient.getAccessToken(AbstractAuthenticationClient.java:106)
	at io.cdap.cdap.test.IntegrationTestBase$2.call(IntegrationTestBase.java:236)
	at io.cdap.cdap.test.IntegrationTestBase$2.call(IntegrationTestBase.java:233)
	at io.cdap.cdap.test.IntegrationTestBase.checkServicesWithRetry(IntegrationTestBase.java:248)
	at io.cdap.cdap.test.IntegrationTestBase.fetchAccessToken(IntegrationTestBase.java:233)
(37 more lines...)
Collapse Failed WranglerTest testWranglerMR History
Default Job < 1 sec
io.cdap.common.http.exception.HttpFailureException: Unauthorized
	at io.cdap.cdap.security.authentication.client.AbstractAuthenticationClient.execute(AbstractAuthenticationClient.java:193)
	at io.cdap.cdap.security.authentication.client.AbstractAuthenticationClient.fetchAccessToken(AbstractAuthenticationClient.java:214)
	at io.cdap.cdap.security.authentication.client.AbstractAuthenticationClient.getAccessToken(AbstractAuthenticationClient.java:106)
	at io.cdap.cdap.test.IntegrationTestBase$2.call(IntegrationTestBase.java:236)
	at io.cdap.cdap.test.IntegrationTestBase$2.call(IntegrationTestBase.java:233)
	at io.cdap.cdap.test.IntegrationTestBase.checkServicesWithRetry(IntegrationTestBase.java:248)
	at io.cdap.cdap.test.IntegrationTestBase.fetchAccessToken(IntegrationTestBase.java:233)
(37 more lines...)
Collapse Failed WranglerTest testWranglerSpark History
Default Job < 1 sec
io.cdap.common.http.exception.HttpFailureException: Unauthorized
	at io.cdap.cdap.security.authentication.client.AbstractAuthenticationClient.execute(AbstractAuthenticationClient.java:193)
	at io.cdap.cdap.security.authentication.client.AbstractAuthenticationClient.fetchAccessToken(AbstractAuthenticationClient.java:214)
	at io.cdap.cdap.security.authentication.client.AbstractAuthenticationClient.getAccessToken(AbstractAuthenticationClient.java:106)
	at io.cdap.cdap.test.IntegrationTestBase$2.call(IntegrationTestBase.java:236)
	at io.cdap.cdap.test.IntegrationTestBase$2.call(IntegrationTestBase.java:233)
	at io.cdap.cdap.test.IntegrationTestBase.checkServicesWithRetry(IntegrationTestBase.java:248)
	at io.cdap.cdap.test.IntegrationTestBase.fetchAccessToken(IntegrationTestBase.java:233)
(37 more lines...)
Collapse Failed PermissionTest test History
Default Job < 1 sec
io.cdap.common.http.exception.HttpFailureException: Unauthorized
	at io.cdap.cdap.security.authentication.client.AbstractAuthenticationClient.execute(AbstractAuthenticationClient.java:193)
	at io.cdap.cdap.security.authentication.client.AbstractAuthenticationClient.fetchAccessToken(AbstractAuthenticationClient.java:214)
	at io.cdap.cdap.security.authentication.client.AbstractAuthenticationClient.getAccessToken(AbstractAuthenticationClient.java:106)
	at io.cdap.cdap.test.IntegrationTestBase$2.call(IntegrationTestBase.java:236)
	at io.cdap.cdap.test.IntegrationTestBase$2.call(IntegrationTestBase.java:233)
	at io.cdap.cdap.test.IntegrationTestBase.checkServicesWithRetry(IntegrationTestBase.java:248)
	at io.cdap.cdap.test.IntegrationTestBase.fetchAccessToken(IntegrationTestBase.java:233)
(37 more lines...)
Collapse Failed ReadlessIncrementTest testReadlessIncrementsInMapReduce History
Default Job < 1 sec
io.cdap.common.http.exception.HttpFailureException: Unauthorized
	at io.cdap.cdap.security.authentication.client.AbstractAuthenticationClient.execute(AbstractAuthenticationClient.java:193)
	at io.cdap.cdap.security.authentication.client.AbstractAuthenticationClient.fetchAccessToken(AbstractAuthenticationClient.java:214)
	at io.cdap.cdap.security.authentication.client.AbstractAuthenticationClient.getAccessToken(AbstractAuthenticationClient.java:106)
	at io.cdap.cdap.test.IntegrationTestBase$2.call(IntegrationTestBase.java:236)
	at io.cdap.cdap.test.IntegrationTestBase$2.call(IntegrationTestBase.java:233)
	at io.cdap.cdap.test.IntegrationTestBase.checkServicesWithRetry(IntegrationTestBase.java:248)
	at io.cdap.cdap.test.IntegrationTestBase.fetchAccessToken(IntegrationTestBase.java:233)
(37 more lines...)
Collapse Failed HangingWorkerTest testRestart History
Default Job < 1 sec
io.cdap.common.http.exception.HttpFailureException: Unauthorized
	at io.cdap.cdap.security.authentication.client.AbstractAuthenticationClient.execute(AbstractAuthenticationClient.java:193)
	at io.cdap.cdap.security.authentication.client.AbstractAuthenticationClient.fetchAccessToken(AbstractAuthenticationClient.java:214)
	at io.cdap.cdap.security.authentication.client.AbstractAuthenticationClient.getAccessToken(AbstractAuthenticationClient.java:106)
	at io.cdap.cdap.test.IntegrationTestBase$2.call(IntegrationTestBase.java:236)
	at io.cdap.cdap.test.IntegrationTestBase$2.call(IntegrationTestBase.java:233)
	at io.cdap.cdap.test.IntegrationTestBase.checkServicesWithRetry(IntegrationTestBase.java:248)
	at io.cdap.cdap.test.IntegrationTestBase.fetchAccessToken(IntegrationTestBase.java:233)
(38 more lines...)
Collapse Failed ServiceWorkerTest test History
Default Job < 1 sec
io.cdap.common.http.exception.HttpFailureException: Unauthorized
	at io.cdap.cdap.security.authentication.client.AbstractAuthenticationClient.execute(AbstractAuthenticationClient.java:193)
	at io.cdap.cdap.security.authentication.client.AbstractAuthenticationClient.fetchAccessToken(AbstractAuthenticationClient.java:214)
	at io.cdap.cdap.security.authentication.client.AbstractAuthenticationClient.getAccessToken(AbstractAuthenticationClient.java:106)
	at io.cdap.cdap.test.IntegrationTestBase$2.call(IntegrationTestBase.java:236)
	at io.cdap.cdap.test.IntegrationTestBase$2.call(IntegrationTestBase.java:233)
	at io.cdap.cdap.test.IntegrationTestBase.checkServicesWithRetry(IntegrationTestBase.java:248)
	at io.cdap.cdap.test.IntegrationTestBase.fetchAccessToken(IntegrationTestBase.java:233)
(37 more lines...)
Collapse Failed ApplicationTest test History
Default Job < 1 sec
io.cdap.common.http.exception.HttpFailureException: Unauthorized
	at io.cdap.cdap.security.authentication.client.AbstractAuthenticationClient.execute(AbstractAuthenticationClient.java:193)
	at io.cdap.cdap.security.authentication.client.AbstractAuthenticationClient.fetchAccessToken(AbstractAuthenticationClient.java:214)
	at io.cdap.cdap.security.authentication.client.AbstractAuthenticationClient.getAccessToken(AbstractAuthenticationClient.java:106)
	at io.cdap.cdap.test.IntegrationTestBase$2.call(IntegrationTestBase.java:236)
	at io.cdap.cdap.test.IntegrationTestBase$2.call(IntegrationTestBase.java:233)
	at io.cdap.cdap.test.IntegrationTestBase.checkServicesWithRetry(IntegrationTestBase.java:248)
	at io.cdap.cdap.test.IntegrationTestBase.fetchAccessToken(IntegrationTestBase.java:233)
(38 more lines...)
Collapse Failed NamespaceTest testNamespaces History
Default Job < 1 sec
io.cdap.common.http.exception.HttpFailureException: Unauthorized
	at io.cdap.cdap.security.authentication.client.AbstractAuthenticationClient.execute(AbstractAuthenticationClient.java:193)
	at io.cdap.cdap.security.authentication.client.AbstractAuthenticationClient.fetchAccessToken(AbstractAuthenticationClient.java:214)
	at io.cdap.cdap.security.authentication.client.AbstractAuthenticationClient.getAccessToken(AbstractAuthenticationClient.java:106)
	at io.cdap.cdap.test.IntegrationTestBase$2.call(IntegrationTestBase.java:236)
	at io.cdap.cdap.test.IntegrationTestBase$2.call(IntegrationTestBase.java:233)
	at io.cdap.cdap.test.IntegrationTestBase.checkServicesWithRetry(IntegrationTestBase.java:248)
	at io.cdap.cdap.test.IntegrationTestBase.fetchAccessToken(IntegrationTestBase.java:233)
(37 more lines...)
Collapse Failed DatasetTest test History
Default Job < 1 sec
io.cdap.common.http.exception.HttpFailureException: Unauthorized
	at io.cdap.cdap.security.authentication.client.AbstractAuthenticationClient.execute(AbstractAuthenticationClient.java:193)
	at io.cdap.cdap.security.authentication.client.AbstractAuthenticationClient.fetchAccessToken(AbstractAuthenticationClient.java:214)
	at io.cdap.cdap.security.authentication.client.AbstractAuthenticationClient.getAccessToken(AbstractAuthenticationClient.java:106)
	at io.cdap.cdap.test.IntegrationTestBase$2.call(IntegrationTestBase.java:236)
	at io.cdap.cdap.test.IntegrationTestBase$2.call(IntegrationTestBase.java:233)
	at io.cdap.cdap.test.IntegrationTestBase.checkServicesWithRetry(IntegrationTestBase.java:248)
	at io.cdap.cdap.test.IntegrationTestBase.fetchAccessToken(IntegrationTestBase.java:233)
(38 more lines...)
Collapse Failed FileSetTest test History
Default Job < 1 sec
io.cdap.common.http.exception.HttpFailureException: Unauthorized
	at io.cdap.cdap.security.authentication.client.AbstractAuthenticationClient.execute(AbstractAuthenticationClient.java:193)
	at io.cdap.cdap.security.authentication.client.AbstractAuthenticationClient.fetchAccessToken(AbstractAuthenticationClient.java:214)
	at io.cdap.cdap.security.authentication.client.AbstractAuthenticationClient.getAccessToken(AbstractAuthenticationClient.java:106)
	at io.cdap.cdap.test.IntegrationTestBase$2.call(IntegrationTestBase.java:236)
	at io.cdap.cdap.test.IntegrationTestBase$2.call(IntegrationTestBase.java:233)
	at io.cdap.cdap.test.IntegrationTestBase.checkServicesWithRetry(IntegrationTestBase.java:248)
	at io.cdap.cdap.test.IntegrationTestBase.fetchAccessToken(IntegrationTestBase.java:233)
(38 more lines...)
Collapse Failed PartitionCorrectorTest test History
Default Job < 1 sec
io.cdap.common.http.exception.HttpFailureException: Unauthorized
	at io.cdap.cdap.security.authentication.client.AbstractAuthenticationClient.execute(AbstractAuthenticationClient.java:193)
	at io.cdap.cdap.security.authentication.client.AbstractAuthenticationClient.fetchAccessToken(AbstractAuthenticationClient.java:214)
	at io.cdap.cdap.security.authentication.client.AbstractAuthenticationClient.getAccessToken(AbstractAuthenticationClient.java:106)
	at io.cdap.cdap.test.IntegrationTestBase$2.call(IntegrationTestBase.java:236)
	at io.cdap.cdap.test.IntegrationTestBase$2.call(IntegrationTestBase.java:233)
	at io.cdap.cdap.test.IntegrationTestBase.checkServicesWithRetry(IntegrationTestBase.java:248)
	at io.cdap.cdap.test.IntegrationTestBase.fetchAccessToken(IntegrationTestBase.java:233)
(37 more lines...)
Collapse Failed PartitionedFileSetUpdateTest test History
Default Job < 1 sec
io.cdap.common.http.exception.HttpFailureException: Unauthorized
	at io.cdap.cdap.security.authentication.client.AbstractAuthenticationClient.execute(AbstractAuthenticationClient.java:193)
	at io.cdap.cdap.security.authentication.client.AbstractAuthenticationClient.fetchAccessToken(AbstractAuthenticationClient.java:214)
	at io.cdap.cdap.security.authentication.client.AbstractAuthenticationClient.getAccessToken(AbstractAuthenticationClient.java:106)
	at io.cdap.cdap.test.IntegrationTestBase$2.call(IntegrationTestBase.java:236)
	at io.cdap.cdap.test.IntegrationTestBase$2.call(IntegrationTestBase.java:233)
	at io.cdap.cdap.test.IntegrationTestBase.checkServicesWithRetry(IntegrationTestBase.java:248)
	at io.cdap.cdap.test.IntegrationTestBase.fetchAccessToken(IntegrationTestBase.java:233)
(37 more lines...)
Collapse Failed ProgramMetadataTest testWithLineage History
Default Job < 1 sec
io.cdap.common.http.exception.HttpFailureException: Unauthorized
	at io.cdap.cdap.security.authentication.client.AbstractAuthenticationClient.execute(AbstractAuthenticationClient.java:193)
	at io.cdap.cdap.security.authentication.client.AbstractAuthenticationClient.fetchAccessToken(AbstractAuthenticationClient.java:214)
	at io.cdap.cdap.security.authentication.client.AbstractAuthenticationClient.getAccessToken(AbstractAuthenticationClient.java:106)
	at io.cdap.cdap.test.IntegrationTestBase$2.call(IntegrationTestBase.java:236)
	at io.cdap.cdap.test.IntegrationTestBase$2.call(IntegrationTestBase.java:233)
	at io.cdap.cdap.test.IntegrationTestBase.checkServicesWithRetry(IntegrationTestBase.java:248)
	at io.cdap.cdap.test.IntegrationTestBase.fetchAccessToken(IntegrationTestBase.java:233)
(37 more lines...)
Collapse Failed ProgramMetadataTest testSearchUsingSystemMetadata History
Default Job < 1 sec
io.cdap.common.http.exception.HttpFailureException: Unauthorized
	at io.cdap.cdap.security.authentication.client.AbstractAuthenticationClient.execute(AbstractAuthenticationClient.java:193)
	at io.cdap.cdap.security.authentication.client.AbstractAuthenticationClient.fetchAccessToken(AbstractAuthenticationClient.java:214)
	at io.cdap.cdap.security.authentication.client.AbstractAuthenticationClient.getAccessToken(AbstractAuthenticationClient.java:106)
	at io.cdap.cdap.test.IntegrationTestBase$2.call(IntegrationTestBase.java:236)
	at io.cdap.cdap.test.IntegrationTestBase$2.call(IntegrationTestBase.java:233)
	at io.cdap.cdap.test.IntegrationTestBase.checkServicesWithRetry(IntegrationTestBase.java:248)
	at io.cdap.cdap.test.IntegrationTestBase.fetchAccessToken(IntegrationTestBase.java:233)
(37 more lines...)
Collapse Failed WorkflowTest test History
Default Job < 1 sec
io.cdap.common.http.exception.HttpFailureException: Unauthorized
	at io.cdap.cdap.security.authentication.client.AbstractAuthenticationClient.execute(AbstractAuthenticationClient.java:193)
	at io.cdap.cdap.security.authentication.client.AbstractAuthenticationClient.fetchAccessToken(AbstractAuthenticationClient.java:214)
	at io.cdap.cdap.security.authentication.client.AbstractAuthenticationClient.getAccessToken(AbstractAuthenticationClient.java:106)
	at io.cdap.cdap.test.IntegrationTestBase$2.call(IntegrationTestBase.java:236)
	at io.cdap.cdap.test.IntegrationTestBase$2.call(IntegrationTestBase.java:233)
	at io.cdap.cdap.test.IntegrationTestBase.checkServicesWithRetry(IntegrationTestBase.java:248)
	at io.cdap.cdap.test.IntegrationTestBase.fetchAccessToken(IntegrationTestBase.java:233)
(37 more lines...)
Collapse Failed OperationalStatsTest testCDAPStats History
Default Job < 1 sec
io.cdap.common.http.exception.HttpFailureException: Unauthorized
	at io.cdap.cdap.security.authentication.client.AbstractAuthenticationClient.execute(AbstractAuthenticationClient.java:193)
	at io.cdap.cdap.security.authentication.client.AbstractAuthenticationClient.fetchAccessToken(AbstractAuthenticationClient.java:214)
	at io.cdap.cdap.security.authentication.client.AbstractAuthenticationClient.getAccessToken(AbstractAuthenticationClient.java:106)
	at io.cdap.cdap.test.IntegrationTestBase$2.call(IntegrationTestBase.java:236)
	at io.cdap.cdap.test.IntegrationTestBase$2.call(IntegrationTestBase.java:233)
	at io.cdap.cdap.test.IntegrationTestBase.checkServicesWithRetry(IntegrationTestBase.java:248)
	at io.cdap.cdap.test.IntegrationTestBase.fetchAccessToken(IntegrationTestBase.java:233)
(37 more lines...)
Collapse Failed RemoteCubeTest test History
Default Job < 1 sec
io.cdap.common.http.exception.HttpFailureException: Unauthorized
	at io.cdap.cdap.security.authentication.client.AbstractAuthenticationClient.execute(AbstractAuthenticationClient.java:193)
	at io.cdap.cdap.security.authentication.client.AbstractAuthenticationClient.fetchAccessToken(AbstractAuthenticationClient.java:214)
	at io.cdap.cdap.security.authentication.client.AbstractAuthenticationClient.getAccessToken(AbstractAuthenticationClient.java:106)
	at io.cdap.cdap.test.IntegrationTestBase$2.call(IntegrationTestBase.java:236)
	at io.cdap.cdap.test.IntegrationTestBase$2.call(IntegrationTestBase.java:233)
	at io.cdap.cdap.test.IntegrationTestBase.checkServicesWithRetry(IntegrationTestBase.java:248)
	at io.cdap.cdap.test.IntegrationTestBase.fetchAccessToken(IntegrationTestBase.java:233)
(37 more lines...)
Collapse Failed RemoteKeyValueTest test History
Default Job < 1 sec
io.cdap.common.http.exception.HttpFailureException: Unauthorized
	at io.cdap.cdap.security.authentication.client.AbstractAuthenticationClient.execute(AbstractAuthenticationClient.java:193)
	at io.cdap.cdap.security.authentication.client.AbstractAuthenticationClient.fetchAccessToken(AbstractAuthenticationClient.java:214)
	at io.cdap.cdap.security.authentication.client.AbstractAuthenticationClient.getAccessToken(AbstractAuthenticationClient.java:106)
	at io.cdap.cdap.test.IntegrationTestBase$2.call(IntegrationTestBase.java:236)
	at io.cdap.cdap.test.IntegrationTestBase$2.call(IntegrationTestBase.java:233)
	at io.cdap.cdap.test.IntegrationTestBase.checkServicesWithRetry(IntegrationTestBase.java:248)
	at io.cdap.cdap.test.IntegrationTestBase.fetchAccessToken(IntegrationTestBase.java:233)
(37 more lines...)
Collapse Failed RemoteTableTest test History
Default Job < 1 sec
io.cdap.common.http.exception.HttpFailureException: Unauthorized
	at io.cdap.cdap.security.authentication.client.AbstractAuthenticationClient.execute(AbstractAuthenticationClient.java:193)
	at io.cdap.cdap.security.authentication.client.AbstractAuthenticationClient.fetchAccessToken(AbstractAuthenticationClient.java:214)
	at io.cdap.cdap.security.authentication.client.AbstractAuthenticationClient.getAccessToken(AbstractAuthenticationClient.java:106)
	at io.cdap.cdap.test.IntegrationTestBase$2.call(IntegrationTestBase.java:236)
	at io.cdap.cdap.test.IntegrationTestBase$2.call(IntegrationTestBase.java:233)
	at io.cdap.cdap.test.IntegrationTestBase.checkServicesWithRetry(IntegrationTestBase.java:248)
	at io.cdap.cdap.test.IntegrationTestBase.fetchAccessToken(IntegrationTestBase.java:233)
(37 more lines...)