Build #25

Build: #25 failed Manual run by Rohit Sinha

Build result summary

Details

Completed
Duration
36 minutes
Flags
Custom build
Labels
None
Agent
bamboo-agent09
Revision
0b5c4680608fad544f4d3ac4d0d4fd7f46e11ad9 0b5c4680608fad544f4d3ac4d0d4fd7f46e11ad9
Total tests
32
Failing since
#9 (Manual run by Ali Anwar)
Fixed in
#27 (Manual run by Ali Anwar)

Responsible

This build has been failing since #9
No one has taken responsibility

Custom variables

Name Value
cdap.cluster it-itnambauth-ambh26-5-34541-1000.coopr.sh
cdap.test AuthorizationTests

Code commits

Author Commit Message Commit date
Vinisha Shah <CuriousVini@users.noreply.github.com> Vinisha Shah <CuriousVini@users.noreply.github.com> 0b5c4680608fad544f4d3ac4d0d4fd7f46e11ad9 0b5c4680608fad544f4d3ac4d0d4fd7f46e11ad9 Merge pull request #949 from caskdata/bugfix/remove-app-version-test
Remove ApplicationVersionTest#testRouteConfig test
Vinisha Shah Vinisha Shah d82b1674d9b8f810e6a383f3f04ea4854270b155 d82b1674d9b8f810e6a383f3f04ea4854270b155 Remove ApplicationVersionTest#testRouteConfig test
Rohit Sinha <rosinha@google.com> Rohit Sinha <rosinha@google.com> 2c12327709dd2308009fad6ebabfdbc359bd00b2 2c12327709dd2308009fad6ebabfdbc359bd00b2 Merge pull request #935 from caskdata/feature/meta-stress-test
CDAP-13261 Metadata Stress Test
Rohit Sinha <rosinha@google.com> Rohit Sinha <rosinha@google.com> 84be1bd1eac175b2f727daca714dcac27f7c41ed 84be1bd1eac175b2f727daca714dcac27f7c41ed Merge pull request #924 from caskdata/feature/CDAP-13261-meta-prog
CDAP-13261 Add integration test for testing metadata from programs
Rohit Sinha <rosinha@google.com> Rohit Sinha <rosinha@google.com> f5624765fde4576b678ba08bcfda6c07972e7108 f5624765fde4576b678ba08bcfda6c07972e7108 CDAP-13261 Metadata Stress Test

Configuration changes

Plan configuration has changed since the last successful build. See the plan audit log for more details.

Tests

New test failures 32
Status Test View job Duration
Collapse Failed AppImpersonationAuthorizationTest testDatasetInProgram History
Default Job 1 min
java.io.IOException: 503: No endpoint strategy found for request GET /v3/config/cdap HTTP/1.1
	at co.cask.cdap.client.util.RESTClient.execute(RESTClient.java:132)
	at co.cask.cdap.client.util.RESTClient.execute(RESTClient.java:74)
	at co.cask.cdap.client.MetaClient.getConfig(MetaClient.java:81)
	at co.cask.cdap.client.MetaClient.getCDAPConfig(MetaClient.java:71)
	at co.cask.cdap.security.AuthorizationTestBase.verifyAndSetUpAuthz(AuthorizationTestBase.java:91)
	at co.cask.cdap.security.AuthorizationTestBase.setUp(AuthorizationTestBase.java:84)
	at sun.reflect.NativeMethodAccessorImpl.invoke0(Native Method)
(34 more lines...)
Collapse Failed AppImpersonationAuthorizationTest testDeployApp History
Default Job 1 min
java.io.IOException: 503: No endpoint strategy found for request GET /v3/config/cdap HTTP/1.1
	at co.cask.cdap.client.util.RESTClient.execute(RESTClient.java:132)
	at co.cask.cdap.client.util.RESTClient.execute(RESTClient.java:74)
	at co.cask.cdap.client.MetaClient.getConfig(MetaClient.java:81)
	at co.cask.cdap.client.MetaClient.getCDAPConfig(MetaClient.java:71)
	at co.cask.cdap.security.AuthorizationTestBase.verifyAndSetUpAuthz(AuthorizationTestBase.java:91)
	at co.cask.cdap.security.AuthorizationTestBase.setUp(AuthorizationTestBase.java:84)
	at sun.reflect.NativeMethodAccessorImpl.invoke0(Native Method)
(34 more lines...)
Collapse Failed AppImpersonationAuthorizationTest testDeployAppUnauthorized History
Default Job 1 min
java.io.IOException: 503: No endpoint strategy found for request GET /v3/config/cdap HTTP/1.1
	at co.cask.cdap.client.util.RESTClient.execute(RESTClient.java:132)
	at co.cask.cdap.client.util.RESTClient.execute(RESTClient.java:74)
	at co.cask.cdap.client.MetaClient.getConfig(MetaClient.java:81)
	at co.cask.cdap.client.MetaClient.getCDAPConfig(MetaClient.java:71)
	at co.cask.cdap.security.AuthorizationTestBase.verifyAndSetUpAuthz(AuthorizationTestBase.java:91)
	at co.cask.cdap.security.AuthorizationTestBase.setUp(AuthorizationTestBase.java:84)
	at sun.reflect.NativeMethodAccessorImpl.invoke0(Native Method)
(34 more lines...)
Collapse Failed AppImpersonationAuthorizationTest testRunningFlowAndExploreStreams History
Default Job 1 min
java.io.IOException: 503: No endpoint strategy found for request GET /v3/config/cdap HTTP/1.1
	at co.cask.cdap.client.util.RESTClient.execute(RESTClient.java:132)
	at co.cask.cdap.client.util.RESTClient.execute(RESTClient.java:74)
	at co.cask.cdap.client.MetaClient.getConfig(MetaClient.java:81)
	at co.cask.cdap.client.MetaClient.getCDAPConfig(MetaClient.java:71)
	at co.cask.cdap.security.AuthorizationTestBase.verifyAndSetUpAuthz(AuthorizationTestBase.java:91)
	at co.cask.cdap.security.AuthorizationTestBase.setUp(AuthorizationTestBase.java:84)
	at sun.reflect.NativeMethodAccessorImpl.invoke0(Native Method)
(34 more lines...)
Collapse Failed BasicAppAuthorizationTest testDatasetInProgram History
Default Job 1 min
java.io.IOException: 503: No endpoint strategy found for request GET /v3/config/cdap HTTP/1.1
	at co.cask.cdap.client.util.RESTClient.execute(RESTClient.java:132)
	at co.cask.cdap.client.util.RESTClient.execute(RESTClient.java:74)
	at co.cask.cdap.client.MetaClient.getConfig(MetaClient.java:81)
	at co.cask.cdap.client.MetaClient.getCDAPConfig(MetaClient.java:71)
	at co.cask.cdap.security.AuthorizationTestBase.verifyAndSetUpAuthz(AuthorizationTestBase.java:91)
	at co.cask.cdap.security.AuthorizationTestBase.setUp(AuthorizationTestBase.java:84)
	at sun.reflect.NativeMethodAccessorImpl.invoke0(Native Method)
(34 more lines...)
Collapse Failed BasicAppAuthorizationTest testDeployAppUnauthorized History
Default Job 1 min
java.io.IOException: 503: No endpoint strategy found for request GET /v3/config/cdap HTTP/1.1
	at co.cask.cdap.client.util.RESTClient.execute(RESTClient.java:132)
	at co.cask.cdap.client.util.RESTClient.execute(RESTClient.java:74)
	at co.cask.cdap.client.MetaClient.getConfig(MetaClient.java:81)
	at co.cask.cdap.client.MetaClient.getCDAPConfig(MetaClient.java:71)
	at co.cask.cdap.security.AuthorizationTestBase.verifyAndSetUpAuthz(AuthorizationTestBase.java:91)
	at co.cask.cdap.security.AuthorizationTestBase.setUp(AuthorizationTestBase.java:84)
	at sun.reflect.NativeMethodAccessorImpl.invoke0(Native Method)
(34 more lines...)
Collapse Failed BasicAppAuthorizationTest testRunningFlowAndExploreStreams History
Default Job 1 min
java.io.IOException: 503: No endpoint strategy found for request GET /v3/config/cdap HTTP/1.1
	at co.cask.cdap.client.util.RESTClient.execute(RESTClient.java:132)
	at co.cask.cdap.client.util.RESTClient.execute(RESTClient.java:74)
	at co.cask.cdap.client.MetaClient.getConfig(MetaClient.java:81)
	at co.cask.cdap.client.MetaClient.getCDAPConfig(MetaClient.java:71)
	at co.cask.cdap.security.AuthorizationTestBase.verifyAndSetUpAuthz(AuthorizationTestBase.java:91)
	at co.cask.cdap.security.AuthorizationTestBase.setUp(AuthorizationTestBase.java:84)
	at sun.reflect.NativeMethodAccessorImpl.invoke0(Native Method)
(34 more lines...)
Collapse Failed BasicAppAuthorizationTest testDeployApp History
Default Job 1 min
java.io.IOException: 503: No endpoint strategy found for request GET /v3/config/cdap HTTP/1.1
	at co.cask.cdap.client.util.RESTClient.execute(RESTClient.java:132)
	at co.cask.cdap.client.util.RESTClient.execute(RESTClient.java:74)
	at co.cask.cdap.client.MetaClient.getConfig(MetaClient.java:81)
	at co.cask.cdap.client.MetaClient.getCDAPConfig(MetaClient.java:71)
	at co.cask.cdap.security.AuthorizationTestBase.verifyAndSetUpAuthz(AuthorizationTestBase.java:91)
	at co.cask.cdap.security.AuthorizationTestBase.setUp(AuthorizationTestBase.java:84)
	at sun.reflect.NativeMethodAccessorImpl.invoke0(Native Method)
(34 more lines...)
Collapse Failed BasicAuthorizationTest testNamespacePrivileges History
Default Job 1 min
java.io.IOException: 503: No endpoint strategy found for request GET /v3/config/cdap HTTP/1.1
	at co.cask.cdap.client.util.RESTClient.execute(RESTClient.java:132)
	at co.cask.cdap.client.util.RESTClient.execute(RESTClient.java:74)
	at co.cask.cdap.client.MetaClient.getConfig(MetaClient.java:81)
	at co.cask.cdap.client.MetaClient.getCDAPConfig(MetaClient.java:71)
	at co.cask.cdap.security.AuthorizationTestBase.verifyAndSetUpAuthz(AuthorizationTestBase.java:91)
	at co.cask.cdap.security.AuthorizationTestBase.setUp(AuthorizationTestBase.java:84)
	at sun.reflect.NativeMethodAccessorImpl.invoke0(Native Method)
(34 more lines...)
Collapse Failed BasicAuthorizationTest testPrivilegesAndVisibility History
Default Job 1 min
java.io.IOException: 503: No endpoint strategy found for request GET /v3/config/cdap HTTP/1.1
	at co.cask.cdap.client.util.RESTClient.execute(RESTClient.java:132)
	at co.cask.cdap.client.util.RESTClient.execute(RESTClient.java:74)
	at co.cask.cdap.client.MetaClient.getConfig(MetaClient.java:81)
	at co.cask.cdap.client.MetaClient.getCDAPConfig(MetaClient.java:71)
	at co.cask.cdap.security.AuthorizationTestBase.verifyAndSetUpAuthz(AuthorizationTestBase.java:91)
	at co.cask.cdap.security.AuthorizationTestBase.setUp(AuthorizationTestBase.java:84)
	at sun.reflect.NativeMethodAccessorImpl.invoke0(Native Method)
(34 more lines...)
Collapse Failed BasicAuthorizationTest testStreamPrivileges History
Default Job 1 min
java.io.IOException: 503: No endpoint strategy found for request GET /v3/config/cdap HTTP/1.1
	at co.cask.cdap.client.util.RESTClient.execute(RESTClient.java:132)
	at co.cask.cdap.client.util.RESTClient.execute(RESTClient.java:74)
	at co.cask.cdap.client.MetaClient.getConfig(MetaClient.java:81)
	at co.cask.cdap.client.MetaClient.getCDAPConfig(MetaClient.java:71)
	at co.cask.cdap.security.AuthorizationTestBase.verifyAndSetUpAuthz(AuthorizationTestBase.java:91)
	at co.cask.cdap.security.AuthorizationTestBase.setUp(AuthorizationTestBase.java:84)
	at sun.reflect.NativeMethodAccessorImpl.invoke0(Native Method)
(34 more lines...)
Collapse Failed BasicAuthorizationTest testDatasetPrivileges History
Default Job 1 min
java.io.IOException: 503: No endpoint strategy found for request GET /v3/config/cdap HTTP/1.1
	at co.cask.cdap.client.util.RESTClient.execute(RESTClient.java:132)
	at co.cask.cdap.client.util.RESTClient.execute(RESTClient.java:74)
	at co.cask.cdap.client.MetaClient.getConfig(MetaClient.java:81)
	at co.cask.cdap.client.MetaClient.getCDAPConfig(MetaClient.java:71)
	at co.cask.cdap.security.AuthorizationTestBase.verifyAndSetUpAuthz(AuthorizationTestBase.java:91)
	at co.cask.cdap.security.AuthorizationTestBase.setUp(AuthorizationTestBase.java:84)
	at sun.reflect.NativeMethodAccessorImpl.invoke0(Native Method)
(34 more lines...)
Collapse Failed BasicAuthorizationTest testDeleteNamespaceWithDifferentClients History
Default Job 1 min
java.io.IOException: 503: No endpoint strategy found for request GET /v3/config/cdap HTTP/1.1
	at co.cask.cdap.client.util.RESTClient.execute(RESTClient.java:132)
	at co.cask.cdap.client.util.RESTClient.execute(RESTClient.java:74)
	at co.cask.cdap.client.MetaClient.getConfig(MetaClient.java:81)
	at co.cask.cdap.client.MetaClient.getCDAPConfig(MetaClient.java:71)
	at co.cask.cdap.security.AuthorizationTestBase.verifyAndSetUpAuthz(AuthorizationTestBase.java:91)
	at co.cask.cdap.security.AuthorizationTestBase.setUp(AuthorizationTestBase.java:84)
	at sun.reflect.NativeMethodAccessorImpl.invoke0(Native Method)
(34 more lines...)
Collapse Failed CustomMappingAppAuthorizationTest testDatasetInProgram History
Default Job 1 min
java.io.IOException: 503: No endpoint strategy found for request GET /v3/config/cdap HTTP/1.1
	at co.cask.cdap.client.util.RESTClient.execute(RESTClient.java:132)
	at co.cask.cdap.client.util.RESTClient.execute(RESTClient.java:74)
	at co.cask.cdap.client.MetaClient.getConfig(MetaClient.java:81)
	at co.cask.cdap.client.MetaClient.getCDAPConfig(MetaClient.java:71)
	at co.cask.cdap.security.AuthorizationTestBase.verifyAndSetUpAuthz(AuthorizationTestBase.java:91)
	at co.cask.cdap.security.AuthorizationTestBase.setUp(AuthorizationTestBase.java:84)
	at sun.reflect.NativeMethodAccessorImpl.invoke0(Native Method)
(34 more lines...)
Collapse Failed CustomMappingAppAuthorizationTest testDeployApp History
Default Job 1 min
java.io.IOException: 503: No endpoint strategy found for request GET /v3/config/cdap HTTP/1.1
	at co.cask.cdap.client.util.RESTClient.execute(RESTClient.java:132)
	at co.cask.cdap.client.util.RESTClient.execute(RESTClient.java:74)
	at co.cask.cdap.client.MetaClient.getConfig(MetaClient.java:81)
	at co.cask.cdap.client.MetaClient.getCDAPConfig(MetaClient.java:71)
	at co.cask.cdap.security.AuthorizationTestBase.verifyAndSetUpAuthz(AuthorizationTestBase.java:91)
	at co.cask.cdap.security.AuthorizationTestBase.setUp(AuthorizationTestBase.java:84)
	at sun.reflect.NativeMethodAccessorImpl.invoke0(Native Method)
(34 more lines...)
Collapse Failed CustomMappingAppAuthorizationTest testRunningFlowAndExploreStreams History
Default Job 1 min
java.io.IOException: 503: No endpoint strategy found for request GET /v3/config/cdap HTTP/1.1
	at co.cask.cdap.client.util.RESTClient.execute(RESTClient.java:132)
	at co.cask.cdap.client.util.RESTClient.execute(RESTClient.java:74)
	at co.cask.cdap.client.MetaClient.getConfig(MetaClient.java:81)
	at co.cask.cdap.client.MetaClient.getCDAPConfig(MetaClient.java:71)
	at co.cask.cdap.security.AuthorizationTestBase.verifyAndSetUpAuthz(AuthorizationTestBase.java:91)
	at co.cask.cdap.security.AuthorizationTestBase.setUp(AuthorizationTestBase.java:84)
	at sun.reflect.GeneratedMethodAccessor1.invoke(Unknown Source)
(33 more lines...)
Collapse Failed CustomMappingAppAuthorizationTest testDeployAppUnauthorized History
Default Job 1 min
java.io.IOException: 503: No endpoint strategy found for request GET /v3/config/cdap HTTP/1.1
	at co.cask.cdap.client.util.RESTClient.execute(RESTClient.java:132)
	at co.cask.cdap.client.util.RESTClient.execute(RESTClient.java:74)
	at co.cask.cdap.client.MetaClient.getConfig(MetaClient.java:81)
	at co.cask.cdap.client.MetaClient.getCDAPConfig(MetaClient.java:71)
	at co.cask.cdap.security.AuthorizationTestBase.verifyAndSetUpAuthz(AuthorizationTestBase.java:91)
	at co.cask.cdap.security.AuthorizationTestBase.setUp(AuthorizationTestBase.java:84)
	at sun.reflect.NativeMethodAccessorImpl.invoke0(Native Method)
(34 more lines...)
Collapse Failed CustomMappingBasicAuthorizationTest testStreamPrivileges History
Default Job 1 min
java.io.IOException: 503: No endpoint strategy found for request GET /v3/config/cdap HTTP/1.1
	at co.cask.cdap.client.util.RESTClient.execute(RESTClient.java:132)
	at co.cask.cdap.client.util.RESTClient.execute(RESTClient.java:74)
	at co.cask.cdap.client.MetaClient.getConfig(MetaClient.java:81)
	at co.cask.cdap.client.MetaClient.getCDAPConfig(MetaClient.java:71)
	at co.cask.cdap.security.AuthorizationTestBase.verifyAndSetUpAuthz(AuthorizationTestBase.java:91)
	at co.cask.cdap.security.AuthorizationTestBase.setUp(AuthorizationTestBase.java:84)
	at sun.reflect.GeneratedMethodAccessor1.invoke(Unknown Source)
(33 more lines...)
Collapse Failed CustomMappingBasicAuthorizationTest testDeleteNamespaceWithDifferentClients History
Default Job 1 min
java.io.IOException: 503: No endpoint strategy found for request GET /v3/config/cdap HTTP/1.1
	at co.cask.cdap.client.util.RESTClient.execute(RESTClient.java:132)
	at co.cask.cdap.client.util.RESTClient.execute(RESTClient.java:74)
	at co.cask.cdap.client.MetaClient.getConfig(MetaClient.java:81)
	at co.cask.cdap.client.MetaClient.getCDAPConfig(MetaClient.java:71)
	at co.cask.cdap.security.AuthorizationTestBase.verifyAndSetUpAuthz(AuthorizationTestBase.java:91)
	at co.cask.cdap.security.AuthorizationTestBase.setUp(AuthorizationTestBase.java:84)
	at sun.reflect.GeneratedMethodAccessor1.invoke(Unknown Source)
(33 more lines...)
Collapse Failed CustomMappingBasicAuthorizationTest testPrivilegesAndVisibility History
Default Job 1 min
java.io.IOException: 503: No endpoint strategy found for request GET /v3/config/cdap HTTP/1.1
	at co.cask.cdap.client.util.RESTClient.execute(RESTClient.java:132)
	at co.cask.cdap.client.util.RESTClient.execute(RESTClient.java:74)
	at co.cask.cdap.client.MetaClient.getConfig(MetaClient.java:81)
	at co.cask.cdap.client.MetaClient.getCDAPConfig(MetaClient.java:71)
	at co.cask.cdap.security.AuthorizationTestBase.verifyAndSetUpAuthz(AuthorizationTestBase.java:91)
	at co.cask.cdap.security.AuthorizationTestBase.setUp(AuthorizationTestBase.java:84)
	at sun.reflect.GeneratedMethodAccessor1.invoke(Unknown Source)
(33 more lines...)
Collapse Failed CustomMappingBasicAuthorizationTest testDatasetPrivileges History
Default Job 1 min
java.io.IOException: 503: No endpoint strategy found for request GET /v3/config/cdap HTTP/1.1
	at co.cask.cdap.client.util.RESTClient.execute(RESTClient.java:132)
	at co.cask.cdap.client.util.RESTClient.execute(RESTClient.java:74)
	at co.cask.cdap.client.MetaClient.getConfig(MetaClient.java:81)
	at co.cask.cdap.client.MetaClient.getCDAPConfig(MetaClient.java:71)
	at co.cask.cdap.security.AuthorizationTestBase.verifyAndSetUpAuthz(AuthorizationTestBase.java:91)
	at co.cask.cdap.security.AuthorizationTestBase.setUp(AuthorizationTestBase.java:84)
	at sun.reflect.GeneratedMethodAccessor1.invoke(Unknown Source)
(33 more lines...)
Collapse Failed CustomMappingBasicAuthorizationTest testNamespacePrivileges History
Default Job 1 min
java.io.IOException: 503: No endpoint strategy found for request GET /v3/config/cdap HTTP/1.1
	at co.cask.cdap.client.util.RESTClient.execute(RESTClient.java:132)
	at co.cask.cdap.client.util.RESTClient.execute(RESTClient.java:74)
	at co.cask.cdap.client.MetaClient.getConfig(MetaClient.java:81)
	at co.cask.cdap.client.MetaClient.getCDAPConfig(MetaClient.java:71)
	at co.cask.cdap.security.AuthorizationTestBase.verifyAndSetUpAuthz(AuthorizationTestBase.java:91)
	at co.cask.cdap.security.AuthorizationTestBase.setUp(AuthorizationTestBase.java:84)
	at sun.reflect.GeneratedMethodAccessor1.invoke(Unknown Source)
(33 more lines...)
Collapse Failed NamespaceImpersonationAppAuthorizationTest testDatasetInProgram History
Default Job 1 min
java.io.IOException: 503: No endpoint strategy found for request GET /v3/config/cdap HTTP/1.1
	at co.cask.cdap.client.util.RESTClient.execute(RESTClient.java:132)
	at co.cask.cdap.client.util.RESTClient.execute(RESTClient.java:74)
	at co.cask.cdap.client.MetaClient.getConfig(MetaClient.java:81)
	at co.cask.cdap.client.MetaClient.getCDAPConfig(MetaClient.java:71)
	at co.cask.cdap.security.AuthorizationTestBase.verifyAndSetUpAuthz(AuthorizationTestBase.java:91)
	at co.cask.cdap.security.AuthorizationTestBase.setUp(AuthorizationTestBase.java:84)
	at sun.reflect.GeneratedMethodAccessor1.invoke(Unknown Source)
(33 more lines...)
Collapse Failed NamespaceImpersonationAppAuthorizationTest testDeployApp History
Default Job 1 min
java.io.IOException: 503: No endpoint strategy found for request GET /v3/config/cdap HTTP/1.1
	at co.cask.cdap.client.util.RESTClient.execute(RESTClient.java:132)
	at co.cask.cdap.client.util.RESTClient.execute(RESTClient.java:74)
	at co.cask.cdap.client.MetaClient.getConfig(MetaClient.java:81)
	at co.cask.cdap.client.MetaClient.getCDAPConfig(MetaClient.java:71)
	at co.cask.cdap.security.AuthorizationTestBase.verifyAndSetUpAuthz(AuthorizationTestBase.java:91)
	at co.cask.cdap.security.AuthorizationTestBase.setUp(AuthorizationTestBase.java:84)
	at sun.reflect.GeneratedMethodAccessor1.invoke(Unknown Source)
(33 more lines...)
Collapse Failed NamespaceImpersonationAppAuthorizationTest testRunningFlowAndExploreStreams History
Default Job 1 min
java.io.IOException: 503: No endpoint strategy found for request GET /v3/config/cdap HTTP/1.1
	at co.cask.cdap.client.util.RESTClient.execute(RESTClient.java:132)
	at co.cask.cdap.client.util.RESTClient.execute(RESTClient.java:74)
	at co.cask.cdap.client.MetaClient.getConfig(MetaClient.java:81)
	at co.cask.cdap.client.MetaClient.getCDAPConfig(MetaClient.java:71)
	at co.cask.cdap.security.AuthorizationTestBase.verifyAndSetUpAuthz(AuthorizationTestBase.java:91)
	at co.cask.cdap.security.AuthorizationTestBase.setUp(AuthorizationTestBase.java:84)
	at sun.reflect.GeneratedMethodAccessor1.invoke(Unknown Source)
(33 more lines...)
Collapse Failed NamespaceImpersonationAppAuthorizationTest testDeployAppUnauthorized History
Default Job 1 min
java.io.IOException: 503: No endpoint strategy found for request GET /v3/config/cdap HTTP/1.1
	at co.cask.cdap.client.util.RESTClient.execute(RESTClient.java:132)
	at co.cask.cdap.client.util.RESTClient.execute(RESTClient.java:74)
	at co.cask.cdap.client.MetaClient.getConfig(MetaClient.java:81)
	at co.cask.cdap.client.MetaClient.getCDAPConfig(MetaClient.java:71)
	at co.cask.cdap.security.AuthorizationTestBase.verifyAndSetUpAuthz(AuthorizationTestBase.java:91)
	at co.cask.cdap.security.AuthorizationTestBase.setUp(AuthorizationTestBase.java:84)
	at sun.reflect.GeneratedMethodAccessor1.invoke(Unknown Source)
(33 more lines...)
Collapse Failed NamespaceImpersonationBasicAuthorizationTest testNamespacePrivileges History
Default Job 1 min
java.io.IOException: 503: No endpoint strategy found for request GET /v3/config/cdap HTTP/1.1
	at co.cask.cdap.client.util.RESTClient.execute(RESTClient.java:132)
	at co.cask.cdap.client.util.RESTClient.execute(RESTClient.java:74)
	at co.cask.cdap.client.MetaClient.getConfig(MetaClient.java:81)
	at co.cask.cdap.client.MetaClient.getCDAPConfig(MetaClient.java:71)
	at co.cask.cdap.security.AuthorizationTestBase.verifyAndSetUpAuthz(AuthorizationTestBase.java:91)
	at co.cask.cdap.security.AuthorizationTestBase.setUp(AuthorizationTestBase.java:84)
	at sun.reflect.GeneratedMethodAccessor1.invoke(Unknown Source)
(33 more lines...)
Collapse Failed NamespaceImpersonationBasicAuthorizationTest testDeleteNamespaceWithDifferentClients History
Default Job 1 min
java.io.IOException: 503: No endpoint strategy found for request GET /v3/config/cdap HTTP/1.1
	at co.cask.cdap.client.util.RESTClient.execute(RESTClient.java:132)
	at co.cask.cdap.client.util.RESTClient.execute(RESTClient.java:74)
	at co.cask.cdap.client.MetaClient.getConfig(MetaClient.java:81)
	at co.cask.cdap.client.MetaClient.getCDAPConfig(MetaClient.java:71)
	at co.cask.cdap.security.AuthorizationTestBase.verifyAndSetUpAuthz(AuthorizationTestBase.java:91)
	at co.cask.cdap.security.AuthorizationTestBase.setUp(AuthorizationTestBase.java:84)
	at sun.reflect.GeneratedMethodAccessor1.invoke(Unknown Source)
(33 more lines...)
Collapse Failed NamespaceImpersonationBasicAuthorizationTest testPrivilegesAndVisibility History
Default Job 1 min
java.io.IOException: 503: No endpoint strategy found for request GET /v3/config/cdap HTTP/1.1
	at co.cask.cdap.client.util.RESTClient.execute(RESTClient.java:132)
	at co.cask.cdap.client.util.RESTClient.execute(RESTClient.java:74)
	at co.cask.cdap.client.MetaClient.getConfig(MetaClient.java:81)
	at co.cask.cdap.client.MetaClient.getCDAPConfig(MetaClient.java:71)
	at co.cask.cdap.security.AuthorizationTestBase.verifyAndSetUpAuthz(AuthorizationTestBase.java:91)
	at co.cask.cdap.security.AuthorizationTestBase.setUp(AuthorizationTestBase.java:84)
	at sun.reflect.GeneratedMethodAccessor1.invoke(Unknown Source)
(33 more lines...)
Collapse Failed NamespaceImpersonationBasicAuthorizationTest testDatasetPrivileges History
Default Job 1 min
java.io.IOException: 503: No endpoint strategy found for request GET /v3/config/cdap HTTP/1.1
	at co.cask.cdap.client.util.RESTClient.execute(RESTClient.java:132)
	at co.cask.cdap.client.util.RESTClient.execute(RESTClient.java:74)
	at co.cask.cdap.client.MetaClient.getConfig(MetaClient.java:81)
	at co.cask.cdap.client.MetaClient.getCDAPConfig(MetaClient.java:71)
	at co.cask.cdap.security.AuthorizationTestBase.verifyAndSetUpAuthz(AuthorizationTestBase.java:91)
	at co.cask.cdap.security.AuthorizationTestBase.setUp(AuthorizationTestBase.java:84)
	at sun.reflect.GeneratedMethodAccessor1.invoke(Unknown Source)
(33 more lines...)
Collapse Failed NamespaceImpersonationBasicAuthorizationTest testStreamPrivileges History
Default Job 1 min
java.io.IOException: 503: No endpoint strategy found for request GET /v3/config/cdap HTTP/1.1
	at co.cask.cdap.client.util.RESTClient.execute(RESTClient.java:132)
	at co.cask.cdap.client.util.RESTClient.execute(RESTClient.java:74)
	at co.cask.cdap.client.MetaClient.getConfig(MetaClient.java:81)
	at co.cask.cdap.client.MetaClient.getCDAPConfig(MetaClient.java:71)
	at co.cask.cdap.security.AuthorizationTestBase.verifyAndSetUpAuthz(AuthorizationTestBase.java:91)
	at co.cask.cdap.security.AuthorizationTestBase.setUp(AuthorizationTestBase.java:84)
	at sun.reflect.GeneratedMethodAccessor1.invoke(Unknown Source)
(33 more lines...)
Collapse Failed NamespaceImpersonationBasicAuthorizationTest testCreateNamespaceWithDifferentOwners History
Default Job 1 min
java.io.IOException: 503: No endpoint strategy found for request GET /v3/config/cdap HTTP/1.1
	at co.cask.cdap.client.util.RESTClient.execute(RESTClient.java:132)
	at co.cask.cdap.client.util.RESTClient.execute(RESTClient.java:74)
	at co.cask.cdap.client.MetaClient.getConfig(MetaClient.java:81)
	at co.cask.cdap.client.MetaClient.getCDAPConfig(MetaClient.java:71)
	at co.cask.cdap.security.AuthorizationTestBase.verifyAndSetUpAuthz(AuthorizationTestBase.java:91)
	at co.cask.cdap.security.AuthorizationTestBase.setUp(AuthorizationTestBase.java:84)
	at sun.reflect.GeneratedMethodAccessor1.invoke(Unknown Source)
(33 more lines...)

JIRA issues

IssueDescriptionStatus
Unknown Issue TypeCDAP-13261Could not obtain issue details from JIRA