Build #1

Build: #1 failed

Job: Cloudera Manager - 5.12 failed

Stages & jobs

  1. Variables

  2. Spinup and Test

Job result summary

Completed
Duration
100 minutes
Agent
bamboo-agent12
Revisions
caskdata/cdap-integration-tests
edd90d16eae28f961d9eda1321924aca45f09600 edd90d16eae28f961d9eda1321924aca45f09600
caskdata/coopr-internal
3aae2578937e4455255531f41b1357eb97c48096 3aae2578937e4455255531f41b1357eb97c48096
Total tests
33

Tests

  • 33 tests in total
  • 14 tests failed
  • 14 failures are new
  • 43 minutes taken in total.
New test failures 14
Status Test Duration
Collapse Failed AppImpersonationAuthorizationTest testDeployApp History

Failing on the develop branch.

35 secs
java.io.IOException: 500: Error while creating home directory 'hdfs://it-itca4-cm512-1-35720-1000.coopr.sh:8020/cdap/namespaces/authorization' for namespace 'namespace:authorization': mkdirs() returned false
	at co.cask.cdap.client.util.RESTClient.execute(RESTClient.java:132)
	at co.cask.cdap.client.util.RESTClient.execute(RESTClient.java:69)
	at co.cask.cdap.client.NamespaceClient.execute(NamespaceClient.java:56)
	at co.cask.cdap.common.namespace.AbstractNamespaceClient.create(AbstractNamespaceClient.java:58)
	at co.cask.cdap.security.AuthorizationTestBase.createAndRegisterNamespace(AuthorizationTestBase.java:135)
	at co.cask.cdap.security.BasicAppAuthorizationTest.testDeployApp(BasicAppAuthorizationTest.java:294)
	at sun.reflect.NativeMethodAccessorImpl.invoke0(Native Method)
(43 more lines...)
Collapse Failed AppImpersonationAuthorizationTest testDeployAppUnauthorized History

Failing on the develop branch.

35 secs
java.io.IOException: 500: Error while creating home directory 'hdfs://it-itca4-cm512-1-35720-1000.coopr.sh:8020/cdap/namespaces/authorization' for namespace 'namespace:authorization': mkdirs() returned false
	at co.cask.cdap.client.util.RESTClient.execute(RESTClient.java:132)
	at co.cask.cdap.client.util.RESTClient.execute(RESTClient.java:69)
	at co.cask.cdap.client.NamespaceClient.execute(NamespaceClient.java:56)
	at co.cask.cdap.common.namespace.AbstractNamespaceClient.create(AbstractNamespaceClient.java:58)
	at co.cask.cdap.security.AuthorizationTestBase.createAndRegisterNamespace(AuthorizationTestBase.java:135)
	at co.cask.cdap.security.BasicAppAuthorizationTest.testDeployAppUnauthorized(BasicAppAuthorizationTest.java:364)
	at sun.reflect.NativeMethodAccessorImpl.invoke0(Native Method)
(43 more lines...)
Collapse Failed AppImpersonationAuthorizationTest testRunningFlowAndExploreStreams History

Failing on the develop branch.

35 secs
java.io.IOException: 500: Error while creating home directory 'hdfs://it-itca4-cm512-1-35720-1000.coopr.sh:8020/cdap/namespaces/authorization' for namespace 'namespace:authorization': mkdirs() returned false
	at co.cask.cdap.client.util.RESTClient.execute(RESTClient.java:132)
	at co.cask.cdap.client.util.RESTClient.execute(RESTClient.java:69)
	at co.cask.cdap.client.NamespaceClient.execute(NamespaceClient.java:56)
	at co.cask.cdap.common.namespace.AbstractNamespaceClient.create(AbstractNamespaceClient.java:58)
	at co.cask.cdap.security.AuthorizationTestBase.createAndRegisterNamespace(AuthorizationTestBase.java:135)
	at co.cask.cdap.security.BasicAppAuthorizationTest.testRunningFlowAndExploreStreams(BasicAppAuthorizationTest.java:174)
	at sun.reflect.NativeMethodAccessorImpl.invoke0(Native Method)
(43 more lines...)
Collapse Failed BasicAppAuthorizationTest testDeployApp History

Failing on the develop branch.

2 mins
java.util.concurrent.TimeoutException: Timeout occurred. Expected true but found false.
	at co.cask.cdap.common.utils.Tasks.waitFor(Tasks.java:70)
	at co.cask.cdap.common.utils.Tasks.waitFor(Tasks.java:91)
	at co.cask.cdap.common.utils.Tasks.waitFor(Tasks.java:130)
	at co.cask.cdap.test.AbstractProgramManager.waitForRuns(AbstractProgramManager.java:96)
	at co.cask.cdap.test.AbstractProgramManager.waitForRun(AbstractProgramManager.java:90)
	at co.cask.cdap.security.BasicAppAuthorizationTest.testDeployApp(BasicAppAuthorizationTest.java:342)
Collapse Failed CustomMappingAppAuthorizationTest testRunningFlowAndExploreStreams History

Failing on the develop branch.

2 mins
java.util.concurrent.ExecutionException: co.cask.cdap.explore.service.ExploreException: Cannot execute query. Reason: Response code: 400, message: 'Bad Request', body: '[SQLState 42S02] Error while compiling statement: FAILED: SemanticException [Error 10001]: Line 1:14 Table not found 'stream_who''
	at com.google.common.util.concurrent.AbstractFuture.getDoneValue(AbstractFuture.java:500)
	at com.google.common.util.concurrent.AbstractFuture.get(AbstractFuture.java:479)
	at co.cask.cdap.security.BasicAppAuthorizationTest.testRunningFlowAndExploreStreams(BasicAppAuthorizationTest.java:206)
	at sun.reflect.NativeMethodAccessorImpl.invoke0(Native Method)
	at sun.reflect.NativeMethodAccessorImpl.invoke(NativeMethodAccessorImpl.java:62)
	at sun.reflect.DelegatingMethodAccessorImpl.invoke(DelegatingMethodAccessorImpl.java:43)
	at java.lang.reflect.Method.invoke(Method.java:498)
(58 more lines...)
Collapse Failed NamespaceImpersonationAppAuthorizationTest testDatasetInProgram History

Failing on the develop branch.

35 secs
java.io.IOException: 500: Error while creating home directory 'hdfs://it-itca4-cm512-1-35720-1000.coopr.sh:8020/cdap/namespaces/authorization11' for namespace 'namespace:authorization11': mkdirs() returned false
	at co.cask.cdap.client.util.RESTClient.execute(RESTClient.java:132)
	at co.cask.cdap.client.util.RESTClient.execute(RESTClient.java:69)
	at co.cask.cdap.client.NamespaceClient.execute(NamespaceClient.java:56)
	at co.cask.cdap.common.namespace.AbstractNamespaceClient.create(AbstractNamespaceClient.java:58)
	at co.cask.cdap.security.AuthorizationTestBase.createAndRegisterNamespace(AuthorizationTestBase.java:135)
	at co.cask.cdap.security.BasicAppAuthorizationTest.testDatasetInProgram(BasicAppAuthorizationTest.java:452)
	at sun.reflect.NativeMethodAccessorImpl.invoke0(Native Method)
(43 more lines...)
Collapse Failed NamespaceImpersonationAppAuthorizationTest testDeployApp History

Failing on the develop branch.

35 secs
java.io.IOException: 500: Error while creating home directory 'hdfs://it-itca4-cm512-1-35720-1000.coopr.sh:8020/cdap/namespaces/authorization' for namespace 'namespace:authorization': mkdirs() returned false
	at co.cask.cdap.client.util.RESTClient.execute(RESTClient.java:132)
	at co.cask.cdap.client.util.RESTClient.execute(RESTClient.java:69)
	at co.cask.cdap.client.NamespaceClient.execute(NamespaceClient.java:56)
	at co.cask.cdap.common.namespace.AbstractNamespaceClient.create(AbstractNamespaceClient.java:58)
	at co.cask.cdap.security.AuthorizationTestBase.createAndRegisterNamespace(AuthorizationTestBase.java:135)
	at co.cask.cdap.security.BasicAppAuthorizationTest.testDeployApp(BasicAppAuthorizationTest.java:294)
	at sun.reflect.NativeMethodAccessorImpl.invoke0(Native Method)
(43 more lines...)
Collapse Failed NamespaceImpersonationAppAuthorizationTest testDeployAppUnauthorized History

Failing on the develop branch.

35 secs
java.io.IOException: 500: Error while creating home directory 'hdfs://it-itca4-cm512-1-35720-1000.coopr.sh:8020/cdap/namespaces/authorization' for namespace 'namespace:authorization': mkdirs() returned false
	at co.cask.cdap.client.util.RESTClient.execute(RESTClient.java:132)
	at co.cask.cdap.client.util.RESTClient.execute(RESTClient.java:69)
	at co.cask.cdap.client.NamespaceClient.execute(NamespaceClient.java:56)
	at co.cask.cdap.common.namespace.AbstractNamespaceClient.create(AbstractNamespaceClient.java:58)
	at co.cask.cdap.security.AuthorizationTestBase.createAndRegisterNamespace(AuthorizationTestBase.java:135)
	at co.cask.cdap.security.BasicAppAuthorizationTest.testDeployAppUnauthorized(BasicAppAuthorizationTest.java:364)
	at sun.reflect.NativeMethodAccessorImpl.invoke0(Native Method)
(43 more lines...)
Collapse Failed NamespaceImpersonationAppAuthorizationTest testRunningFlowAndExploreStreams History

Failing on the develop branch.

35 secs
java.io.IOException: 500: Error while creating home directory 'hdfs://it-itca4-cm512-1-35720-1000.coopr.sh:8020/cdap/namespaces/authorization' for namespace 'namespace:authorization': mkdirs() returned false
	at co.cask.cdap.client.util.RESTClient.execute(RESTClient.java:132)
	at co.cask.cdap.client.util.RESTClient.execute(RESTClient.java:69)
	at co.cask.cdap.client.NamespaceClient.execute(NamespaceClient.java:56)
	at co.cask.cdap.common.namespace.AbstractNamespaceClient.create(AbstractNamespaceClient.java:58)
	at co.cask.cdap.security.AuthorizationTestBase.createAndRegisterNamespace(AuthorizationTestBase.java:135)
	at co.cask.cdap.security.BasicAppAuthorizationTest.testRunningFlowAndExploreStreams(BasicAppAuthorizationTest.java:174)
	at sun.reflect.NativeMethodAccessorImpl.invoke0(Native Method)
(43 more lines...)
Collapse Failed NamespaceImpersonationBasicAuthorizationTest testCreateNamespaceWithDifferentOwners History

Failing on the develop branch.

35 secs
java.io.IOException: 500: Error while creating home directory 'hdfs://it-itca4-cm512-1-35720-1000.coopr.sh:8020/cdap/namespaces/authorization' for namespace 'namespace:authorization': mkdirs() returned false
	at co.cask.cdap.client.util.RESTClient.execute(RESTClient.java:132)
	at co.cask.cdap.client.util.RESTClient.execute(RESTClient.java:69)
	at co.cask.cdap.client.NamespaceClient.execute(NamespaceClient.java:56)
	at co.cask.cdap.common.namespace.AbstractNamespaceClient.create(AbstractNamespaceClient.java:58)
	at co.cask.cdap.security.AuthorizationTestBase.createAndRegisterNamespace(AuthorizationTestBase.java:135)
	at co.cask.cdap.security.NamespaceImpersonationBasicAuthorizationTest.testCreateNamespaceWithDifferentOwners(NamespaceImpersonationBasicAuthorizationTest.java:63)
Collapse Failed NamespaceImpersonationBasicAuthorizationTest testDatasetPrivileges History

Failing on the develop branch.

34 secs
java.io.IOException: 500: Error while creating home directory 'hdfs://it-itca4-cm512-1-35720-1000.coopr.sh:8020/cdap/namespaces/authorization' for namespace 'namespace:authorization': mkdirs() returned false
	at co.cask.cdap.client.util.RESTClient.execute(RESTClient.java:132)
	at co.cask.cdap.client.util.RESTClient.execute(RESTClient.java:69)
	at co.cask.cdap.client.NamespaceClient.execute(NamespaceClient.java:56)
	at co.cask.cdap.common.namespace.AbstractNamespaceClient.create(AbstractNamespaceClient.java:58)
	at co.cask.cdap.security.AuthorizationTestBase.createAndRegisterNamespace(AuthorizationTestBase.java:135)
	at co.cask.cdap.security.BasicAuthorizationTest.testDatasetPrivileges(BasicAuthorizationTest.java:363)
	at sun.reflect.NativeMethodAccessorImpl.invoke0(Native Method)
(43 more lines...)
Collapse Failed NamespaceImpersonationBasicAuthorizationTest testDeleteNamespaceWithDifferentClients History

Failing on the develop branch.

35 secs
java.io.IOException: 500: Error while creating home directory 'hdfs://it-itca4-cm512-1-35720-1000.coopr.sh:8020/cdap/namespaces/authorization' for namespace 'namespace:authorization': mkdirs() returned false
	at co.cask.cdap.client.util.RESTClient.execute(RESTClient.java:132)
	at co.cask.cdap.client.util.RESTClient.execute(RESTClient.java:69)
	at co.cask.cdap.client.NamespaceClient.execute(NamespaceClient.java:56)
	at co.cask.cdap.common.namespace.AbstractNamespaceClient.create(AbstractNamespaceClient.java:58)
	at co.cask.cdap.security.AuthorizationTestBase.createAndRegisterNamespace(AuthorizationTestBase.java:135)
	at co.cask.cdap.security.BasicAuthorizationTest.createAndDeleteNamespace(BasicAuthorizationTest.java:548)
	at co.cask.cdap.security.BasicAuthorizationTest.testDeleteNamespaceWithDifferentClients(BasicAuthorizationTest.java:538)
(44 more lines...)
Collapse Failed NamespaceImpersonationBasicAuthorizationTest testNamespacePrivileges History

Failing on the develop branch.

35 secs
java.io.IOException: 500: Error while creating home directory 'hdfs://it-itca4-cm512-1-35720-1000.coopr.sh:8020/cdap/namespaces/authorization' for namespace 'namespace:authorization': mkdirs() returned false
	at co.cask.cdap.client.util.RESTClient.execute(RESTClient.java:132)
	at co.cask.cdap.client.util.RESTClient.execute(RESTClient.java:69)
	at co.cask.cdap.client.NamespaceClient.execute(NamespaceClient.java:56)
	at co.cask.cdap.common.namespace.AbstractNamespaceClient.create(AbstractNamespaceClient.java:58)
	at co.cask.cdap.security.AuthorizationTestBase.createAndRegisterNamespace(AuthorizationTestBase.java:135)
	at co.cask.cdap.security.BasicAuthorizationTest.testNamespacePrivileges(BasicAuthorizationTest.java:105)
	at sun.reflect.NativeMethodAccessorImpl.invoke0(Native Method)
(43 more lines...)
Collapse Failed NamespaceImpersonationBasicAuthorizationTest testStreamPrivileges History

Failing on the develop branch.

35 secs
java.io.IOException: 500: Error while creating home directory 'hdfs://it-itca4-cm512-1-35720-1000.coopr.sh:8020/cdap/namespaces/authorization' for namespace 'namespace:authorization': mkdirs() returned false
	at co.cask.cdap.client.util.RESTClient.execute(RESTClient.java:132)
	at co.cask.cdap.client.util.RESTClient.execute(RESTClient.java:69)
	at co.cask.cdap.client.NamespaceClient.execute(NamespaceClient.java:56)
	at co.cask.cdap.common.namespace.AbstractNamespaceClient.create(AbstractNamespaceClient.java:58)
	at co.cask.cdap.security.AuthorizationTestBase.createAndRegisterNamespace(AuthorizationTestBase.java:135)
	at co.cask.cdap.security.BasicAuthorizationTest.testStreamPrivileges(BasicAuthorizationTest.java:449)
	at sun.reflect.NativeMethodAccessorImpl.invoke0(Native Method)
(43 more lines...)

Error summary

The build generated some errors. See the full build log for more details.

Warning: Permanently added '10.210.0.35' (RSA) to the list of known hosts.
Warning: Permanently added '10.210.0.35' (RSA) to the list of known hosts.
Warning: Permanently added '10.210.0.35' (RSA) to the list of known hosts.
Warning: Permanently added '10.210.0.35' (RSA) to the list of known hosts.
Warning: Permanently added '10.210.0.35' (RSA) to the list of known hosts.
Warning: Permanently added '10.210.0.35' (RSA) to the list of known hosts.
Warning: Permanently added '10.210.0.35' (RSA) to the list of known hosts.
Warning: Permanently added '10.210.0.35' (RSA) to the list of known hosts.
Warning: Permanently added '10.210.0.35' (RSA) to the list of known hosts.
Warning: Permanently added '10.210.0.35' (RSA) to the list of known hosts.
Warning: Permanently added '10.210.0.35' (RSA) to the list of known hosts.
Warning: Permanently added '10.210.0.35' (RSA) to the list of known hosts.
Warning: Permanently added '10.210.0.35' (RSA) to the list of known hosts.
Warning: Permanently added '10.210.0.35' (RSA) to the list of known hosts.
Warning: Permanently added '10.210.0.35' (RSA) to the list of known hosts.
Warning: Permanently added '10.210.0.35' (RSA) to the list of known hosts.
Warning: Permanently added '10.210.0.35' (RSA) to the list of known hosts.
Java HotSpot(TM) 64-Bit Server VM warning: ignoring option MaxPermSize=128m; support was removed in 8.0
Warning:  org.apache.xerces.jaxp.SAXParserImpl$JAXPSAXParser: Property 'http://www.oracle.com/xml/jaxp/properties/entityExpansionLimit' is not recognized.
Compiler warnings:
  WARNING:  'org.apache.xerces.jaxp.SAXParserImpl: Property 'http://javax.xml.XMLConstants/property/accessExternalDTD' is not recognized.'
Warning:  org.apache.xerces.parsers.SAXParser: Feature 'http://javax.xml.XMLConstants/feature/secure-processing' is not recognized.
Warning:  org.apache.xerces.parsers.SAXParser: Property 'http://javax.xml.XMLConstants/property/accessExternalDTD' is not recognized.
Warning:  org.apache.xerces.parsers.SAXParser: Property 'http://www.oracle.com/xml/jaxp/properties/entityExpansionLimit' is not recognized.
Warning:  org.apache.xerces.jaxp.SAXParserImpl$JAXPSAXParser: Property 'http://www.oracle.com/xml/jaxp/properties/entityExpansionLimit' is not recognized.
Compiler warnings:
  WARNING:  'org.apache.xerces.jaxp.SAXParserImpl: Property 'http://javax.xml.XMLConstants/property/accessExternalDTD' is not recognized.'
Warning:  org.apache.xerces.parsers.SAXParser: Feature 'http://javax.xml.XMLConstants/feature/secure-processing' is not recognized.
Warning:  org.apache.xerces.parsers.SAXParser: Property 'http://javax.xml.XMLConstants/property/accessExternalDTD' is not recognized.
Warning:  org.apache.xerces.parsers.SAXParser: Property 'http://www.oracle.com/xml/jaxp/properties/entityExpansionLimit' is not recognized.
Warning:  org.apache.xerces.jaxp.SAXParserImpl$JAXPSAXParser: Property 'http://www.oracle.com/xml/jaxp/properties/entityExpansionLimit' is not recognized.
Compiler warnings:
  WARNING:  'org.apache.xerces.jaxp.SAXParserImpl: Property 'http://javax.xml.XMLConstants/property/accessExternalDTD' is not recognized.'
Warning:  org.apache.xerces.parsers.SAXParser: Feature 'http://javax.xml.XMLConstants/feature/secure-processing' is not recognized.
Warning:  org.apache.xerces.parsers.SAXParser: Property 'http://javax.xml.XMLConstants/property/accessExternalDTD' is not recognized.
Warning:  org.apache.xerces.parsers.SAXParser: Property 'http://www.oracle.com/xml/jaxp/properties/entityExpansionLimit' is not recognized.
SLF4J: Class path contains multiple SLF4J bindings.
SLF4J: Found binding in [jar:file:/home/bamboo/.m2/repository/co/********/cdap/cdap-cli/5.1.0-SNAPSHOT/cdap-cli-5.1.0-SNAPSHOT.jar!/org/slf4j/impl/StaticLoggerBinder.class]
SLF4J: Found binding in [jar:file:/home/bamboo/.m2/repository/co/********/cdap/cdap-explore-jdbc/5.1.0-SNAPSHOT/cdap-explore-jdbc-5.1.0-SNAPSHOT.jar!/org/slf4j/impl/StaticLoggerBinder.class]
SLF4J: Found binding in [jar:file:/home/bamboo/.m2/repository/ch/qos/logback/logback-classic/1.0.9/logback-classic-1.0.9.jar!/org/slf4j/impl/StaticLoggerBinder.class]
SLF4J: See http://www.slf4j.org/codes.html#multiple_bindings for an explanation.
SLF4J: Actual binding is of type [ch.qos.logback.classic.util.ContextSelectorStaticBinder]