Build #1

Build: #1 failed Manual run by Rohit Sinha

Stages & jobs

  1. Variables

  2. Spinup and Test

Logs

The following logs have been generated by the jobs in this branch.
  • Expand all
  • Collapse all
Job Logs
Collapse Cloudera Manager - 5.12 Spinup and Test Download or View
08-Oct-2018 19:53:17 [INFO] integration-test-core ............................. SUCCESS [4.368s]
08-Oct-2018 19:53:17 [INFO] integration-test-remote ........................... FAILURE [43:55.851s]
08-Oct-2018 19:53:17 [INFO] integration-test-standalone ....................... SKIPPED
08-Oct-2018 19:53:17 [INFO] upgrade-test ...................................... SKIPPED
08-Oct-2018 19:53:17 [INFO] long-running-test ................................. SKIPPED
08-Oct-2018 19:53:17 [INFO] ------------------------------------------------------------------------
08-Oct-2018 19:53:17 [INFO] BUILD FAILURE
08-Oct-2018 19:53:17 [INFO] ------------------------------------------------------------------------
08-Oct-2018 19:53:17 [INFO] Total time: 44:16.482s
08-Oct-2018 19:53:17 [INFO] Finished at: Mon Oct 08 19:53:17 UTC 2018
08-Oct-2018 19:53:19 [INFO] Final Memory: 114M/1150M
08-Oct-2018 19:53:19 [INFO] ------------------------------------------------------------------------
08-Oct-2018 19:53:19 [ERROR] Failed to execute goal org.apache.maven.plugins:maven-surefire-plugin:2.18.1:test (default-test) on project integration-test-remote: There are test failures.
08-Oct-2018 19:53:19 [ERROR]
08-Oct-2018 19:53:19 [ERROR] Please refer to /var/bamboo/xml-data/build-dir/IT-ITCA4-CM512/cdap-integration-tests/integration-test-remote/target/surefire-reports for the individual test results.
08-Oct-2018 19:53:19 [ERROR] -> [Help 1]
08-Oct-2018 19:53:19 [ERROR]
08-Oct-2018 19:53:19 [ERROR] To see the full stack trace of the errors, re-run Maven with the -e switch.
08-Oct-2018 19:53:19 [ERROR] Re-run Maven using the -X switch to enable full debug logging.
08-Oct-2018 19:53:19 [ERROR]
08-Oct-2018 19:53:19 [ERROR] For more information about the errors and possible solutions, please read the following articles:
08-Oct-2018 19:53:19 [ERROR] [Help 1] http://cwiki.apache.org/confluence/display/MAVEN/MojoFailureException
08-Oct-2018 19:53:19 [ERROR]
08-Oct-2018 19:53:19 [ERROR] After correcting the problems, you can resume the build with the command
08-Oct-2018 19:53:19 [ERROR]   mvn <goals> -rf :integration-test-remote