Build #13

Build: #13 failed Manual run by Yaojie Feng

Stages & jobs

  1. Variables

  2. Spinup and Test

Build result summary

Details

Completed
Duration
57 minutes
Labels
None
Revisions
caskdata/cdap-integration-tests
df613f36352f3acf50b029372a3492e16e4d0175 df613f36352f3acf50b029372a3492e16e4d0175
caskdata/coopr-internal
36b1c5c59bf8e8aae9b59c613750368fe8a07c27 36b1c5c59bf8e8aae9b59c613750368fe8a07c27
Total tests
33
Failing since
#12 (Manual run by Sreevatsan Raman)

Responsible

Configuration changes

Plan configuration has changed since the last successful build. See the plan audit log for more details.

Tests

New test failures 3
Status Test View job Duration
Collapse Failed AppImpersonationAuthorizationTest testDatasetInProgram History
Cloudera Manager - 5.12 < 1 sec
java.lang.NullPointerException: null
	at co.cask.cdap.security.AuthorizationTestBase.verifyAndSetUpAuthz(AuthorizationTestBase.java:98)
	at co.cask.cdap.security.AuthorizationTestBase.setUp(AuthorizationTestBase.java:84)
	at sun.reflect.NativeMethodAccessorImpl.invoke0(Native Method)
	at sun.reflect.NativeMethodAccessorImpl.invoke(NativeMethodAccessorImpl.java:62)
	at sun.reflect.DelegatingMethodAccessorImpl.invoke(DelegatingMethodAccessorImpl.java:43)
	at java.lang.reflect.Method.invoke(Method.java:498)
	at org.junit.runners.model.FrameworkMethod$1.runReflectiveCall(FrameworkMethod.java:47)
(38 more lines...)
Collapse Failed AppImpersonationAuthorizationTest testDeployApp History

Failing on the develop branch.

Cloudera Manager - 5.12 < 1 sec
java.lang.NullPointerException: null
	at co.cask.cdap.security.AuthorizationTestBase.verifyAndSetUpAuthz(AuthorizationTestBase.java:98)
	at co.cask.cdap.security.AuthorizationTestBase.setUp(AuthorizationTestBase.java:84)
	at sun.reflect.NativeMethodAccessorImpl.invoke0(Native Method)
	at sun.reflect.NativeMethodAccessorImpl.invoke(NativeMethodAccessorImpl.java:62)
	at sun.reflect.DelegatingMethodAccessorImpl.invoke(DelegatingMethodAccessorImpl.java:43)
	at java.lang.reflect.Method.invoke(Method.java:498)
	at org.junit.runners.model.FrameworkMethod$1.runReflectiveCall(FrameworkMethod.java:47)
(38 more lines...)
Collapse Failed AppImpersonationAuthorizationTest testDeployAppUnauthorized History

Failing on the develop branch.

Cloudera Manager - 5.12 < 1 sec
java.lang.NullPointerException: null
	at co.cask.cdap.security.AuthorizationTestBase.verifyAndSetUpAuthz(AuthorizationTestBase.java:98)
	at co.cask.cdap.security.AuthorizationTestBase.setUp(AuthorizationTestBase.java:84)
	at sun.reflect.NativeMethodAccessorImpl.invoke0(Native Method)
	at sun.reflect.NativeMethodAccessorImpl.invoke(NativeMethodAccessorImpl.java:62)
	at sun.reflect.DelegatingMethodAccessorImpl.invoke(DelegatingMethodAccessorImpl.java:43)
	at java.lang.reflect.Method.invoke(Method.java:498)
	at org.junit.runners.model.FrameworkMethod$1.runReflectiveCall(FrameworkMethod.java:47)
(38 more lines...)
Existing test failures 30
Status Test Failing since View job Duration
java.lang.NullPointerException: null
	at co.cask.cdap.security.AuthorizationTestBase.verifyAndSetUpAuthz(AuthorizationTestBase.java:98)
	at co.cask.cdap.security.AuthorizationTestBase.setUp(AuthorizationTestBase.java:84)
	at sun.reflect.NativeMethodAccessorImpl.invoke0(Native Method)
	at sun.reflect.NativeMethodAccessorImpl.invoke(NativeMethodAccessorImpl.java:62)
	at sun.reflect.DelegatingMethodAccessorImpl.invoke(DelegatingMethodAccessorImpl.java:43)
	at java.lang.reflect.Method.invoke(Method.java:498)
	at org.junit.runners.model.FrameworkMethod$1.runReflectiveCall(FrameworkMethod.java:47)
(38 more lines...)
java.lang.NullPointerException: null
	at co.cask.cdap.security.AuthorizationTestBase.verifyAndSetUpAuthz(AuthorizationTestBase.java:98)
	at co.cask.cdap.security.AuthorizationTestBase.setUp(AuthorizationTestBase.java:84)
	at sun.reflect.NativeMethodAccessorImpl.invoke0(Native Method)
	at sun.reflect.NativeMethodAccessorImpl.invoke(NativeMethodAccessorImpl.java:62)
	at sun.reflect.DelegatingMethodAccessorImpl.invoke(DelegatingMethodAccessorImpl.java:43)
	at java.lang.reflect.Method.invoke(Method.java:498)
	at org.junit.runners.model.FrameworkMethod$1.runReflectiveCall(FrameworkMethod.java:47)
(38 more lines...)
java.lang.NullPointerException: null
	at co.cask.cdap.security.AuthorizationTestBase.verifyAndSetUpAuthz(AuthorizationTestBase.java:98)
	at co.cask.cdap.security.AuthorizationTestBase.setUp(AuthorizationTestBase.java:84)
	at sun.reflect.NativeMethodAccessorImpl.invoke0(Native Method)
	at sun.reflect.NativeMethodAccessorImpl.invoke(NativeMethodAccessorImpl.java:62)
	at sun.reflect.DelegatingMethodAccessorImpl.invoke(DelegatingMethodAccessorImpl.java:43)
	at java.lang.reflect.Method.invoke(Method.java:498)
	at org.junit.runners.model.FrameworkMethod$1.runReflectiveCall(FrameworkMethod.java:47)
(38 more lines...)
java.lang.NullPointerException: null
	at co.cask.cdap.security.AuthorizationTestBase.verifyAndSetUpAuthz(AuthorizationTestBase.java:98)
	at co.cask.cdap.security.AuthorizationTestBase.setUp(AuthorizationTestBase.java:84)
	at sun.reflect.NativeMethodAccessorImpl.invoke0(Native Method)
	at sun.reflect.NativeMethodAccessorImpl.invoke(NativeMethodAccessorImpl.java:62)
	at sun.reflect.DelegatingMethodAccessorImpl.invoke(DelegatingMethodAccessorImpl.java:43)
	at java.lang.reflect.Method.invoke(Method.java:498)
	at org.junit.runners.model.FrameworkMethod$1.runReflectiveCall(FrameworkMethod.java:47)
(38 more lines...)
java.lang.NullPointerException: null
	at co.cask.cdap.security.AuthorizationTestBase.verifyAndSetUpAuthz(AuthorizationTestBase.java:98)
	at co.cask.cdap.security.AuthorizationTestBase.setUp(AuthorizationTestBase.java:84)
	at sun.reflect.NativeMethodAccessorImpl.invoke0(Native Method)
	at sun.reflect.NativeMethodAccessorImpl.invoke(NativeMethodAccessorImpl.java:62)
	at sun.reflect.DelegatingMethodAccessorImpl.invoke(DelegatingMethodAccessorImpl.java:43)
	at java.lang.reflect.Method.invoke(Method.java:498)
	at org.junit.runners.model.FrameworkMethod$1.runReflectiveCall(FrameworkMethod.java:47)
(38 more lines...)
java.lang.NullPointerException: null
	at co.cask.cdap.security.AuthorizationTestBase.verifyAndSetUpAuthz(AuthorizationTestBase.java:98)
	at co.cask.cdap.security.AuthorizationTestBase.setUp(AuthorizationTestBase.java:84)
	at sun.reflect.NativeMethodAccessorImpl.invoke0(Native Method)
	at sun.reflect.NativeMethodAccessorImpl.invoke(NativeMethodAccessorImpl.java:62)
	at sun.reflect.DelegatingMethodAccessorImpl.invoke(DelegatingMethodAccessorImpl.java:43)
	at java.lang.reflect.Method.invoke(Method.java:498)
	at org.junit.runners.model.FrameworkMethod$1.runReflectiveCall(FrameworkMethod.java:47)
(38 more lines...)
java.lang.NullPointerException: null
	at co.cask.cdap.security.AuthorizationTestBase.verifyAndSetUpAuthz(AuthorizationTestBase.java:98)
	at co.cask.cdap.security.AuthorizationTestBase.setUp(AuthorizationTestBase.java:84)
	at sun.reflect.NativeMethodAccessorImpl.invoke0(Native Method)
	at sun.reflect.NativeMethodAccessorImpl.invoke(NativeMethodAccessorImpl.java:62)
	at sun.reflect.DelegatingMethodAccessorImpl.invoke(DelegatingMethodAccessorImpl.java:43)
	at java.lang.reflect.Method.invoke(Method.java:498)
	at org.junit.runners.model.FrameworkMethod$1.runReflectiveCall(FrameworkMethod.java:47)
(38 more lines...)
java.lang.NullPointerException: null
	at co.cask.cdap.security.AuthorizationTestBase.verifyAndSetUpAuthz(AuthorizationTestBase.java:98)
	at co.cask.cdap.security.AuthorizationTestBase.setUp(AuthorizationTestBase.java:84)
	at sun.reflect.NativeMethodAccessorImpl.invoke0(Native Method)
	at sun.reflect.NativeMethodAccessorImpl.invoke(NativeMethodAccessorImpl.java:62)
	at sun.reflect.DelegatingMethodAccessorImpl.invoke(DelegatingMethodAccessorImpl.java:43)
	at java.lang.reflect.Method.invoke(Method.java:498)
	at org.junit.runners.model.FrameworkMethod$1.runReflectiveCall(FrameworkMethod.java:47)
(38 more lines...)
java.lang.NullPointerException: null
	at co.cask.cdap.security.AuthorizationTestBase.verifyAndSetUpAuthz(AuthorizationTestBase.java:98)
	at co.cask.cdap.security.AuthorizationTestBase.setUp(AuthorizationTestBase.java:84)
	at sun.reflect.NativeMethodAccessorImpl.invoke0(Native Method)
	at sun.reflect.NativeMethodAccessorImpl.invoke(NativeMethodAccessorImpl.java:62)
	at sun.reflect.DelegatingMethodAccessorImpl.invoke(DelegatingMethodAccessorImpl.java:43)
	at java.lang.reflect.Method.invoke(Method.java:498)
	at org.junit.runners.model.FrameworkMethod$1.runReflectiveCall(FrameworkMethod.java:47)
(38 more lines...)
java.lang.NullPointerException: null
	at co.cask.cdap.security.AuthorizationTestBase.verifyAndSetUpAuthz(AuthorizationTestBase.java:98)
	at co.cask.cdap.security.AuthorizationTestBase.setUp(AuthorizationTestBase.java:84)
	at sun.reflect.NativeMethodAccessorImpl.invoke0(Native Method)
	at sun.reflect.NativeMethodAccessorImpl.invoke(NativeMethodAccessorImpl.java:62)
	at sun.reflect.DelegatingMethodAccessorImpl.invoke(DelegatingMethodAccessorImpl.java:43)
	at java.lang.reflect.Method.invoke(Method.java:498)
	at org.junit.runners.model.FrameworkMethod$1.runReflectiveCall(FrameworkMethod.java:47)
(38 more lines...)
java.lang.NullPointerException: null
	at co.cask.cdap.security.AuthorizationTestBase.verifyAndSetUpAuthz(AuthorizationTestBase.java:98)
	at co.cask.cdap.security.AuthorizationTestBase.setUp(AuthorizationTestBase.java:84)
	at sun.reflect.NativeMethodAccessorImpl.invoke0(Native Method)
	at sun.reflect.NativeMethodAccessorImpl.invoke(NativeMethodAccessorImpl.java:62)
	at sun.reflect.DelegatingMethodAccessorImpl.invoke(DelegatingMethodAccessorImpl.java:43)
	at java.lang.reflect.Method.invoke(Method.java:498)
	at org.junit.runners.model.FrameworkMethod$1.runReflectiveCall(FrameworkMethod.java:47)
(38 more lines...)
java.lang.NullPointerException: null
	at co.cask.cdap.security.AuthorizationTestBase.verifyAndSetUpAuthz(AuthorizationTestBase.java:98)
	at co.cask.cdap.security.AuthorizationTestBase.setUp(AuthorizationTestBase.java:84)
	at sun.reflect.NativeMethodAccessorImpl.invoke0(Native Method)
	at sun.reflect.NativeMethodAccessorImpl.invoke(NativeMethodAccessorImpl.java:62)
	at sun.reflect.DelegatingMethodAccessorImpl.invoke(DelegatingMethodAccessorImpl.java:43)
	at java.lang.reflect.Method.invoke(Method.java:498)
	at org.junit.runners.model.FrameworkMethod$1.runReflectiveCall(FrameworkMethod.java:47)
(38 more lines...)
java.lang.NullPointerException: null
	at co.cask.cdap.security.AuthorizationTestBase.verifyAndSetUpAuthz(AuthorizationTestBase.java:98)
	at co.cask.cdap.security.AuthorizationTestBase.setUp(AuthorizationTestBase.java:84)
	at sun.reflect.GeneratedMethodAccessor2.invoke(Unknown Source)
	at sun.reflect.DelegatingMethodAccessorImpl.invoke(DelegatingMethodAccessorImpl.java:43)
	at java.lang.reflect.Method.invoke(Method.java:498)
	at org.junit.runners.model.FrameworkMethod$1.runReflectiveCall(FrameworkMethod.java:47)
	at org.junit.internal.runners.model.ReflectiveCallable.run(ReflectiveCallable.java:12)
(37 more lines...)
java.lang.NullPointerException: null
	at co.cask.cdap.security.AuthorizationTestBase.verifyAndSetUpAuthz(AuthorizationTestBase.java:98)
	at co.cask.cdap.security.AuthorizationTestBase.setUp(AuthorizationTestBase.java:84)
	at sun.reflect.NativeMethodAccessorImpl.invoke0(Native Method)
	at sun.reflect.NativeMethodAccessorImpl.invoke(NativeMethodAccessorImpl.java:62)
	at sun.reflect.DelegatingMethodAccessorImpl.invoke(DelegatingMethodAccessorImpl.java:43)
	at java.lang.reflect.Method.invoke(Method.java:498)
	at org.junit.runners.model.FrameworkMethod$1.runReflectiveCall(FrameworkMethod.java:47)
(38 more lines...)
java.lang.NullPointerException: null
	at co.cask.cdap.security.AuthorizationTestBase.verifyAndSetUpAuthz(AuthorizationTestBase.java:98)
	at co.cask.cdap.security.AuthorizationTestBase.setUp(AuthorizationTestBase.java:84)
	at sun.reflect.GeneratedMethodAccessor2.invoke(Unknown Source)
	at sun.reflect.DelegatingMethodAccessorImpl.invoke(DelegatingMethodAccessorImpl.java:43)
	at java.lang.reflect.Method.invoke(Method.java:498)
	at org.junit.runners.model.FrameworkMethod$1.runReflectiveCall(FrameworkMethod.java:47)
	at org.junit.internal.runners.model.ReflectiveCallable.run(ReflectiveCallable.java:12)
(37 more lines...)
java.lang.NullPointerException: null
	at co.cask.cdap.security.AuthorizationTestBase.verifyAndSetUpAuthz(AuthorizationTestBase.java:98)
	at co.cask.cdap.security.AuthorizationTestBase.setUp(AuthorizationTestBase.java:84)
	at sun.reflect.GeneratedMethodAccessor2.invoke(Unknown Source)
	at sun.reflect.DelegatingMethodAccessorImpl.invoke(DelegatingMethodAccessorImpl.java:43)
	at java.lang.reflect.Method.invoke(Method.java:498)
	at org.junit.runners.model.FrameworkMethod$1.runReflectiveCall(FrameworkMethod.java:47)
	at org.junit.internal.runners.model.ReflectiveCallable.run(ReflectiveCallable.java:12)
(37 more lines...)
java.lang.NullPointerException: null
	at co.cask.cdap.security.AuthorizationTestBase.verifyAndSetUpAuthz(AuthorizationTestBase.java:98)
	at co.cask.cdap.security.AuthorizationTestBase.setUp(AuthorizationTestBase.java:84)
	at sun.reflect.GeneratedMethodAccessor2.invoke(Unknown Source)
	at sun.reflect.DelegatingMethodAccessorImpl.invoke(DelegatingMethodAccessorImpl.java:43)
	at java.lang.reflect.Method.invoke(Method.java:498)
	at org.junit.runners.model.FrameworkMethod$1.runReflectiveCall(FrameworkMethod.java:47)
	at org.junit.internal.runners.model.ReflectiveCallable.run(ReflectiveCallable.java:12)
(37 more lines...)
java.lang.NullPointerException: null
	at co.cask.cdap.security.AuthorizationTestBase.verifyAndSetUpAuthz(AuthorizationTestBase.java:98)
	at co.cask.cdap.security.AuthorizationTestBase.setUp(AuthorizationTestBase.java:84)
	at sun.reflect.GeneratedMethodAccessor2.invoke(Unknown Source)
	at sun.reflect.DelegatingMethodAccessorImpl.invoke(DelegatingMethodAccessorImpl.java:43)
	at java.lang.reflect.Method.invoke(Method.java:498)
	at org.junit.runners.model.FrameworkMethod$1.runReflectiveCall(FrameworkMethod.java:47)
	at org.junit.internal.runners.model.ReflectiveCallable.run(ReflectiveCallable.java:12)
(37 more lines...)
java.lang.NullPointerException: null
	at co.cask.cdap.security.AuthorizationTestBase.verifyAndSetUpAuthz(AuthorizationTestBase.java:98)
	at co.cask.cdap.security.AuthorizationTestBase.setUp(AuthorizationTestBase.java:84)
	at sun.reflect.GeneratedMethodAccessor2.invoke(Unknown Source)
	at sun.reflect.DelegatingMethodAccessorImpl.invoke(DelegatingMethodAccessorImpl.java:43)
	at java.lang.reflect.Method.invoke(Method.java:498)
	at org.junit.runners.model.FrameworkMethod$1.runReflectiveCall(FrameworkMethod.java:47)
	at org.junit.internal.runners.model.ReflectiveCallable.run(ReflectiveCallable.java:12)
(37 more lines...)
java.lang.NullPointerException: null
	at co.cask.cdap.security.AuthorizationTestBase.verifyAndSetUpAuthz(AuthorizationTestBase.java:98)
	at co.cask.cdap.security.AuthorizationTestBase.setUp(AuthorizationTestBase.java:84)
	at sun.reflect.GeneratedMethodAccessor2.invoke(Unknown Source)
	at sun.reflect.DelegatingMethodAccessorImpl.invoke(DelegatingMethodAccessorImpl.java:43)
	at java.lang.reflect.Method.invoke(Method.java:498)
	at org.junit.runners.model.FrameworkMethod$1.runReflectiveCall(FrameworkMethod.java:47)
	at org.junit.internal.runners.model.ReflectiveCallable.run(ReflectiveCallable.java:12)
(37 more lines...)
java.lang.NullPointerException: null
	at co.cask.cdap.security.AuthorizationTestBase.verifyAndSetUpAuthz(AuthorizationTestBase.java:98)
	at co.cask.cdap.security.AuthorizationTestBase.setUp(AuthorizationTestBase.java:84)
	at sun.reflect.GeneratedMethodAccessor2.invoke(Unknown Source)
	at sun.reflect.DelegatingMethodAccessorImpl.invoke(DelegatingMethodAccessorImpl.java:43)
	at java.lang.reflect.Method.invoke(Method.java:498)
	at org.junit.runners.model.FrameworkMethod$1.runReflectiveCall(FrameworkMethod.java:47)
	at org.junit.internal.runners.model.ReflectiveCallable.run(ReflectiveCallable.java:12)
(37 more lines...)
java.lang.NullPointerException: null
	at co.cask.cdap.security.AuthorizationTestBase.verifyAndSetUpAuthz(AuthorizationTestBase.java:98)
	at co.cask.cdap.security.AuthorizationTestBase.setUp(AuthorizationTestBase.java:84)
	at sun.reflect.GeneratedMethodAccessor2.invoke(Unknown Source)
	at sun.reflect.DelegatingMethodAccessorImpl.invoke(DelegatingMethodAccessorImpl.java:43)
	at java.lang.reflect.Method.invoke(Method.java:498)
	at org.junit.runners.model.FrameworkMethod$1.runReflectiveCall(FrameworkMethod.java:47)
	at org.junit.internal.runners.model.ReflectiveCallable.run(ReflectiveCallable.java:12)
(37 more lines...)
java.lang.NullPointerException: null
	at co.cask.cdap.security.AuthorizationTestBase.verifyAndSetUpAuthz(AuthorizationTestBase.java:98)
	at co.cask.cdap.security.AuthorizationTestBase.setUp(AuthorizationTestBase.java:84)
	at sun.reflect.GeneratedMethodAccessor2.invoke(Unknown Source)
	at sun.reflect.DelegatingMethodAccessorImpl.invoke(DelegatingMethodAccessorImpl.java:43)
	at java.lang.reflect.Method.invoke(Method.java:498)
	at org.junit.runners.model.FrameworkMethod$1.runReflectiveCall(FrameworkMethod.java:47)
	at org.junit.internal.runners.model.ReflectiveCallable.run(ReflectiveCallable.java:12)
(37 more lines...)
java.lang.NullPointerException: null
	at co.cask.cdap.security.AuthorizationTestBase.verifyAndSetUpAuthz(AuthorizationTestBase.java:98)
	at co.cask.cdap.security.AuthorizationTestBase.setUp(AuthorizationTestBase.java:84)
	at sun.reflect.GeneratedMethodAccessor2.invoke(Unknown Source)
	at sun.reflect.DelegatingMethodAccessorImpl.invoke(DelegatingMethodAccessorImpl.java:43)
	at java.lang.reflect.Method.invoke(Method.java:498)
	at org.junit.runners.model.FrameworkMethod$1.runReflectiveCall(FrameworkMethod.java:47)
	at org.junit.internal.runners.model.ReflectiveCallable.run(ReflectiveCallable.java:12)
(37 more lines...)
java.lang.NullPointerException: null
	at co.cask.cdap.security.AuthorizationTestBase.verifyAndSetUpAuthz(AuthorizationTestBase.java:98)
	at co.cask.cdap.security.AuthorizationTestBase.setUp(AuthorizationTestBase.java:84)
	at sun.reflect.GeneratedMethodAccessor2.invoke(Unknown Source)
	at sun.reflect.DelegatingMethodAccessorImpl.invoke(DelegatingMethodAccessorImpl.java:43)
	at java.lang.reflect.Method.invoke(Method.java:498)
	at org.junit.runners.model.FrameworkMethod$1.runReflectiveCall(FrameworkMethod.java:47)
	at org.junit.internal.runners.model.ReflectiveCallable.run(ReflectiveCallable.java:12)
(37 more lines...)
java.lang.NullPointerException: null
	at co.cask.cdap.security.AuthorizationTestBase.verifyAndSetUpAuthz(AuthorizationTestBase.java:98)
	at co.cask.cdap.security.AuthorizationTestBase.setUp(AuthorizationTestBase.java:84)
	at sun.reflect.GeneratedMethodAccessor2.invoke(Unknown Source)
	at sun.reflect.DelegatingMethodAccessorImpl.invoke(DelegatingMethodAccessorImpl.java:43)
	at java.lang.reflect.Method.invoke(Method.java:498)
	at org.junit.runners.model.FrameworkMethod$1.runReflectiveCall(FrameworkMethod.java:47)
	at org.junit.internal.runners.model.ReflectiveCallable.run(ReflectiveCallable.java:12)
(37 more lines...)
java.lang.NullPointerException: null
	at co.cask.cdap.security.AuthorizationTestBase.verifyAndSetUpAuthz(AuthorizationTestBase.java:98)
	at co.cask.cdap.security.AuthorizationTestBase.setUp(AuthorizationTestBase.java:84)
	at sun.reflect.GeneratedMethodAccessor2.invoke(Unknown Source)
	at sun.reflect.DelegatingMethodAccessorImpl.invoke(DelegatingMethodAccessorImpl.java:43)
	at java.lang.reflect.Method.invoke(Method.java:498)
	at org.junit.runners.model.FrameworkMethod$1.runReflectiveCall(FrameworkMethod.java:47)
	at org.junit.internal.runners.model.ReflectiveCallable.run(ReflectiveCallable.java:12)
(37 more lines...)
java.lang.NullPointerException: null
	at co.cask.cdap.security.AuthorizationTestBase.verifyAndSetUpAuthz(AuthorizationTestBase.java:98)
	at co.cask.cdap.security.AuthorizationTestBase.setUp(AuthorizationTestBase.java:84)
	at sun.reflect.GeneratedMethodAccessor2.invoke(Unknown Source)
	at sun.reflect.DelegatingMethodAccessorImpl.invoke(DelegatingMethodAccessorImpl.java:43)
	at java.lang.reflect.Method.invoke(Method.java:498)
	at org.junit.runners.model.FrameworkMethod$1.runReflectiveCall(FrameworkMethod.java:47)
	at org.junit.internal.runners.model.ReflectiveCallable.run(ReflectiveCallable.java:12)
(37 more lines...)
java.lang.NullPointerException: null
	at co.cask.cdap.security.AuthorizationTestBase.verifyAndSetUpAuthz(AuthorizationTestBase.java:98)
	at co.cask.cdap.security.AuthorizationTestBase.setUp(AuthorizationTestBase.java:84)
	at sun.reflect.GeneratedMethodAccessor2.invoke(Unknown Source)
	at sun.reflect.DelegatingMethodAccessorImpl.invoke(DelegatingMethodAccessorImpl.java:43)
	at java.lang.reflect.Method.invoke(Method.java:498)
	at org.junit.runners.model.FrameworkMethod$1.runReflectiveCall(FrameworkMethod.java:47)
	at org.junit.internal.runners.model.ReflectiveCallable.run(ReflectiveCallable.java:12)
(37 more lines...)
java.lang.NullPointerException: null
	at co.cask.cdap.security.AuthorizationTestBase.verifyAndSetUpAuthz(AuthorizationTestBase.java:98)
	at co.cask.cdap.security.AuthorizationTestBase.setUp(AuthorizationTestBase.java:84)
	at sun.reflect.GeneratedMethodAccessor2.invoke(Unknown Source)
	at sun.reflect.DelegatingMethodAccessorImpl.invoke(DelegatingMethodAccessorImpl.java:43)
	at java.lang.reflect.Method.invoke(Method.java:498)
	at org.junit.runners.model.FrameworkMethod$1.runReflectiveCall(FrameworkMethod.java:47)
	at org.junit.internal.runners.model.ReflectiveCallable.run(ReflectiveCallable.java:12)
(29 more lines...)