Build #13

Build: #13 failed Manual run by Yaojie Feng

Stages & jobs

  1. Variables

  2. Spinup and Test

Logs

The following logs have been generated by the jobs in this branch.
  • Expand all
  • Collapse all
Job Logs
Collapse Cloudera Manager - 5.12 Spinup and Test Download or View
24-Sep-2018 21:04:49 [INFO] integration-test-core ............................. SUCCESS [4.706s]
24-Sep-2018 21:04:49 [INFO] integration-test-remote ........................... FAILURE [10.964s]
24-Sep-2018 21:04:49 [INFO] integration-test-standalone ....................... SKIPPED
24-Sep-2018 21:04:49 [INFO] upgrade-test ...................................... SKIPPED
24-Sep-2018 21:04:49 [INFO] long-running-test ................................. SKIPPED
24-Sep-2018 21:04:49 [INFO] ------------------------------------------------------------------------
24-Sep-2018 21:04:49 [INFO] BUILD FAILURE
24-Sep-2018 21:04:49 [INFO] ------------------------------------------------------------------------
24-Sep-2018 21:04:49 [INFO] Total time: 33.113s
24-Sep-2018 21:04:49 [INFO] Finished at: Mon Sep 24 21:04:49 UTC 2018
24-Sep-2018 21:04:50 [INFO] Final Memory: 96M/912M
24-Sep-2018 21:04:50 [INFO] ------------------------------------------------------------------------
24-Sep-2018 21:04:50 [ERROR] Failed to execute goal org.apache.maven.plugins:maven-surefire-plugin:2.18.1:test (default-test) on project integration-test-remote: There are test failures.
24-Sep-2018 21:04:50 [ERROR]
24-Sep-2018 21:04:50 [ERROR] Please refer to /var/bamboo/xml-data/build-dir/IT-ITCA0-CM512/cdap-integration-tests/integration-test-remote/target/surefire-reports for the individual test results.
24-Sep-2018 21:04:50 [ERROR] -> [Help 1]
24-Sep-2018 21:04:50 [ERROR]
24-Sep-2018 21:04:50 [ERROR] To see the full stack trace of the errors, re-run Maven with the -e switch.
24-Sep-2018 21:04:50 [ERROR] Re-run Maven using the -X switch to enable full debug logging.
24-Sep-2018 21:04:50 [ERROR]
24-Sep-2018 21:04:50 [ERROR] For more information about the errors and possible solutions, please read the following articles:
24-Sep-2018 21:04:50 [ERROR] [Help 1] http://cwiki.apache.org/confluence/display/MAVEN/MojoFailureException
24-Sep-2018 21:04:50 [ERROR]
24-Sep-2018 21:04:50 [ERROR] After correcting the problems, you can resume the build with the command
24-Sep-2018 21:04:50 [ERROR]   mvn <goals> -rf :integration-test-remote