Build #7

Build: #7 failed Manual run by Rohit Sinha

Stages & jobs

  1. Variables

  2. Spinup and Test

Build result summary

Details

Completed
Duration
100 minutes
Labels
None
Revisions
caskdata/cdap-integration-tests
b7b16296f19e6ebb4e0a680cfcd2c99d02b773ed b7b16296f19e6ebb4e0a680cfcd2c99d02b773ed
caskdata/coopr-internal
36b1c5c59bf8e8aae9b59c613750368fe8a07c27 36b1c5c59bf8e8aae9b59c613750368fe8a07c27
Total tests
33
Failing since
#1 (Manual run by Matt Wuenschel)

Responsible

This build has been failing since #1
No one has taken responsibility

Code commits

caskdata/coopr-internal
Author Commit Message Commit date
dereklwood <derekwood@google.com> dereklwood <derekwood@google.com> 36b1c5c59bf8e8aae9b59c613750368fe8a07c27 36b1c5c59bf8e8aae9b59c613750368fe8a07c27 Merge pull request #718 from caskdata/feature/update-oracle-jdk
update to latest jdk
Derek Wood <derekwood@google.com> Derek Wood <derekwood@google.com> c8675d2bf28396808572c24c7d519f54f31e8320 c8675d2bf28396808572c24c7d519f54f31e8320 update to latest jdk

Tests

New test failures 2
Status Test View job Duration
Collapse Failed AppImpersonationAuthorizationTest testDeployApp History
Cloudera Manager - 5.12 36 secs
java.io.IOException: 500: Error while creating home directory 'hdfs://it-itca-cm512-7-34834-1000.coopr.sh:8020/cdap/namespaces/authorization' for namespace 'namespace:authorization': mkdirs() returned false
	at co.cask.cdap.client.util.RESTClient.execute(RESTClient.java:132)
	at co.cask.cdap.client.util.RESTClient.execute(RESTClient.java:69)
	at co.cask.cdap.client.NamespaceClient.execute(NamespaceClient.java:56)
	at co.cask.cdap.common.namespace.AbstractNamespaceClient.create(AbstractNamespaceClient.java:58)
	at co.cask.cdap.security.AuthorizationTestBase.createAndRegisterNamespace(AuthorizationTestBase.java:135)
	at co.cask.cdap.security.BasicAppAuthorizationTest.testDeployApp(BasicAppAuthorizationTest.java:294)
	at sun.reflect.NativeMethodAccessorImpl.invoke0(Native Method)
(43 more lines...)
Collapse Failed AppImpersonationAuthorizationTest testDeployAppUnauthorized History
Cloudera Manager - 5.12 36 secs
java.io.IOException: 500: Error while creating home directory 'hdfs://it-itca-cm512-7-34834-1000.coopr.sh:8020/cdap/namespaces/authorization' for namespace 'namespace:authorization': mkdirs() returned false
	at co.cask.cdap.client.util.RESTClient.execute(RESTClient.java:132)
	at co.cask.cdap.client.util.RESTClient.execute(RESTClient.java:69)
	at co.cask.cdap.client.NamespaceClient.execute(NamespaceClient.java:56)
	at co.cask.cdap.common.namespace.AbstractNamespaceClient.create(AbstractNamespaceClient.java:58)
	at co.cask.cdap.security.AuthorizationTestBase.createAndRegisterNamespace(AuthorizationTestBase.java:135)
	at co.cask.cdap.security.BasicAppAuthorizationTest.testDeployAppUnauthorized(BasicAppAuthorizationTest.java:364)
	at sun.reflect.NativeMethodAccessorImpl.invoke0(Native Method)
(43 more lines...)
Existing test failures 12
Status Test Failing since View job Duration
java.io.IOException: 500: Error while creating home directory 'hdfs://it-itca-cm512-7-34834-1000.coopr.sh:8020/cdap/namespaces/authorization' for namespace 'namespace:authorization': mkdirs() returned false
	at co.cask.cdap.client.util.RESTClient.execute(RESTClient.java:132)
	at co.cask.cdap.client.util.RESTClient.execute(RESTClient.java:69)
	at co.cask.cdap.client.NamespaceClient.execute(NamespaceClient.java:56)
	at co.cask.cdap.common.namespace.AbstractNamespaceClient.create(AbstractNamespaceClient.java:58)
	at co.cask.cdap.security.AuthorizationTestBase.createAndRegisterNamespace(AuthorizationTestBase.java:135)
	at co.cask.cdap.security.BasicAppAuthorizationTest.testRunningFlowAndExploreStreams(BasicAppAuthorizationTest.java:174)
	at sun.reflect.NativeMethodAccessorImpl.invoke0(Native Method)
(43 more lines...)
java.util.concurrent.TimeoutException: Timeout occurred. Expected true but found false.
	at co.cask.cdap.common.utils.Tasks.waitFor(Tasks.java:70)
	at co.cask.cdap.common.utils.Tasks.waitFor(Tasks.java:91)
	at co.cask.cdap.common.utils.Tasks.waitFor(Tasks.java:130)
	at co.cask.cdap.test.AbstractProgramManager.waitForRuns(AbstractProgramManager.java:81)
	at co.cask.cdap.test.AbstractProgramManager.waitForRun(AbstractProgramManager.java:75)
	at co.cask.cdap.security.BasicAppAuthorizationTest.testDeployApp(BasicAppAuthorizationTest.java:342)
java.util.concurrent.ExecutionException: co.cask.cdap.explore.service.ExploreException: Cannot execute query. Reason: Response code: 400, message: 'Bad Request', body: '[SQLState 42S02] Error while compiling statement: FAILED: SemanticException [Error 10001]: Line 1:14 Table not found 'stream_who''
	at com.google.common.util.concurrent.AbstractFuture.getDoneValue(AbstractFuture.java:500)
	at com.google.common.util.concurrent.AbstractFuture.get(AbstractFuture.java:479)
	at co.cask.cdap.security.BasicAppAuthorizationTest.testRunningFlowAndExploreStreams(BasicAppAuthorizationTest.java:206)
	at sun.reflect.NativeMethodAccessorImpl.invoke0(Native Method)
	at sun.reflect.NativeMethodAccessorImpl.invoke(NativeMethodAccessorImpl.java:62)
	at sun.reflect.DelegatingMethodAccessorImpl.invoke(DelegatingMethodAccessorImpl.java:43)
	at java.lang.reflect.Method.invoke(Method.java:498)
(58 more lines...)
java.io.IOException: 500: Error while creating home directory 'hdfs://it-itca-cm512-7-34834-1000.coopr.sh:8020/cdap/namespaces/authorization11' for namespace 'namespace:authorization11': mkdirs() returned false
	at co.cask.cdap.client.util.RESTClient.execute(RESTClient.java:132)
	at co.cask.cdap.client.util.RESTClient.execute(RESTClient.java:69)
	at co.cask.cdap.client.NamespaceClient.execute(NamespaceClient.java:56)
	at co.cask.cdap.common.namespace.AbstractNamespaceClient.create(AbstractNamespaceClient.java:58)
	at co.cask.cdap.security.AuthorizationTestBase.createAndRegisterNamespace(AuthorizationTestBase.java:135)
	at co.cask.cdap.security.BasicAppAuthorizationTest.testDatasetInProgram(BasicAppAuthorizationTest.java:452)
	at sun.reflect.NativeMethodAccessorImpl.invoke0(Native Method)
(43 more lines...)
java.io.IOException: 500: Error while creating home directory 'hdfs://it-itca-cm512-7-34834-1000.coopr.sh:8020/cdap/namespaces/authorization' for namespace 'namespace:authorization': mkdirs() returned false
	at co.cask.cdap.client.util.RESTClient.execute(RESTClient.java:132)
	at co.cask.cdap.client.util.RESTClient.execute(RESTClient.java:69)
	at co.cask.cdap.client.NamespaceClient.execute(NamespaceClient.java:56)
	at co.cask.cdap.common.namespace.AbstractNamespaceClient.create(AbstractNamespaceClient.java:58)
	at co.cask.cdap.security.AuthorizationTestBase.createAndRegisterNamespace(AuthorizationTestBase.java:135)
	at co.cask.cdap.security.BasicAppAuthorizationTest.testRunningFlowAndExploreStreams(BasicAppAuthorizationTest.java:174)
	at sun.reflect.NativeMethodAccessorImpl.invoke0(Native Method)
(43 more lines...)
java.io.IOException: 500: Error while creating home directory 'hdfs://it-itca-cm512-7-34834-1000.coopr.sh:8020/cdap/namespaces/authorization' for namespace 'namespace:authorization': mkdirs() returned false
	at co.cask.cdap.client.util.RESTClient.execute(RESTClient.java:132)
	at co.cask.cdap.client.util.RESTClient.execute(RESTClient.java:69)
	at co.cask.cdap.client.NamespaceClient.execute(NamespaceClient.java:56)
	at co.cask.cdap.common.namespace.AbstractNamespaceClient.create(AbstractNamespaceClient.java:58)
	at co.cask.cdap.security.AuthorizationTestBase.createAndRegisterNamespace(AuthorizationTestBase.java:135)
	at co.cask.cdap.security.BasicAppAuthorizationTest.testDeployAppUnauthorized(BasicAppAuthorizationTest.java:364)
	at sun.reflect.NativeMethodAccessorImpl.invoke0(Native Method)
(43 more lines...)
java.io.IOException: 500: Error while creating home directory 'hdfs://it-itca-cm512-7-34834-1000.coopr.sh:8020/cdap/namespaces/authorization' for namespace 'namespace:authorization': mkdirs() returned false
	at co.cask.cdap.client.util.RESTClient.execute(RESTClient.java:132)
	at co.cask.cdap.client.util.RESTClient.execute(RESTClient.java:69)
	at co.cask.cdap.client.NamespaceClient.execute(NamespaceClient.java:56)
	at co.cask.cdap.common.namespace.AbstractNamespaceClient.create(AbstractNamespaceClient.java:58)
	at co.cask.cdap.security.AuthorizationTestBase.createAndRegisterNamespace(AuthorizationTestBase.java:135)
	at co.cask.cdap.security.BasicAppAuthorizationTest.testDeployApp(BasicAppAuthorizationTest.java:294)
	at sun.reflect.NativeMethodAccessorImpl.invoke0(Native Method)
(43 more lines...)
java.io.IOException: 500: Error while creating home directory 'hdfs://it-itca-cm512-7-34834-1000.coopr.sh:8020/cdap/namespaces/authorization' for namespace 'namespace:authorization': mkdirs() returned false
	at co.cask.cdap.client.util.RESTClient.execute(RESTClient.java:132)
	at co.cask.cdap.client.util.RESTClient.execute(RESTClient.java:69)
	at co.cask.cdap.client.NamespaceClient.execute(NamespaceClient.java:56)
	at co.cask.cdap.common.namespace.AbstractNamespaceClient.create(AbstractNamespaceClient.java:58)
	at co.cask.cdap.security.AuthorizationTestBase.createAndRegisterNamespace(AuthorizationTestBase.java:135)
	at co.cask.cdap.security.BasicAuthorizationTest.testDatasetPrivileges(BasicAuthorizationTest.java:363)
	at sun.reflect.NativeMethodAccessorImpl.invoke0(Native Method)
(43 more lines...)
java.io.IOException: 500: Error while creating home directory 'hdfs://it-itca-cm512-7-34834-1000.coopr.sh:8020/cdap/namespaces/authorization' for namespace 'namespace:authorization': mkdirs() returned false
	at co.cask.cdap.client.util.RESTClient.execute(RESTClient.java:132)
	at co.cask.cdap.client.util.RESTClient.execute(RESTClient.java:69)
	at co.cask.cdap.client.NamespaceClient.execute(NamespaceClient.java:56)
	at co.cask.cdap.common.namespace.AbstractNamespaceClient.create(AbstractNamespaceClient.java:58)
	at co.cask.cdap.security.AuthorizationTestBase.createAndRegisterNamespace(AuthorizationTestBase.java:135)
	at co.cask.cdap.security.BasicAuthorizationTest.testStreamPrivileges(BasicAuthorizationTest.java:449)
	at sun.reflect.NativeMethodAccessorImpl.invoke0(Native Method)
(43 more lines...)
java.io.IOException: 500: Error while creating home directory 'hdfs://it-itca-cm512-7-34834-1000.coopr.sh:8020/cdap/namespaces/authorization' for namespace 'namespace:authorization': mkdirs() returned false
	at co.cask.cdap.client.util.RESTClient.execute(RESTClient.java:132)
	at co.cask.cdap.client.util.RESTClient.execute(RESTClient.java:69)
	at co.cask.cdap.client.NamespaceClient.execute(NamespaceClient.java:56)
	at co.cask.cdap.common.namespace.AbstractNamespaceClient.create(AbstractNamespaceClient.java:58)
	at co.cask.cdap.security.AuthorizationTestBase.createAndRegisterNamespace(AuthorizationTestBase.java:135)
	at co.cask.cdap.security.BasicAuthorizationTest.testNamespacePrivileges(BasicAuthorizationTest.java:105)
	at sun.reflect.NativeMethodAccessorImpl.invoke0(Native Method)
(43 more lines...)
java.io.IOException: 500: Error while creating home directory 'hdfs://it-itca-cm512-7-34834-1000.coopr.sh:8020/cdap/namespaces/authorization' for namespace 'namespace:authorization': mkdirs() returned false
	at co.cask.cdap.client.util.RESTClient.execute(RESTClient.java:132)
	at co.cask.cdap.client.util.RESTClient.execute(RESTClient.java:69)
	at co.cask.cdap.client.NamespaceClient.execute(NamespaceClient.java:56)
	at co.cask.cdap.common.namespace.AbstractNamespaceClient.create(AbstractNamespaceClient.java:58)
	at co.cask.cdap.security.AuthorizationTestBase.createAndRegisterNamespace(AuthorizationTestBase.java:135)
	at co.cask.cdap.security.BasicAuthorizationTest.createAndDeleteNamespace(BasicAuthorizationTest.java:548)
	at co.cask.cdap.security.BasicAuthorizationTest.testDeleteNamespaceWithDifferentClients(BasicAuthorizationTest.java:538)
(44 more lines...)
java.io.IOException: 500: Error while creating home directory 'hdfs://it-itca-cm512-7-34834-1000.coopr.sh:8020/cdap/namespaces/authorization' for namespace 'namespace:authorization': mkdirs() returned false
	at co.cask.cdap.client.util.RESTClient.execute(RESTClient.java:132)
	at co.cask.cdap.client.util.RESTClient.execute(RESTClient.java:69)
	at co.cask.cdap.client.NamespaceClient.execute(NamespaceClient.java:56)
	at co.cask.cdap.common.namespace.AbstractNamespaceClient.create(AbstractNamespaceClient.java:58)
	at co.cask.cdap.security.AuthorizationTestBase.createAndRegisterNamespace(AuthorizationTestBase.java:135)
	at co.cask.cdap.security.NamespaceImpersonationBasicAuthorizationTest.testCreateNamespaceWithDifferentOwners(NamespaceImpersonationBasicAuthorizationTest.java:63)
Fixed tests 18
Status Test Failing since View job Duration
Successful BasicAppAuthorizationTest testDatasetInProgram History
Failing since build #3 (Manual run by Rohit Sinha) Cloudera Manager - 5.12 4 mins
Successful BasicAppAuthorizationTest testDeployAppUnauthorized History
Failing since build #3 (Manual run by Rohit Sinha) Cloudera Manager - 5.12 36 secs
Successful BasicAppAuthorizationTest testRunningFlowAndExploreStreams History
Failing since build #3 (Manual run by Rohit Sinha) Cloudera Manager - 5.12 3 mins
Successful BasicAuthorizationTest testStreamPrivileges History
Failing since build #3 (Manual run by Rohit Sinha) Cloudera Manager - 5.12 40 secs
Successful BasicAuthorizationTest testNamespacePrivileges History
Failing since build #3 (Manual run by Rohit Sinha) Cloudera Manager - 5.12 38 secs
Successful BasicAuthorizationTest testDatasetPrivileges History
Failing since build #3 (Manual run by Rohit Sinha) Cloudera Manager - 5.12 51 secs
Successful BasicAuthorizationTest testDeleteNamespaceWithDifferentClients History
Failing since build #3 (Manual run by Rohit Sinha) Cloudera Manager - 5.12 38 secs
Successful BasicAuthorizationTest testPrivilegesAndVisibility History
Failing since build #3 (Manual run by Rohit Sinha) Cloudera Manager - 5.12 1 min
Successful CustomMappingAppAuthorizationTest testDatasetInProgram History
Failing since build #3 (Manual run by Rohit Sinha) Cloudera Manager - 5.12 4 mins
Successful CustomMappingAppAuthorizationTest testDeployAppUnauthorized History
Failing since build #3 (Manual run by Rohit Sinha) Cloudera Manager - 5.12 36 secs
Successful CustomMappingAppAuthorizationTest testDeployApp History
Failing since build #3 (Manual run by Rohit Sinha) Cloudera Manager - 5.12 4 mins
Successful CustomMappingBasicAuthorizationTest testDeleteNamespaceWithDifferentClients History
Failing since build #3 (Manual run by Rohit Sinha) Cloudera Manager - 5.12 36 secs
Successful CustomMappingBasicAuthorizationTest testNamespacePrivileges History
Failing since build #3 (Manual run by Rohit Sinha) Cloudera Manager - 5.12 38 secs
Successful CustomMappingBasicAuthorizationTest testPrivilegesAndVisibility History
Failing since build #3 (Manual run by Rohit Sinha) Cloudera Manager - 5.12 1 min
Successful CustomMappingBasicAuthorizationTest testStreamPrivileges History
Failing since build #3 (Manual run by Rohit Sinha) Cloudera Manager - 5.12 37 secs
Successful CustomMappingBasicAuthorizationTest testDatasetPrivileges History
Failing since build #3 (Manual run by Rohit Sinha) Cloudera Manager - 5.12 51 secs
Successful NamespaceImpersonationBasicAuthorizationTest testPrivilegesAndVisibility History
Failing since build #3 (Manual run by Rohit Sinha) Cloudera Manager - 5.12 1 min
Successful SentryBasicAuthorizationTest testRoleBasedStreamPrivileges History
Failing since build #3 (Manual run by Rohit Sinha) Cloudera Manager - 5.12 42 secs