Build #12

Build: #12 failed Manual run by Rohit Sinha

Stages & jobs

  1. Variables

  2. Spinup and Test

Build result summary

Details

Completed
Duration
105 minutes
Labels
None
Revisions
caskdata/cdap-integration-tests
edd90d16eae28f961d9eda1321924aca45f09600 edd90d16eae28f961d9eda1321924aca45f09600
caskdata/coopr-internal
3aae2578937e4455255531f41b1357eb97c48096 3aae2578937e4455255531f41b1357eb97c48096
Total tests
33
Failing since
#1 (Manual run by Matt Wuenschel)

Responsible

This build has been failing since #1
No one has taken responsibility

Tests

Existing test failures 14
Status Test Failing since View job Duration
java.io.IOException: 500: Error while creating home directory 'hdfs://it-itca-cm512-12-35717-1000.coopr.sh:8020/cdap/namespaces/authorization' for namespace 'namespace:authorization': mkdirs() returned false
	at co.cask.cdap.client.util.RESTClient.execute(RESTClient.java:132)
	at co.cask.cdap.client.util.RESTClient.execute(RESTClient.java:69)
	at co.cask.cdap.client.NamespaceClient.execute(NamespaceClient.java:56)
	at co.cask.cdap.common.namespace.AbstractNamespaceClient.create(AbstractNamespaceClient.java:58)
	at co.cask.cdap.security.AuthorizationTestBase.createAndRegisterNamespace(AuthorizationTestBase.java:135)
	at co.cask.cdap.security.BasicAppAuthorizationTest.testDeployApp(BasicAppAuthorizationTest.java:294)
	at sun.reflect.NativeMethodAccessorImpl.invoke0(Native Method)
(43 more lines...)
java.io.IOException: 500: Error while creating home directory 'hdfs://it-itca-cm512-12-35717-1000.coopr.sh:8020/cdap/namespaces/authorization' for namespace 'namespace:authorization': mkdirs() returned false
	at co.cask.cdap.client.util.RESTClient.execute(RESTClient.java:132)
	at co.cask.cdap.client.util.RESTClient.execute(RESTClient.java:69)
	at co.cask.cdap.client.NamespaceClient.execute(NamespaceClient.java:56)
	at co.cask.cdap.common.namespace.AbstractNamespaceClient.create(AbstractNamespaceClient.java:58)
	at co.cask.cdap.security.AuthorizationTestBase.createAndRegisterNamespace(AuthorizationTestBase.java:135)
	at co.cask.cdap.security.BasicAppAuthorizationTest.testDeployAppUnauthorized(BasicAppAuthorizationTest.java:364)
	at sun.reflect.NativeMethodAccessorImpl.invoke0(Native Method)
(43 more lines...)
java.io.IOException: 500: Error while creating home directory 'hdfs://it-itca-cm512-12-35717-1000.coopr.sh:8020/cdap/namespaces/authorization' for namespace 'namespace:authorization': mkdirs() returned false
	at co.cask.cdap.client.util.RESTClient.execute(RESTClient.java:132)
	at co.cask.cdap.client.util.RESTClient.execute(RESTClient.java:69)
	at co.cask.cdap.client.NamespaceClient.execute(NamespaceClient.java:56)
	at co.cask.cdap.common.namespace.AbstractNamespaceClient.create(AbstractNamespaceClient.java:58)
	at co.cask.cdap.security.AuthorizationTestBase.createAndRegisterNamespace(AuthorizationTestBase.java:135)
	at co.cask.cdap.security.BasicAppAuthorizationTest.testRunningFlowAndExploreStreams(BasicAppAuthorizationTest.java:174)
	at sun.reflect.NativeMethodAccessorImpl.invoke0(Native Method)
(43 more lines...)
java.util.concurrent.TimeoutException: Timeout occurred. Expected true but found false.
	at co.cask.cdap.common.utils.Tasks.waitFor(Tasks.java:70)
	at co.cask.cdap.common.utils.Tasks.waitFor(Tasks.java:91)
	at co.cask.cdap.common.utils.Tasks.waitFor(Tasks.java:130)
	at co.cask.cdap.test.AbstractProgramManager.waitForRuns(AbstractProgramManager.java:96)
	at co.cask.cdap.test.AbstractProgramManager.waitForRun(AbstractProgramManager.java:90)
	at co.cask.cdap.security.BasicAppAuthorizationTest.testDeployApp(BasicAppAuthorizationTest.java:342)
java.util.concurrent.ExecutionException: co.cask.cdap.explore.service.ExploreException: Cannot execute query. Reason: Response code: 400, message: 'Bad Request', body: '[SQLState 42S02] Error while compiling statement: FAILED: SemanticException [Error 10001]: Line 1:14 Table not found 'stream_who''
	at com.google.common.util.concurrent.AbstractFuture.getDoneValue(AbstractFuture.java:500)
	at com.google.common.util.concurrent.AbstractFuture.get(AbstractFuture.java:479)
	at co.cask.cdap.security.BasicAppAuthorizationTest.testRunningFlowAndExploreStreams(BasicAppAuthorizationTest.java:206)
	at sun.reflect.NativeMethodAccessorImpl.invoke0(Native Method)
	at sun.reflect.NativeMethodAccessorImpl.invoke(NativeMethodAccessorImpl.java:62)
	at sun.reflect.DelegatingMethodAccessorImpl.invoke(DelegatingMethodAccessorImpl.java:43)
	at java.lang.reflect.Method.invoke(Method.java:498)
(58 more lines...)
java.io.IOException: 500: Error while creating home directory 'hdfs://it-itca-cm512-12-35717-1000.coopr.sh:8020/cdap/namespaces/authorization11' for namespace 'namespace:authorization11': mkdirs() returned false
	at co.cask.cdap.client.util.RESTClient.execute(RESTClient.java:132)
	at co.cask.cdap.client.util.RESTClient.execute(RESTClient.java:69)
	at co.cask.cdap.client.NamespaceClient.execute(NamespaceClient.java:56)
	at co.cask.cdap.common.namespace.AbstractNamespaceClient.create(AbstractNamespaceClient.java:58)
	at co.cask.cdap.security.AuthorizationTestBase.createAndRegisterNamespace(AuthorizationTestBase.java:135)
	at co.cask.cdap.security.BasicAppAuthorizationTest.testDatasetInProgram(BasicAppAuthorizationTest.java:452)
	at sun.reflect.NativeMethodAccessorImpl.invoke0(Native Method)
(43 more lines...)
java.io.IOException: 500: Error while creating home directory 'hdfs://it-itca-cm512-12-35717-1000.coopr.sh:8020/cdap/namespaces/authorization' for namespace 'namespace:authorization': mkdirs() returned false
	at co.cask.cdap.client.util.RESTClient.execute(RESTClient.java:132)
	at co.cask.cdap.client.util.RESTClient.execute(RESTClient.java:69)
	at co.cask.cdap.client.NamespaceClient.execute(NamespaceClient.java:56)
	at co.cask.cdap.common.namespace.AbstractNamespaceClient.create(AbstractNamespaceClient.java:58)
	at co.cask.cdap.security.AuthorizationTestBase.createAndRegisterNamespace(AuthorizationTestBase.java:135)
	at co.cask.cdap.security.BasicAppAuthorizationTest.testRunningFlowAndExploreStreams(BasicAppAuthorizationTest.java:174)
	at sun.reflect.NativeMethodAccessorImpl.invoke0(Native Method)
(43 more lines...)
java.io.IOException: 500: Error while creating home directory 'hdfs://it-itca-cm512-12-35717-1000.coopr.sh:8020/cdap/namespaces/authorization' for namespace 'namespace:authorization': mkdirs() returned false
	at co.cask.cdap.client.util.RESTClient.execute(RESTClient.java:132)
	at co.cask.cdap.client.util.RESTClient.execute(RESTClient.java:69)
	at co.cask.cdap.client.NamespaceClient.execute(NamespaceClient.java:56)
	at co.cask.cdap.common.namespace.AbstractNamespaceClient.create(AbstractNamespaceClient.java:58)
	at co.cask.cdap.security.AuthorizationTestBase.createAndRegisterNamespace(AuthorizationTestBase.java:135)
	at co.cask.cdap.security.BasicAppAuthorizationTest.testDeployAppUnauthorized(BasicAppAuthorizationTest.java:364)
	at sun.reflect.NativeMethodAccessorImpl.invoke0(Native Method)
(43 more lines...)
java.io.IOException: 500: Error while creating home directory 'hdfs://it-itca-cm512-12-35717-1000.coopr.sh:8020/cdap/namespaces/authorization' for namespace 'namespace:authorization': mkdirs() returned false
	at co.cask.cdap.client.util.RESTClient.execute(RESTClient.java:132)
	at co.cask.cdap.client.util.RESTClient.execute(RESTClient.java:69)
	at co.cask.cdap.client.NamespaceClient.execute(NamespaceClient.java:56)
	at co.cask.cdap.common.namespace.AbstractNamespaceClient.create(AbstractNamespaceClient.java:58)
	at co.cask.cdap.security.AuthorizationTestBase.createAndRegisterNamespace(AuthorizationTestBase.java:135)
	at co.cask.cdap.security.BasicAppAuthorizationTest.testDeployApp(BasicAppAuthorizationTest.java:294)
	at sun.reflect.NativeMethodAccessorImpl.invoke0(Native Method)
(43 more lines...)
java.io.IOException: 500: Error while creating home directory 'hdfs://it-itca-cm512-12-35717-1000.coopr.sh:8020/cdap/namespaces/authorization' for namespace 'namespace:authorization': mkdirs() returned false
	at co.cask.cdap.client.util.RESTClient.execute(RESTClient.java:132)
	at co.cask.cdap.client.util.RESTClient.execute(RESTClient.java:69)
	at co.cask.cdap.client.NamespaceClient.execute(NamespaceClient.java:56)
	at co.cask.cdap.common.namespace.AbstractNamespaceClient.create(AbstractNamespaceClient.java:58)
	at co.cask.cdap.security.AuthorizationTestBase.createAndRegisterNamespace(AuthorizationTestBase.java:135)
	at co.cask.cdap.security.BasicAuthorizationTest.testStreamPrivileges(BasicAuthorizationTest.java:449)
	at sun.reflect.NativeMethodAccessorImpl.invoke0(Native Method)
(43 more lines...)
java.io.IOException: 500: Error while creating home directory 'hdfs://it-itca-cm512-12-35717-1000.coopr.sh:8020/cdap/namespaces/authorization' for namespace 'namespace:authorization': mkdirs() returned false
	at co.cask.cdap.client.util.RESTClient.execute(RESTClient.java:132)
	at co.cask.cdap.client.util.RESTClient.execute(RESTClient.java:69)
	at co.cask.cdap.client.NamespaceClient.execute(NamespaceClient.java:56)
	at co.cask.cdap.common.namespace.AbstractNamespaceClient.create(AbstractNamespaceClient.java:58)
	at co.cask.cdap.security.AuthorizationTestBase.createAndRegisterNamespace(AuthorizationTestBase.java:135)
	at co.cask.cdap.security.BasicAuthorizationTest.testNamespacePrivileges(BasicAuthorizationTest.java:105)
	at sun.reflect.NativeMethodAccessorImpl.invoke0(Native Method)
(43 more lines...)
java.io.IOException: 500: Error while creating home directory 'hdfs://it-itca-cm512-12-35717-1000.coopr.sh:8020/cdap/namespaces/authorization' for namespace 'namespace:authorization': mkdirs() returned false
	at co.cask.cdap.client.util.RESTClient.execute(RESTClient.java:132)
	at co.cask.cdap.client.util.RESTClient.execute(RESTClient.java:69)
	at co.cask.cdap.client.NamespaceClient.execute(NamespaceClient.java:56)
	at co.cask.cdap.common.namespace.AbstractNamespaceClient.create(AbstractNamespaceClient.java:58)
	at co.cask.cdap.security.AuthorizationTestBase.createAndRegisterNamespace(AuthorizationTestBase.java:135)
	at co.cask.cdap.security.BasicAuthorizationTest.createAndDeleteNamespace(BasicAuthorizationTest.java:548)
	at co.cask.cdap.security.BasicAuthorizationTest.testDeleteNamespaceWithDifferentClients(BasicAuthorizationTest.java:538)
(44 more lines...)
java.io.IOException: 500: Error while creating home directory 'hdfs://it-itca-cm512-12-35717-1000.coopr.sh:8020/cdap/namespaces/authorization' for namespace 'namespace:authorization': mkdirs() returned false
	at co.cask.cdap.client.util.RESTClient.execute(RESTClient.java:132)
	at co.cask.cdap.client.util.RESTClient.execute(RESTClient.java:69)
	at co.cask.cdap.client.NamespaceClient.execute(NamespaceClient.java:56)
	at co.cask.cdap.common.namespace.AbstractNamespaceClient.create(AbstractNamespaceClient.java:58)
	at co.cask.cdap.security.AuthorizationTestBase.createAndRegisterNamespace(AuthorizationTestBase.java:135)
	at co.cask.cdap.security.NamespaceImpersonationBasicAuthorizationTest.testCreateNamespaceWithDifferentOwners(NamespaceImpersonationBasicAuthorizationTest.java:63)
java.io.IOException: 500: Error while creating home directory 'hdfs://it-itca-cm512-12-35717-1000.coopr.sh:8020/cdap/namespaces/authorization' for namespace 'namespace:authorization': mkdirs() returned false
	at co.cask.cdap.client.util.RESTClient.execute(RESTClient.java:132)
	at co.cask.cdap.client.util.RESTClient.execute(RESTClient.java:69)
	at co.cask.cdap.client.NamespaceClient.execute(NamespaceClient.java:56)
	at co.cask.cdap.common.namespace.AbstractNamespaceClient.create(AbstractNamespaceClient.java:58)
	at co.cask.cdap.security.AuthorizationTestBase.createAndRegisterNamespace(AuthorizationTestBase.java:135)
	at co.cask.cdap.security.BasicAuthorizationTest.testDatasetPrivileges(BasicAuthorizationTest.java:363)
	at sun.reflect.NativeMethodAccessorImpl.invoke0(Native Method)
(43 more lines...)