Build #26

Build: #26 failed Scheduled

Stages & jobs

  1. Variables

  2. Spinup and Test

Logs

The following logs have been generated by the jobs in this branch.
  • Expand all
  • Collapse all
Job Logs
Collapse Cloudera Manager - 5.12 Spinup and Test Download or View
31-Jul-2018 14:26:58 [INFO] integration-test-core ............................. SUCCESS [7.397s]
31-Jul-2018 14:26:58 [INFO] integration-test-remote ........................... FAILURE [3:38:34.340s]
31-Jul-2018 14:26:58 [INFO] integration-test-standalone ....................... SKIPPED
31-Jul-2018 14:26:58 [INFO] upgrade-test ...................................... SKIPPED
31-Jul-2018 14:26:58 [INFO] long-running-test ................................. SKIPPED
31-Jul-2018 14:26:58 [INFO] ------------------------------------------------------------------------
31-Jul-2018 14:26:58 [INFO] BUILD FAILURE
31-Jul-2018 14:26:58 [INFO] ------------------------------------------------------------------------
31-Jul-2018 14:26:58 [INFO] Total time: 3:39:07.316s
31-Jul-2018 14:26:58 [INFO] Finished at: Tue Jul 31 14:26:58 UTC 2018
31-Jul-2018 14:26:58 [INFO] Final Memory: 107M/1140M
31-Jul-2018 14:26:58 [INFO] ------------------------------------------------------------------------
31-Jul-2018 14:26:58 [ERROR] Failed to execute goal org.apache.maven.plugins:maven-surefire-plugin:2.18.1:test (default-test) on project integration-test-remote: There are test failures.
31-Jul-2018 14:26:58 [ERROR]
31-Jul-2018 14:26:58 [ERROR] Please refer to /var/bamboo/xml-data/build-dir/IT-ITC1-CM512/cdap-integration-tests/integration-test-remote/target/surefire-reports for the individual test results.
31-Jul-2018 14:26:58 [ERROR] -> [Help 1]
31-Jul-2018 14:26:58 [ERROR]
31-Jul-2018 14:26:58 [ERROR] To see the full stack trace of the errors, re-run Maven with the -e switch.
31-Jul-2018 14:26:58 [ERROR] Re-run Maven using the -X switch to enable full debug logging.
31-Jul-2018 14:26:58 [ERROR]
31-Jul-2018 14:26:58 [ERROR] For more information about the errors and possible solutions, please read the following articles:
31-Jul-2018 14:26:58 [ERROR] [Help 1] http://cwiki.apache.org/confluence/display/MAVEN/MojoFailureException
31-Jul-2018 14:26:58 [ERROR]
31-Jul-2018 14:26:58 [ERROR] After correcting the problems, you can resume the build with the command
31-Jul-2018 14:26:58 [ERROR]   mvn <goals> -rf :integration-test-remote