Build #236

Build: #236 failed

Job: Cloudera Manager - 5.12 failed

Stages & jobs

  1. Variables

  2. Spinup and Test

Job result summary

Completed
Duration
248 minutes
Agent
bamboo-agent09
Revisions
caskdata/cdap-integration-tests
fd4631809e3d5d45bf3cf7f151a0e22e14abdc73 fd4631809e3d5d45bf3cf7f151a0e22e14abdc73
caskdata/coopr-internal
27d1ed069cb3acb10963f751b2bb0bd4f30a459c 27d1ed069cb3acb10963f751b2bb0bd4f30a459c
Total tests
55
Failing since
#230 (Scheduled – )
Fixed in
#240 (Scheduled)

Tests

  • 55 tests in total
  • 2 tests failed
  • 27 tests were fixed
  • 183 minutes taken in total.
Existing test failures 2
Status Test Failing since Duration
java.io.IOException: java.lang.IllegalArgumentException: No plugin of type transform and name Wrangler could be found for stage Wrangler.
	at co.cask.cdap.client.util.RESTClient.upload(RESTClient.java:160)
	at co.cask.cdap.client.ApplicationClient.deploy(ApplicationClient.java:410)
	at co.cask.cdap.test.IntegrationTestManager.deployApplication(IntegrationTestManager.java:203)
	at co.cask.cdap.test.IntegrationTestBase.deployApplication(IntegrationTestBase.java:383)
	at co.cask.cdap.app.etl.wrangler.WranglerTest.testWrangler(WranglerTest.java:177)
	at co.cask.cdap.app.etl.wrangler.WranglerTest.testWranglerMR(WranglerTest.java:81)
java.io.IOException: java.lang.IllegalArgumentException: No plugin of type transform and name Wrangler could be found for stage Wrangler.
	at co.cask.cdap.client.util.RESTClient.upload(RESTClient.java:160)
	at co.cask.cdap.client.ApplicationClient.deploy(ApplicationClient.java:410)
	at co.cask.cdap.test.IntegrationTestManager.deployApplication(IntegrationTestManager.java:203)
	at co.cask.cdap.test.IntegrationTestBase.deployApplication(IntegrationTestBase.java:383)
	at co.cask.cdap.app.etl.wrangler.WranglerTest.testWrangler(WranglerTest.java:177)
	at co.cask.cdap.app.etl.wrangler.WranglerTest.testWranglerSpark(WranglerTest.java:89)
Fixed tests 27
Status Test Failing since Duration
Successful KVTableWithProjectionTest testKVTableWithProjection History
Failing since build #230 (Scheduled) 2 mins
Successful StreamTPFSWithProjectionTest testStreamTPFSWithProjection History
Failing since build #230 (Scheduled) 5 mins
Successful BatchAggregatorTest test History
Failing since build #230 (Scheduled) 6 mins
Successful BatchCubeSinkTest test History
Failing since build #230 (Scheduled) 3 mins
Successful BatchJoinerTest testJoinerMR History
Failing since build #230 (Scheduled) 7 mins
Successful BatchJoinerTest testJoinerSpark History
Failing since build #230 (Scheduled) 5 mins
Successful ETLMapReduceTest testDAG History
Failing since build #230 (Scheduled) 3 mins
Successful ETLMapReduceTest testDAGInvalidSchema History
Failing since build #230 (Scheduled) 4 secs
Successful ETLMapReduceTest testDAGSchemaChanges History
Failing since build #230 (Scheduled) 3 mins
Successful ETLMapReduceTest testKVToKV History
Failing since build #230 (Scheduled) 4 mins
Successful ETLMapReduceTest testTableToTableWithValidations History
Failing since build #230 (Scheduled) 5 mins
Successful ExcelInputReaderTest testExcelReader History
Failing since build #230 (Scheduled) 3 mins
Successful ExcelInputReaderTest testExcelReaderReprocessFalse History
Failing since build #230 (Scheduled) 4 mins
Successful HivePluginTest testHivePlugins History
Failing since build #230 (Scheduled) 1 min
Successful NormalizeTest testNormalize History
Failing since build #230 (Scheduled) 4 mins
Successful NormalizeTest testNormalizeWithEmptyAttributeValue History
Failing since build #230 (Scheduled) 3 mins
Successful RowDenormalizerTest test History
Failing since build #230 (Scheduled) 4 mins
Successful TPFSSinkSourceTest testMR History
Failing since build #230 (Scheduled) 5 mins
Successful TPFSSinkSourceTest testSpark History
Failing since build #230 (Scheduled) 4 mins
Successful ValueMapperTest test History
Failing since build #230 (Scheduled) 4 mins
Successful XMLReaderTest testInvalidNodePathWithMoveAction History
Failing since build #230 (Scheduled) 4 mins
Successful XMLReaderTest testInvalidPatternWithDeleteAction History
Failing since build #230 (Scheduled) 3 mins
Successful XMLReaderTest testPatternWithDeleteAction History
Failing since build #230 (Scheduled) 4 mins
Successful XMLReaderTest testPreProcessingNotRequired History
Failing since build #230 (Scheduled) 4 mins
Successful XMLReaderTest testPreProcessingRequired History
Failing since build #230 (Scheduled) 4 mins
Successful DataStreamsTest testDataStreams History
Failing since build #230 (Scheduled) 3 mins
Successful WranglerServiceTest test History
Failing since build #230 (Scheduled) 1 min

Error summary

The build generated some errors. See the full build log for more details.

Warning: Permanently added '10.210.0.102' (RSA) to the list of known hosts.
Warning: Permanently added '10.210.0.102' (RSA) to the list of known hosts.
Warning: Permanently added '10.210.0.102' (RSA) to the list of known hosts.
Warning: Permanently added '10.210.0.102' (RSA) to the list of known hosts.
Warning: Permanently added '10.210.0.102' (RSA) to the list of known hosts.
Warning: Permanently added '10.210.0.102' (RSA) to the list of known hosts.
Warning: Permanently added '10.210.0.102' (RSA) to the list of known hosts.
Warning: Permanently added '10.210.0.102' (RSA) to the list of known hosts.
Warning: Permanently added '10.210.0.102' (RSA) to the list of known hosts.
Warning: Permanently added '10.210.0.102' (RSA) to the list of known hosts.
Warning: Permanently added '10.210.0.102' (RSA) to the list of known hosts.
Warning: Permanently added '10.210.0.102' (RSA) to the list of known hosts.
Warning: Permanently added '10.210.0.102' (RSA) to the list of known hosts.
Warning: Permanently added '10.210.0.102' (RSA) to the list of known hosts.
Warning: Permanently added '10.210.0.102' (RSA) to the list of known hosts.
Warning: Permanently added '10.210.0.102' (RSA) to the list of known hosts.
Java HotSpot(TM) 64-Bit Server VM warning: ignoring option MaxPermSize=128m; support was removed in 8.0
Warning:  org.apache.xerces.jaxp.SAXParserImpl$JAXPSAXParser: Property 'http://www.oracle.com/xml/jaxp/properties/entityExpansionLimit' is not recognized.
Compiler warnings:
  WARNING:  'org.apache.xerces.jaxp.SAXParserImpl: Property 'http://javax.xml.XMLConstants/property/accessExternalDTD' is not recognized.'
Warning:  org.apache.xerces.parsers.SAXParser: Feature 'http://javax.xml.XMLConstants/feature/secure-processing' is not recognized.
Warning:  org.apache.xerces.parsers.SAXParser: Property 'http://javax.xml.XMLConstants/property/accessExternalDTD' is not recognized.
Warning:  org.apache.xerces.parsers.SAXParser: Property 'http://www.oracle.com/xml/jaxp/properties/entityExpansionLimit' is not recognized.
Warning:  org.apache.xerces.jaxp.SAXParserImpl$JAXPSAXParser: Property 'http://www.oracle.com/xml/jaxp/properties/entityExpansionLimit' is not recognized.
Compiler warnings:
  WARNING:  'org.apache.xerces.jaxp.SAXParserImpl: Property 'http://javax.xml.XMLConstants/property/accessExternalDTD' is not recognized.'
Warning:  org.apache.xerces.parsers.SAXParser: Feature 'http://javax.xml.XMLConstants/feature/secure-processing' is not recognized.
Warning:  org.apache.xerces.parsers.SAXParser: Property 'http://javax.xml.XMLConstants/property/accessExternalDTD' is not recognized.
Warning:  org.apache.xerces.parsers.SAXParser: Property 'http://www.oracle.com/xml/jaxp/properties/entityExpansionLimit' is not recognized.
Warning:  org.apache.xerces.jaxp.SAXParserImpl$JAXPSAXParser: Property 'http://www.oracle.com/xml/jaxp/properties/entityExpansionLimit' is not recognized.
Compiler warnings:
  WARNING:  'org.apache.xerces.jaxp.SAXParserImpl: Property 'http://javax.xml.XMLConstants/property/accessExternalDTD' is not recognized.'
Warning:  org.apache.xerces.parsers.SAXParser: Feature 'http://javax.xml.XMLConstants/feature/secure-processing' is not recognized.
Warning:  org.apache.xerces.parsers.SAXParser: Property 'http://javax.xml.XMLConstants/property/accessExternalDTD' is not recognized.
Warning:  org.apache.xerces.parsers.SAXParser: Property 'http://www.oracle.com/xml/jaxp/properties/entityExpansionLimit' is not recognized.
SLF4J: Class path contains multiple SLF4J bindings.
SLF4J: Found binding in [jar:file:/home/bamboo/.m2/repository/co/cask/cdap/cdap-cli/5.1.0-SNAPSHOT/cdap-cli-5.1.0-SNAPSHOT.jar!/org/slf4j/impl/StaticLoggerBinder.class]
SLF4J: Found binding in [jar:file:/home/bamboo/.m2/repository/co/cask/cdap/cdap-explore-jdbc/5.1.0-SNAPSHOT/cdap-explore-jdbc-5.1.0-SNAPSHOT.jar!/org/slf4j/impl/StaticLoggerBinder.class]
SLF4J: Found binding in [jar:file:/home/bamboo/.m2/repository/ch/qos/logback/logback-classic/1.0.9/logback-classic-1.0.9.jar!/org/slf4j/impl/StaticLoggerBinder.class]
SLF4J: See http://www.slf4j.org/codes.html#multiple_bindings for an explanation.
SLF4J: Actual binding is of type [ch.qos.logback.classic.util.ContextSelectorStaticBinder]