Build #83

Build: #83 failed Scheduled

Stages & jobs

  1. Variables

  2. Spinup and Test

Build result summary

Details

Completed
Duration
215 minutes
Labels
None
Revisions
CDAP Integration Tests
1da0b96664f63000618060df74596dfe49f3c26b 1da0b96664f63000618060df74596dfe49f3c26b
Coopr-internal
f5adbb1b4aa8fc4324d42d6f29f2587c542e8d31 f5adbb1b4aa8fc4324d42d6f29f2587c542e8d31
Total tests
62
Failing since
#60 (Scheduled – )

Responsible

This build has been failing since #60
No one has taken responsibility

Configuration changes

Plan configuration has changed since the last successful build. See the plan audit log for more details.

Tests

Existing test failures 48
Status Test Failing since View job Duration
java.lang.RuntimeException: java.io.IOException: 503: No discoverable found for request POST /v3/namespaces/itncm/apps/kvtable1/versions/-SNAPSHOT/services/DatasetService/methods/read HTTP/1.1
	at co.cask.cdap.client.util.RESTClient.execute(RESTClient.java:132)
	at co.cask.cdap.client.util.RESTClient.execute(RESTClient.java:91)
	at co.cask.cdap.remote.dataset.kvtable.RemoteKeyValueTable.doPost(RemoteKeyValueTable.java:170)
	at co.cask.cdap.remote.dataset.kvtable.RemoteKeyValueTable.doPost(RemoteKeyValueTable.java:163)
	at co.cask.cdap.remote.dataset.kvtable.RemoteKeyValueTable.read(RemoteKeyValueTable.java:77)
	at co.cask.cdap.remote.dataset.kvtable.RemoteKeyValueTable.read(RemoteKeyValueTable.java:70)
	at co.cask.cdap.app.etl.KVTableWithProjectionTest.testKVTableWithProjection(KVTableWithProjectionTest.java:85)
java.io.IOException: 503: No discoverable found for request GET /v3/namespaces/itncm/apps/DatasetAccessApp/versions/-SNAPSHOT/services/TPFSService/methods/tpfs/tpfs1?startTime=1526560310679&endTime=1526560910679 HTTP/1.1
	at co.cask.cdap.client.util.RESTClient.execute(RESTClient.java:132)
	at co.cask.cdap.client.util.RESTClient.execute(RESTClient.java:74)
	at co.cask.cdap.app.etl.StreamTPFSWithProjectionTest.verifyTPFSData(StreamTPFSWithProjectionTest.java:115)
	at co.cask.cdap.app.etl.StreamTPFSWithProjectionTest.testStreamTPFSWithProjection(StreamTPFSWithProjectionTest.java:104)
java.lang.RuntimeException: java.util.concurrent.TimeoutException: Timeout occurred. Expected true but found false.
	at co.cask.cdap.common.utils.Tasks.waitFor(Tasks.java:70)
	at co.cask.cdap.common.utils.Tasks.waitFor(Tasks.java:91)
	at co.cask.cdap.common.utils.Tasks.waitFor(Tasks.java:130)
	at co.cask.cdap.test.remote.RemoteServiceManager.getServiceURL(RemoteServiceManager.java:86)
	at co.cask.cdap.test.AudiTestBase.deployServiceForDataset(AudiTestBase.java:271)
	at co.cask.cdap.test.AudiTestBase.getTableDataset(AudiTestBase.java:228)
	at co.cask.cdap.test.AudiTestBase.getTableDataset(AudiTestBase.java:223)
(3 more lines...)
java.lang.RuntimeException: java.io.IOException: 503: No discoverable found for request POST /v3/namespaces/itncm/apps/inputTable/versions/-SNAPSHOT/services/DatasetService/methods/put HTTP/1.1
	at co.cask.cdap.client.util.RESTClient.execute(RESTClient.java:132)
	at co.cask.cdap.client.util.RESTClient.execute(RESTClient.java:91)
	at co.cask.cdap.remote.dataset.table.RemoteTable.doPost(RemoteTable.java:139)
	at co.cask.cdap.remote.dataset.table.RemoteTable.put(RemoteTable.java:89)
	at co.cask.cdap.data2.dataset2.lib.table.AbstractTable.put(AbstractTable.java:124)
	at co.cask.cdap.app.etl.batch.BatchCubeSinkTest.test(BatchCubeSinkTest.java:101)
java.lang.RuntimeException: java.io.IOException: 503: No discoverable found for request POST /v3/namespaces/itncm/apps/film-joinertest/versions/-SNAPSHOT/services/DatasetService/methods/put HTTP/1.1
	at co.cask.cdap.client.util.RESTClient.execute(RESTClient.java:132)
	at co.cask.cdap.client.util.RESTClient.execute(RESTClient.java:91)
	at co.cask.cdap.remote.dataset.table.RemoteTable.doPost(RemoteTable.java:139)
	at co.cask.cdap.remote.dataset.table.RemoteTable.put(RemoteTable.java:89)
	at co.cask.cdap.data2.dataset2.lib.table.AbstractTable.put(AbstractTable.java:124)
	at co.cask.cdap.app.etl.batch.BatchJoinerTest.putFilm(BatchJoinerTest.java:374)
	at co.cask.cdap.app.etl.batch.BatchJoinerTest.ingestToFilmTable(BatchJoinerTest.java:362)
(2 more lines...)
java.lang.RuntimeException: java.io.IOException: 500: Connection refused: it-itc-cm512-83-31756-1005.dev.continuuity.net/10.210.0.5:33631
	at co.cask.cdap.client.util.RESTClient.execute(RESTClient.java:132)
	at co.cask.cdap.client.util.RESTClient.execute(RESTClient.java:91)
	at co.cask.cdap.remote.dataset.table.RemoteTable.doPost(RemoteTable.java:139)
	at co.cask.cdap.remote.dataset.table.RemoteTable.put(RemoteTable.java:89)
	at co.cask.cdap.data2.dataset2.lib.table.AbstractTable.put(AbstractTable.java:124)
	at co.cask.cdap.app.etl.batch.BatchJoinerTest.putFilm(BatchJoinerTest.java:374)
	at co.cask.cdap.app.etl.batch.BatchJoinerTest.ingestToFilmTable(BatchJoinerTest.java:362)
(2 more lines...)
java.lang.RuntimeException: java.io.IOException: 503: No discoverable found for request POST /v3/namespaces/itncm/apps/inputTable/versions/-SNAPSHOT/services/DatasetService/methods/put HTTP/1.1
	at co.cask.cdap.client.util.RESTClient.execute(RESTClient.java:132)
	at co.cask.cdap.client.util.RESTClient.execute(RESTClient.java:91)
	at co.cask.cdap.remote.dataset.table.RemoteTable.doPost(RemoteTable.java:139)
	at co.cask.cdap.remote.dataset.table.RemoteTable.put(RemoteTable.java:89)
	at co.cask.cdap.data2.dataset2.lib.table.AbstractTable.put(AbstractTable.java:124)
	at co.cask.cdap.app.etl.batch.ETLMapReduceTest.testTableToTableWithValidations(ETLMapReduceTest.java:606)
java.lang.RuntimeException: java.io.IOException: 503: No discoverable found for request POST /v3/namespaces/itncm/apps/input/versions/-SNAPSHOT/services/DatasetService/methods/put HTTP/1.1
	at co.cask.cdap.client.util.RESTClient.execute(RESTClient.java:132)
	at co.cask.cdap.client.util.RESTClient.execute(RESTClient.java:91)
	at co.cask.cdap.remote.dataset.table.RemoteTable.doPost(RemoteTable.java:139)
	at co.cask.cdap.remote.dataset.table.RemoteTable.put(RemoteTable.java:89)
	at co.cask.cdap.data2.dataset2.lib.table.AbstractTable.put(AbstractTable.java:124)
	at co.cask.cdap.app.etl.batch.ETLMapReduceTest.ingestPurchaseTestData(ETLMapReduceTest.java:703)
	at co.cask.cdap.app.etl.batch.ETLMapReduceTest.testDAGSchemaChanges(ETLMapReduceTest.java:444)
java.lang.RuntimeException: java.io.IOException: 503: No discoverable found for request POST /v3/namespaces/itncm/apps/table1/versions/-SNAPSHOT/services/DatasetService/methods/write HTTP/1.1
	at co.cask.cdap.client.util.RESTClient.execute(RESTClient.java:132)
	at co.cask.cdap.client.util.RESTClient.execute(RESTClient.java:91)
	at co.cask.cdap.remote.dataset.kvtable.RemoteKeyValueTable.doPost(RemoteKeyValueTable.java:170)
	at co.cask.cdap.remote.dataset.kvtable.RemoteKeyValueTable.write(RemoteKeyValueTable.java:96)
	at co.cask.cdap.remote.dataset.kvtable.RemoteKeyValueTable.write(RemoteKeyValueTable.java:101)
	at co.cask.cdap.app.etl.batch.ETLMapReduceTest.testKVToKV(ETLMapReduceTest.java:102)
java.lang.RuntimeException: java.io.IOException: 503: No discoverable found for request POST /v3/namespaces/itncm/apps/input/versions/-SNAPSHOT/services/DatasetService/methods/put HTTP/1.1
	at co.cask.cdap.client.util.RESTClient.execute(RESTClient.java:132)
	at co.cask.cdap.client.util.RESTClient.execute(RESTClient.java:91)
	at co.cask.cdap.remote.dataset.table.RemoteTable.doPost(RemoteTable.java:139)
	at co.cask.cdap.remote.dataset.table.RemoteTable.put(RemoteTable.java:89)
	at co.cask.cdap.data2.dataset2.lib.table.AbstractTable.put(AbstractTable.java:124)
	at co.cask.cdap.app.etl.batch.ETLMapReduceTest.ingestPurchaseTestData(ETLMapReduceTest.java:703)
	at co.cask.cdap.app.etl.batch.ETLMapReduceTest.testDAG(ETLMapReduceTest.java:191)
java.io.IOException: 503: No discoverable found for request PUT /v3/namespaces/itncm/apps/UploadFile/versions/-SNAPSHOT/services/FileSetService/methods/excelreader?path=civil_test_data_one.xlsx HTTP/1.1
	at co.cask.cdap.client.util.RESTClient.execute(RESTClient.java:132)
	at co.cask.cdap.client.util.RESTClient.execute(RESTClient.java:69)
	at co.cask.cdap.app.etl.batch.ExcelInputReaderTest.testSetup(ExcelInputReaderTest.java:79)
java.io.IOException: 503: No discoverable found for request POST /v3/namespaces/itncm/apps/UploadFile/versions/-SNAPSHOT/services/FileSetService/methods/excelreader/create HTTP/1.1
	at co.cask.cdap.client.util.RESTClient.execute(RESTClient.java:132)
	at co.cask.cdap.client.util.RESTClient.execute(RESTClient.java:74)
	at co.cask.cdap.app.etl.batch.ExcelInputReaderTest.testSetup(ExcelInputReaderTest.java:74)
java.util.concurrent.TimeoutException: Timeout occurred. Expected true but found false.
	at co.cask.cdap.common.utils.Tasks.waitFor(Tasks.java:70)
	at co.cask.cdap.common.utils.Tasks.waitFor(Tasks.java:91)
	at co.cask.cdap.common.utils.Tasks.waitFor(Tasks.java:130)
	at co.cask.cdap.test.AbstractProgramManager.waitForRuns(AbstractProgramManager.java:82)
	at co.cask.cdap.test.AbstractProgramManager.waitForRun(AbstractProgramManager.java:76)
	at co.cask.cdap.app.etl.batch.HivePluginTest.testHivePlugins(HivePluginTest.java:136)
java.lang.RuntimeException: java.io.IOException: 503: No discoverable found for request POST /v3/namespaces/itncm/apps/customerPurchaseWithEmptyTable/versions/-SNAPSHOT/services/DatasetService/methods/put HTTP/1.1
	at co.cask.cdap.client.util.RESTClient.execute(RESTClient.java:132)
	at co.cask.cdap.client.util.RESTClient.execute(RESTClient.java:91)
	at co.cask.cdap.remote.dataset.table.RemoteTable.doPost(RemoteTable.java:139)
	at co.cask.cdap.remote.dataset.table.RemoteTable.put(RemoteTable.java:89)
	at co.cask.cdap.data2.dataset2.lib.table.AbstractTable.put(AbstractTable.java:124)
	at co.cask.cdap.app.etl.batch.NormalizeTest.putData(NormalizeTest.java:137)
	at co.cask.cdap.app.etl.batch.NormalizeTest.testNormalizeWithEmptyAttributeValue(NormalizeTest.java:209)
java.lang.RuntimeException: java.io.IOException: 503: No discoverable found for request POST /v3/namespaces/itncm/apps/customerPurchaseTable/versions/-SNAPSHOT/services/DatasetService/methods/put HTTP/1.1
	at co.cask.cdap.client.util.RESTClient.execute(RESTClient.java:132)
	at co.cask.cdap.client.util.RESTClient.execute(RESTClient.java:91)
	at co.cask.cdap.remote.dataset.table.RemoteTable.doPost(RemoteTable.java:139)
	at co.cask.cdap.remote.dataset.table.RemoteTable.put(RemoteTable.java:89)
	at co.cask.cdap.data2.dataset2.lib.table.AbstractTable.put(AbstractTable.java:124)
	at co.cask.cdap.app.etl.batch.NormalizeTest.putData(NormalizeTest.java:137)
	at co.cask.cdap.app.etl.batch.NormalizeTest.testNormalize(NormalizeTest.java:156)
java.util.concurrent.TimeoutException: Timeout occurred. Expected STOPPED but found STARTING.
	at co.cask.cdap.common.utils.Tasks.waitFor(Tasks.java:70)
	at co.cask.cdap.common.utils.Tasks.waitFor(Tasks.java:91)
	at co.cask.cdap.client.ProgramClient.waitForStatus(ProgramClient.java:324)
	at co.cask.cdap.client.ProgramClient.stopAll(ProgramClient.java:255)
	at co.cask.cdap.test.IntegrationTestBase.doClear(IntegrationTestBase.java:396)
	at co.cask.cdap.test.IntegrationTestBase.setUp(IntegrationTestBase.java:109)
	at sun.reflect.GeneratedMethodAccessor2.invoke(Unknown Source)
(41 more lines...)
java.util.concurrent.TimeoutException: Timeout occurred. Expected STOPPED but found STARTING.
	at co.cask.cdap.common.utils.Tasks.waitFor(Tasks.java:70)
	at co.cask.cdap.common.utils.Tasks.waitFor(Tasks.java:91)
	at co.cask.cdap.client.ProgramClient.waitForStatus(ProgramClient.java:324)
	at co.cask.cdap.client.ProgramClient.stopAll(ProgramClient.java:255)
	at co.cask.cdap.test.IntegrationTestBase.doClear(IntegrationTestBase.java:396)
	at co.cask.cdap.test.IntegrationTestBase.setUp(IntegrationTestBase.java:109)
	at sun.reflect.GeneratedMethodAccessor2.invoke(Unknown Source)
(41 more lines...)
java.lang.RuntimeException: java.io.IOException: 503: No discoverable found for request POST /v3/namespaces/itncm/apps/designationLookupTable/versions/-SNAPSHOT/services/DatasetService/methods/write HTTP/1.1
	at co.cask.cdap.client.util.RESTClient.execute(RESTClient.java:132)
	at co.cask.cdap.client.util.RESTClient.execute(RESTClient.java:91)
	at co.cask.cdap.remote.dataset.kvtable.RemoteKeyValueTable.doPost(RemoteKeyValueTable.java:170)
	at co.cask.cdap.remote.dataset.kvtable.RemoteKeyValueTable.write(RemoteKeyValueTable.java:96)
	at co.cask.cdap.remote.dataset.kvtable.RemoteKeyValueTable.write(RemoteKeyValueTable.java:101)
	at co.cask.cdap.app.etl.batch.ValueMapperTest.test(ValueMapperTest.java:120)
java.lang.RuntimeException: java.util.concurrent.TimeoutException: Timeout occurred. Expected true but found false.
	at co.cask.cdap.common.utils.Tasks.waitFor(Tasks.java:70)
	at co.cask.cdap.common.utils.Tasks.waitFor(Tasks.java:91)
	at co.cask.cdap.common.utils.Tasks.waitFor(Tasks.java:130)
	at co.cask.cdap.test.remote.RemoteServiceManager.getServiceURL(RemoteServiceManager.java:86)
	at co.cask.cdap.test.AudiTestBase.deployServiceForDataset(AudiTestBase.java:271)
	at co.cask.cdap.test.AudiTestBase.deployServiceForDataset(AudiTestBase.java:254)
	at co.cask.cdap.test.AudiTestBase.getKVTableDataset(AudiTestBase.java:235)
(1 more lines...)
java.io.IOException: 503: No discoverable found for request POST /v3/namespaces/itncm/apps/UploadFile/versions/-SNAPSHOT/services/FileSetService/methods/xmlreadersource/create HTTP/1.1
	at co.cask.cdap.client.util.RESTClient.execute(RESTClient.java:132)
	at co.cask.cdap.client.util.RESTClient.execute(RESTClient.java:74)
	at co.cask.cdap.app.etl.batch.XMLReaderTest.testSetup(XMLReaderTest.java:89)
java.io.IOException: 503: No discoverable found for request POST /v3/namespaces/itncm/apps/UploadFile/versions/-SNAPSHOT/services/FileSetService/methods/xmlreadersource/create HTTP/1.1
	at co.cask.cdap.client.util.RESTClient.execute(RESTClient.java:132)
	at co.cask.cdap.client.util.RESTClient.execute(RESTClient.java:74)
	at co.cask.cdap.app.etl.batch.XMLReaderTest.testSetup(XMLReaderTest.java:89)
java.io.IOException: 503: No discoverable found for request POST /v3/namespaces/itncm/apps/UploadFile/versions/-SNAPSHOT/services/FileSetService/methods/xmlreadersource/create HTTP/1.1
	at co.cask.cdap.client.util.RESTClient.execute(RESTClient.java:132)
	at co.cask.cdap.client.util.RESTClient.execute(RESTClient.java:74)
	at co.cask.cdap.app.etl.batch.XMLReaderTest.testSetup(XMLReaderTest.java:89)
java.io.IOException: 409: Dataset 'xmlreadersource' already exists
	at co.cask.cdap.client.util.RESTClient.execute(RESTClient.java:132)
	at co.cask.cdap.client.util.RESTClient.execute(RESTClient.java:74)
	at co.cask.cdap.app.etl.batch.XMLReaderTest.testSetup(XMLReaderTest.java:89)
java.io.IOException: 503: No discoverable found for request POST /v3/namespaces/itncm/apps/UploadFile/versions/-SNAPSHOT/services/FileSetService/methods/testFileSet/create HTTP/1.1
	at co.cask.cdap.client.util.RESTClient.execute(RESTClient.java:132)
	at co.cask.cdap.client.util.RESTClient.execute(RESTClient.java:74)
	at co.cask.cdap.app.etl.realtime.DataStreamsTest.testDataStreams(DataStreamsTest.java:98)
java.io.IOException: 503: No discoverable found for request PUT /v3/namespaces/itncm/apps/dataprep/versions/-SNAPSHOT/services/service/methods/workspaces/test_ws HTTP/1.1
	at co.cask.cdap.client.util.RESTClient.execute(RESTClient.java:132)
	at co.cask.cdap.client.util.RESTClient.execute(RESTClient.java:74)
	at co.cask.cdap.app.etl.wrangler.WranglerServiceTest.createAndUploadWorkspace(WranglerServiceTest.java:131)
	at co.cask.cdap.app.etl.wrangler.WranglerServiceTest.test(WranglerServiceTest.java:118)
java.io.IOException: 500: Connection refused: it-itc-cm512-83-31756-1004.dev.continuuity.net/10.210.0.6:33855
	at co.cask.cdap.client.util.RESTClient.execute(RESTClient.java:132)
	at co.cask.cdap.client.util.RESTClient.execute(RESTClient.java:74)
	at co.cask.cdap.app.etl.wrangler.WranglerTest.readOutput(WranglerTest.java:237)
	at co.cask.cdap.app.etl.wrangler.WranglerTest.testWrangler(WranglerTest.java:219)
	at co.cask.cdap.app.etl.wrangler.WranglerTest.testWranglerSpark(WranglerTest.java:99)
java.io.IOException: 503: No discoverable found for request GET /v3/namespaces/itncm/apps/DatasetAccessApp/versions/-SNAPSHOT/services/SnapshotFilesetService/methods/read/SnapshotAvro HTTP/1.1
	at co.cask.cdap.client.util.RESTClient.execute(RESTClient.java:132)
	at co.cask.cdap.client.util.RESTClient.execute(RESTClient.java:74)
	at co.cask.cdap.app.etl.wrangler.WranglerTest.readOutput(WranglerTest.java:237)
	at co.cask.cdap.app.etl.wrangler.WranglerTest.testWrangler(WranglerTest.java:219)
	at co.cask.cdap.app.etl.wrangler.WranglerTest.testWranglerMR(WranglerTest.java:85)
java.io.IOException: 503: No discoverable found for request GET /v3/namespaces/itncm/apps/PermissionApp/versions/-SNAPSHOT/services/FileService/methods/groups HTTP/1.1
	at co.cask.cdap.client.util.RESTClient.execute(RESTClient.java:132)
	at co.cask.cdap.client.util.RESTClient.execute(RESTClient.java:69)
	at co.cask.cdap.app.fileset.PermissionTest.test(PermissionTest.java:86)
java.util.concurrent.TimeoutException: Timeout occurred. Expected true but found false.
	at co.cask.cdap.common.utils.Tasks.waitFor(Tasks.java:70)
	at co.cask.cdap.common.utils.Tasks.waitFor(Tasks.java:91)
	at co.cask.cdap.common.utils.Tasks.waitFor(Tasks.java:130)
	at co.cask.cdap.test.AbstractProgramManager.waitForRuns(AbstractProgramManager.java:82)
	at co.cask.cdap.test.AbstractProgramManager.waitForRun(AbstractProgramManager.java:76)
	at co.cask.cdap.app.mapreduce.readless.ReadlessIncrementTest.testReadlessIncrementsInMapReduce(ReadlessIncrementTest.java:67)
java.util.concurrent.ExecutionException: java.lang.RuntimeException: java.io.IOException: 500: Connection refused: it-itc-cm512-83-31756-1004.dev.continuuity.net/10.210.0.6:41288
	at co.cask.cdap.client.util.RESTClient.execute(RESTClient.java:132)
	at co.cask.cdap.client.util.RESTClient.execute(RESTClient.java:91)
	at co.cask.cdap.remote.dataset.kvtable.RemoteKeyValueTable.doPost(RemoteKeyValueTable.java:170)
	at co.cask.cdap.remote.dataset.kvtable.RemoteKeyValueTable.doPost(RemoteKeyValueTable.java:163)
	at co.cask.cdap.remote.dataset.kvtable.RemoteKeyValueTable.read(RemoteKeyValueTable.java:77)
	at co.cask.cdap.remote.dataset.kvtable.RemoteKeyValueTable.read(RemoteKeyValueTable.java:70)
	at co.cask.cdap.app.restart.HangingWorkerTest$1.call(HangingWorkerTest.java:61)
(3 more lines...)
java.io.IOException: 500: Connection refused: it-itc-cm512-83-31756-1004.dev.continuuity.net/10.210.0.6:41970
	at co.cask.cdap.client.util.RESTClient.execute(RESTClient.java:132)
	at co.cask.cdap.client.util.RESTClient.execute(RESTClient.java:69)
	at co.cask.cdap.app.serviceworker.ServiceWorkerTest.test(ServiceWorkerTest.java:82)
java.io.IOException: 503: No discoverable found for request GET /v3/namespaces/itncm/apps/ConfigTestApp/versions/v2/services/simpleService/methods/ping HTTP/1.1
	at co.cask.cdap.client.util.RESTClient.execute(RESTClient.java:132)
	at co.cask.cdap.client.util.RESTClient.execute(RESTClient.java:69)
	at co.cask.cdap.apps.ApplicationVersionTest.testRouteConfig(ApplicationVersionTest.java:197)
java.io.IOException: 503: No discoverable found for request GET /v3/namespaces/itncm/apps/ConfigTestApp/versions/v1-SNAPSHOT/services/simpleService/methods/ping HTTP/1.1
	at co.cask.cdap.client.util.RESTClient.execute(RESTClient.java:132)
	at co.cask.cdap.client.util.RESTClient.execute(RESTClient.java:69)
	at co.cask.cdap.apps.ApplicationVersionTest.testAppVersionsCreationUpdateDeletion(ApplicationVersionTest.java:124)
java.util.concurrent.TimeoutException: Time limit reached. Got '0' instead of '1'
	at co.cask.cdap.client.MetricsClient$3.doWaitFor(MetricsClient.java:286)
	at co.cask.cdap.client.MetricsClient$3.waitForProcessed(MetricsClient.java:256)
	at co.cask.cdap.apps.DatasetTest.test(DatasetTest.java:109)
java.util.concurrent.TimeoutException: Time limit reached. Got '0' instead of '4'
	at co.cask.cdap.client.MetricsClient$3.doWaitFor(MetricsClient.java:286)
	at co.cask.cdap.client.MetricsClient$3.waitForProcessed(MetricsClient.java:256)
	at co.cask.cdap.apps.explore.ExploreTest.sendInputData(ExploreTest.java:245)
	at co.cask.cdap.apps.explore.ExploreTest.test(ExploreTest.java:69)
java.util.concurrent.TimeoutException: Time limit reached. Got '0' instead of '4'
	at co.cask.cdap.client.MetricsClient$3.doWaitFor(MetricsClient.java:286)
	at co.cask.cdap.client.MetricsClient$3.waitForProcessed(MetricsClient.java:256)
	at co.cask.cdap.apps.explore.ExploreTest.sendInputData(ExploreTest.java:245)
	at co.cask.cdap.apps.explore.ExploreTest.testSubqueryInWhereClause(ExploreTest.java:568)
java.io.IOException: 503: No discoverable found for request PUT /v3/namespaces/itncm/apps/FileSetExample/versions/-SNAPSHOT/services/FileSetService/methods/lines?path=myFile.txt HTTP/1.1
	at co.cask.cdap.client.util.RESTClient.execute(RESTClient.java:132)
	at co.cask.cdap.client.util.RESTClient.execute(RESTClient.java:69)
	at co.cask.cdap.apps.fileset.FileSetTest.test(FileSetTest.java:72)
java.io.IOException: 503: No discoverable found for request PUT /v3/namespaces/itncm/apps/PFSApp/versions/-SNAPSHOT/services/PFSService/methods/0 HTTP/1.1
	at co.cask.cdap.client.util.RESTClient.execute(RESTClient.java:132)
	at co.cask.cdap.client.util.RESTClient.execute(RESTClient.java:69)
	at co.cask.cdap.apps.fileset.PartitionCorrectorTest.test(PartitionCorrectorTest.java:65)
java.io.IOException: 503: No discoverable found for request PUT /v3/namespaces/itncm/apps/PFSApp/versions/-SNAPSHOT/services/PFSService/methods/1 HTTP/1.1
	at co.cask.cdap.client.util.RESTClient.execute(RESTClient.java:132)
	at co.cask.cdap.client.util.RESTClient.execute(RESTClient.java:69)
	at co.cask.cdap.apps.fileset.PartitionedFileSetUpdateTest.test(PartitionedFileSetUpdateTest.java:74)
java.util.concurrent.TimeoutException: Time limit reached. Got '0' instead of '1'
	at co.cask.cdap.client.MetricsClient$3.doWaitFor(MetricsClient.java:286)
	at co.cask.cdap.client.MetricsClient$3.waitForProcessed(MetricsClient.java:256)
	at co.cask.cdap.apps.metadata.PurchaseMetadataTest.testLineage(PurchaseMetadataTest.java:121)
java.util.concurrent.TimeoutException: Time limit reached. Got '0' instead of '1'
	at co.cask.cdap.client.MetricsClient$3.doWaitFor(MetricsClient.java:286)
	at co.cask.cdap.client.MetricsClient$3.waitForProcessed(MetricsClient.java:256)
	at co.cask.cdap.apps.purchase.PurchaseAudiTest.test(PurchaseAudiTest.java:95)
java.util.concurrent.TimeoutException: Timeout occurred. Expected true but found false.
	at co.cask.cdap.common.utils.Tasks.waitFor(Tasks.java:70)
	at co.cask.cdap.common.utils.Tasks.waitFor(Tasks.java:91)
	at co.cask.cdap.common.utils.Tasks.waitFor(Tasks.java:130)
	at co.cask.cdap.test.AbstractProgramManager.waitForRuns(AbstractProgramManager.java:82)
	at co.cask.cdap.test.AbstractProgramManager.waitForRun(AbstractProgramManager.java:76)
	at co.cask.cdap.apps.spark.sparkpagerank.SparkPageRankAppTest.test(SparkPageRankAppTest.java:141)
java.util.concurrent.TimeoutException: Time limit reached. Got '0' instead of '20'
	at co.cask.cdap.client.MetricsClient$3.doWaitFor(MetricsClient.java:286)
	at co.cask.cdap.client.MetricsClient$3.waitForProcessed(MetricsClient.java:256)
	at co.cask.cdap.apps.tracker.TrackerTestBase.waitforProcessed(TrackerTestBase.java:115)
	at co.cask.cdap.apps.tracker.TrackerTest.test(TrackerTest.java:52)
java.util.concurrent.TimeoutException: Time limit reached. Got '0' instead of '1'
	at co.cask.cdap.client.MetricsClient$3.doWaitFor(MetricsClient.java:286)
	at co.cask.cdap.client.MetricsClient$3.waitForProcessed(MetricsClient.java:256)
	at co.cask.cdap.apps.transaction.TransactionTimeoutTest.testFlowletTimeouts(TransactionTimeoutTest.java:65)
java.util.concurrent.TimeoutException: Time limit reached. Got '0' instead of '2'
	at co.cask.cdap.client.MetricsClient$3.doWaitFor(MetricsClient.java:286)
	at co.cask.cdap.client.MetricsClient$3.waitForProcessed(MetricsClient.java:256)
	at co.cask.cdap.apps.wordcount.WordCountTest.test(WordCountTest.java:92)
java.lang.RuntimeException: java.io.IOException: 503: No discoverable found for request POST /v3/namespaces/itncm/apps/myCube/versions/-SNAPSHOT/services/DatasetService/methods/add HTTP/1.1
	at co.cask.cdap.client.util.RESTClient.execute(RESTClient.java:132)
	at co.cask.cdap.client.util.RESTClient.execute(RESTClient.java:91)
	at co.cask.cdap.remote.dataset.cube.RemoteCube.doPost(RemoteCube.java:116)
	at co.cask.cdap.remote.dataset.cube.RemoteCube.add(RemoteCube.java:72)
	at co.cask.cdap.remote.dataset.test.RemoteCubeTest.test(RemoteCubeTest.java:66)
java.lang.RuntimeException: java.io.IOException: 503: No discoverable found for request POST /v3/namespaces/itncm/apps/kvTable/versions/-SNAPSHOT/services/DatasetService/methods/read HTTP/1.1
	at co.cask.cdap.client.util.RESTClient.execute(RESTClient.java:132)
	at co.cask.cdap.client.util.RESTClient.execute(RESTClient.java:91)
	at co.cask.cdap.remote.dataset.kvtable.RemoteKeyValueTable.doPost(RemoteKeyValueTable.java:170)
	at co.cask.cdap.remote.dataset.kvtable.RemoteKeyValueTable.doPost(RemoteKeyValueTable.java:163)
	at co.cask.cdap.remote.dataset.kvtable.RemoteKeyValueTable.read(RemoteKeyValueTable.java:77)
	at co.cask.cdap.remote.dataset.kvtable.RemoteKeyValueTable.read(RemoteKeyValueTable.java:70)
	at co.cask.cdap.remote.dataset.test.RemoteKeyValueTest.test(RemoteKeyValueTest.java:37)
java.lang.RuntimeException: java.io.IOException: 503: No discoverable found for request POST /v3/namespaces/itncm/apps/table/versions/-SNAPSHOT/services/DatasetService/methods/get HTTP/1.1
	at co.cask.cdap.client.util.RESTClient.execute(RESTClient.java:132)
	at co.cask.cdap.client.util.RESTClient.execute(RESTClient.java:91)
	at co.cask.cdap.remote.dataset.table.RemoteTable.doPost(RemoteTable.java:139)
	at co.cask.cdap.remote.dataset.table.RemoteTable.doPost(RemoteTable.java:132)
	at co.cask.cdap.remote.dataset.table.RemoteTable.get(RemoteTable.java:64)
	at co.cask.cdap.remote.dataset.test.RemoteTableTest.test(RemoteTableTest.java:40)
Fixed tests 1
Status Test Failing since View job Duration
Successful RowDenormalizerTest test History
Failing since build #78 (Scheduled with changes by Derek Wood) Cloudera Manager - 5.12 4 mins