Build #78

Build: #78 failed Scheduled with changes by Derek Wood

Stages & jobs

  1. Variables

  2. Spinup and Test

Build result summary

Details

Completed
Duration
200 minutes
Labels
None
Revisions
CDAP Integration Tests
1da0b96664f63000618060df74596dfe49f3c26b 1da0b96664f63000618060df74596dfe49f3c26b
Coopr-internal
f5adbb1b4aa8fc4324d42d6f29f2587c542e8d31 f5adbb1b4aa8fc4324d42d6f29f2587c542e8d31
Total tests
62
Failing since
#60 (Scheduled – )
Fixed in
#153 (Manual run by Matt Wuenschel)

Responsible

This build has been failing since #60
No one has taken responsibility

Code commits

Coopr-internal
Author Commit Message Commit date
Derek Wood Derek Wood f5adbb1b4aa8fc4324d42d6f29f2587c542e8d31 f5adbb1b4aa8fc4324d42d6f29f2587c542e8d31 Merge pull request #685 from caskdata/feature/update-printgc-opt
replace PrintGCTimeStamps with PrintGCDateStamps for HBase
Derek Wood Derek Wood 5de93543773c6538469fa83f41ee66872baf78db 5de93543773c6538469fa83f41ee66872baf78db replace PrintGCTimeStamps with PrintGCDateStamps for HBase

Configuration changes

Plan configuration has changed since the last successful build. See the plan audit log for more details.

Tests

New test failures 47
Status Test View job Duration
Collapse Failed KVTableWithProjectionTest testKVTableWithProjection History
Cloudera Manager - 5.12 3 mins
java.lang.RuntimeException: java.io.IOException: 503: No discoverable found for request POST /v3/namespaces/itncm/apps/kvtable1/versions/-SNAPSHOT/services/DatasetService/methods/read HTTP/1.1
	at co.cask.cdap.client.util.RESTClient.execute(RESTClient.java:132)
	at co.cask.cdap.client.util.RESTClient.execute(RESTClient.java:91)
	at co.cask.cdap.remote.dataset.kvtable.RemoteKeyValueTable.doPost(RemoteKeyValueTable.java:170)
	at co.cask.cdap.remote.dataset.kvtable.RemoteKeyValueTable.doPost(RemoteKeyValueTable.java:163)
	at co.cask.cdap.remote.dataset.kvtable.RemoteKeyValueTable.read(RemoteKeyValueTable.java:77)
	at co.cask.cdap.remote.dataset.kvtable.RemoteKeyValueTable.read(RemoteKeyValueTable.java:70)
	at co.cask.cdap.app.etl.KVTableWithProjectionTest.testKVTableWithProjection(KVTableWithProjectionTest.java:85)
Collapse Failed StreamTPFSWithProjectionTest testStreamTPFSWithProjection History
Cloudera Manager - 5.12 5 mins
java.io.IOException: 503: No discoverable found for request GET /v3/namespaces/itncm/apps/DatasetAccessApp/versions/-SNAPSHOT/services/TPFSService/methods/tpfs/tpfs1?startTime=1526127370291&endTime=1526127970291 HTTP/1.1
	at co.cask.cdap.client.util.RESTClient.execute(RESTClient.java:132)
	at co.cask.cdap.client.util.RESTClient.execute(RESTClient.java:74)
	at co.cask.cdap.app.etl.StreamTPFSWithProjectionTest.verifyTPFSData(StreamTPFSWithProjectionTest.java:115)
	at co.cask.cdap.app.etl.StreamTPFSWithProjectionTest.testStreamTPFSWithProjection(StreamTPFSWithProjectionTest.java:104)
Collapse Failed BatchAggregatorTest test History
Cloudera Manager - 5.12 2 mins
java.lang.RuntimeException: java.io.IOException: 503: No discoverable found for request POST /v3/namespaces/itncm/apps/purchaseSource/versions/-SNAPSHOT/services/DatasetService/methods/put HTTP/1.1
	at co.cask.cdap.client.util.RESTClient.execute(RESTClient.java:132)
	at co.cask.cdap.client.util.RESTClient.execute(RESTClient.java:91)
	at co.cask.cdap.remote.dataset.table.RemoteTable.doPost(RemoteTable.java:139)
	at co.cask.cdap.remote.dataset.table.RemoteTable.put(RemoteTable.java:89)
	at co.cask.cdap.data2.dataset2.lib.table.AbstractTable.put(AbstractTable.java:124)
	at co.cask.cdap.app.etl.batch.BatchAggregatorTest.putValues(BatchAggregatorTest.java:260)
	at co.cask.cdap.app.etl.batch.BatchAggregatorTest.ingestData(BatchAggregatorTest.java:245)
(1 more lines...)
Collapse Failed BatchCubeSinkTest test History
Cloudera Manager - 5.12 2 mins
java.lang.RuntimeException: java.io.IOException: 503: No discoverable found for request POST /v3/namespaces/itncm/apps/inputTable/versions/-SNAPSHOT/services/DatasetService/methods/put HTTP/1.1
	at co.cask.cdap.client.util.RESTClient.execute(RESTClient.java:132)
	at co.cask.cdap.client.util.RESTClient.execute(RESTClient.java:91)
	at co.cask.cdap.remote.dataset.table.RemoteTable.doPost(RemoteTable.java:139)
	at co.cask.cdap.remote.dataset.table.RemoteTable.put(RemoteTable.java:89)
	at co.cask.cdap.data2.dataset2.lib.table.AbstractTable.put(AbstractTable.java:124)
	at co.cask.cdap.app.etl.batch.BatchCubeSinkTest.test(BatchCubeSinkTest.java:101)
Collapse Failed BatchJoinerTest testJoinerMR History
Cloudera Manager - 5.12 3 mins
java.lang.RuntimeException: java.io.IOException: 503: No discoverable found for request POST /v3/namespaces/itncm/apps/film-actor-joinertest/versions/-SNAPSHOT/services/DatasetService/methods/put HTTP/1.1
	at co.cask.cdap.client.util.RESTClient.execute(RESTClient.java:132)
	at co.cask.cdap.client.util.RESTClient.execute(RESTClient.java:91)
	at co.cask.cdap.remote.dataset.table.RemoteTable.doPost(RemoteTable.java:139)
	at co.cask.cdap.remote.dataset.table.RemoteTable.put(RemoteTable.java:89)
	at co.cask.cdap.data2.dataset2.lib.table.AbstractTable.put(AbstractTable.java:124)
	at co.cask.cdap.app.etl.batch.BatchJoinerTest.putFilmActor(BatchJoinerTest.java:351)
	at co.cask.cdap.app.etl.batch.BatchJoinerTest.ingestToFilmActorTable(BatchJoinerTest.java:338)
(2 more lines...)
Collapse Failed BatchJoinerTest testJoinerSpark History
Cloudera Manager - 5.12 2 mins
java.lang.RuntimeException: java.io.IOException: 503: No discoverable found for request POST /v3/namespaces/itncm/apps/film-joinertest/versions/-SNAPSHOT/services/DatasetService/methods/put HTTP/1.1
	at co.cask.cdap.client.util.RESTClient.execute(RESTClient.java:132)
	at co.cask.cdap.client.util.RESTClient.execute(RESTClient.java:91)
	at co.cask.cdap.remote.dataset.table.RemoteTable.doPost(RemoteTable.java:139)
	at co.cask.cdap.remote.dataset.table.RemoteTable.put(RemoteTable.java:89)
	at co.cask.cdap.data2.dataset2.lib.table.AbstractTable.put(AbstractTable.java:124)
	at co.cask.cdap.app.etl.batch.BatchJoinerTest.putFilm(BatchJoinerTest.java:374)
	at co.cask.cdap.app.etl.batch.BatchJoinerTest.ingestToFilmTable(BatchJoinerTest.java:362)
(2 more lines...)
Collapse Failed ETLMapReduceTest testTableToTableWithValidations History
Cloudera Manager - 5.12 2 mins
java.lang.RuntimeException: java.io.IOException: 503: No discoverable found for request POST /v3/namespaces/itncm/apps/inputTable/versions/-SNAPSHOT/services/DatasetService/methods/put HTTP/1.1
	at co.cask.cdap.client.util.RESTClient.execute(RESTClient.java:132)
	at co.cask.cdap.client.util.RESTClient.execute(RESTClient.java:91)
	at co.cask.cdap.remote.dataset.table.RemoteTable.doPost(RemoteTable.java:139)
	at co.cask.cdap.remote.dataset.table.RemoteTable.put(RemoteTable.java:89)
	at co.cask.cdap.data2.dataset2.lib.table.AbstractTable.put(AbstractTable.java:124)
	at co.cask.cdap.app.etl.batch.ETLMapReduceTest.testTableToTableWithValidations(ETLMapReduceTest.java:606)
Collapse Failed ETLMapReduceTest testKVToKV History
Cloudera Manager - 5.12 2 mins
java.lang.RuntimeException: java.io.IOException: 503: No discoverable found for request POST /v3/namespaces/itncm/apps/table1/versions/-SNAPSHOT/services/DatasetService/methods/write HTTP/1.1
	at co.cask.cdap.client.util.RESTClient.execute(RESTClient.java:132)
	at co.cask.cdap.client.util.RESTClient.execute(RESTClient.java:91)
	at co.cask.cdap.remote.dataset.kvtable.RemoteKeyValueTable.doPost(RemoteKeyValueTable.java:170)
	at co.cask.cdap.remote.dataset.kvtable.RemoteKeyValueTable.write(RemoteKeyValueTable.java:96)
	at co.cask.cdap.remote.dataset.kvtable.RemoteKeyValueTable.write(RemoteKeyValueTable.java:101)
	at co.cask.cdap.app.etl.batch.ETLMapReduceTest.testKVToKV(ETLMapReduceTest.java:102)
Collapse Failed ETLMapReduceTest testDAGSchemaChanges History
Cloudera Manager - 5.12 2 mins
java.lang.RuntimeException: java.io.IOException: 503: No discoverable found for request POST /v3/namespaces/itncm/apps/input/versions/-SNAPSHOT/services/DatasetService/methods/put HTTP/1.1
	at co.cask.cdap.client.util.RESTClient.execute(RESTClient.java:132)
	at co.cask.cdap.client.util.RESTClient.execute(RESTClient.java:91)
	at co.cask.cdap.remote.dataset.table.RemoteTable.doPost(RemoteTable.java:139)
	at co.cask.cdap.remote.dataset.table.RemoteTable.put(RemoteTable.java:89)
	at co.cask.cdap.data2.dataset2.lib.table.AbstractTable.put(AbstractTable.java:124)
	at co.cask.cdap.app.etl.batch.ETLMapReduceTest.ingestPurchaseTestData(ETLMapReduceTest.java:703)
	at co.cask.cdap.app.etl.batch.ETLMapReduceTest.testDAGSchemaChanges(ETLMapReduceTest.java:444)
Collapse Failed ETLMapReduceTest testDAG History
Cloudera Manager - 5.12 2 mins
java.lang.RuntimeException: java.io.IOException: 503: No discoverable found for request POST /v3/namespaces/itncm/apps/input/versions/-SNAPSHOT/services/DatasetService/methods/put HTTP/1.1
	at co.cask.cdap.client.util.RESTClient.execute(RESTClient.java:132)
	at co.cask.cdap.client.util.RESTClient.execute(RESTClient.java:91)
	at co.cask.cdap.remote.dataset.table.RemoteTable.doPost(RemoteTable.java:139)
	at co.cask.cdap.remote.dataset.table.RemoteTable.put(RemoteTable.java:89)
	at co.cask.cdap.data2.dataset2.lib.table.AbstractTable.put(AbstractTable.java:124)
	at co.cask.cdap.app.etl.batch.ETLMapReduceTest.ingestPurchaseTestData(ETLMapReduceTest.java:703)
	at co.cask.cdap.app.etl.batch.ETLMapReduceTest.testDAG(ETLMapReduceTest.java:191)
Collapse Failed ExcelInputReaderTest testExcelReaderReprocessFalse History
Cloudera Manager - 5.12 1 min
java.io.IOException: 409: Dataset 'excelreader' already exists
	at co.cask.cdap.client.util.RESTClient.execute(RESTClient.java:132)
	at co.cask.cdap.client.util.RESTClient.execute(RESTClient.java:74)
	at co.cask.cdap.app.etl.batch.ExcelInputReaderTest.testSetup(ExcelInputReaderTest.java:74)
Collapse Failed ExcelInputReaderTest testExcelReader History
Cloudera Manager - 5.12 1 min
java.io.IOException: 409: Dataset 'excelreader' already exists
	at co.cask.cdap.client.util.RESTClient.execute(RESTClient.java:132)
	at co.cask.cdap.client.util.RESTClient.execute(RESTClient.java:74)
	at co.cask.cdap.app.etl.batch.ExcelInputReaderTest.testSetup(ExcelInputReaderTest.java:74)
Collapse Failed NormalizeTest testNormalizeWithEmptyAttributeValue History
Cloudera Manager - 5.12 1 min
java.lang.RuntimeException: java.io.IOException: 503: No discoverable found for request POST /v3/namespaces/itncm/apps/customerPurchaseWithEmptyTable/versions/-SNAPSHOT/services/DatasetService/methods/put HTTP/1.1
	at co.cask.cdap.client.util.RESTClient.execute(RESTClient.java:132)
	at co.cask.cdap.client.util.RESTClient.execute(RESTClient.java:91)
	at co.cask.cdap.remote.dataset.table.RemoteTable.doPost(RemoteTable.java:139)
	at co.cask.cdap.remote.dataset.table.RemoteTable.put(RemoteTable.java:89)
	at co.cask.cdap.data2.dataset2.lib.table.AbstractTable.put(AbstractTable.java:124)
	at co.cask.cdap.app.etl.batch.NormalizeTest.putData(NormalizeTest.java:137)
	at co.cask.cdap.app.etl.batch.NormalizeTest.testNormalizeWithEmptyAttributeValue(NormalizeTest.java:209)
Collapse Failed NormalizeTest testNormalize History
Cloudera Manager - 5.12 1 min
java.lang.RuntimeException: java.io.IOException: 503: No discoverable found for request POST /v3/namespaces/itncm/apps/customerPurchaseTable/versions/-SNAPSHOT/services/DatasetService/methods/put HTTP/1.1
	at co.cask.cdap.client.util.RESTClient.execute(RESTClient.java:132)
	at co.cask.cdap.client.util.RESTClient.execute(RESTClient.java:91)
	at co.cask.cdap.remote.dataset.table.RemoteTable.doPost(RemoteTable.java:139)
	at co.cask.cdap.remote.dataset.table.RemoteTable.put(RemoteTable.java:89)
	at co.cask.cdap.data2.dataset2.lib.table.AbstractTable.put(AbstractTable.java:124)
	at co.cask.cdap.app.etl.batch.NormalizeTest.putData(NormalizeTest.java:137)
	at co.cask.cdap.app.etl.batch.NormalizeTest.testNormalize(NormalizeTest.java:156)
Collapse Failed RowDenormalizerTest test History
Cloudera Manager - 5.12 1 min
java.lang.RuntimeException: java.io.IOException: 503: No discoverable found for request POST /v3/namespaces/itncm/apps/denormalizerSource/versions/-SNAPSHOT/services/DatasetService/methods/put HTTP/1.1
	at co.cask.cdap.client.util.RESTClient.execute(RESTClient.java:132)
	at co.cask.cdap.client.util.RESTClient.execute(RESTClient.java:91)
	at co.cask.cdap.remote.dataset.table.RemoteTable.doPost(RemoteTable.java:139)
	at co.cask.cdap.remote.dataset.table.RemoteTable.put(RemoteTable.java:89)
	at co.cask.cdap.data2.dataset2.lib.table.AbstractTable.put(AbstractTable.java:124)
	at co.cask.cdap.app.etl.batch.RowDenormalizerTest.putValues(RowDenormalizerTest.java:138)
	at co.cask.cdap.app.etl.batch.RowDenormalizerTest.ingestInputData(RowDenormalizerTest.java:122)
(1 more lines...)
Collapse Failed TPFSSinkSourceTest testSpark History
Cloudera Manager - 5.12 5 mins
java.io.IOException: 503: No discoverable found for request GET /v3/namespaces/itncm/apps/DatasetAccessApp/versions/-SNAPSHOT/services/TPFSService/methods/tpfs/tpfs1?startTime=1526127716826&endTime=1526128316826 HTTP/1.1
	at co.cask.cdap.client.util.RESTClient.execute(RESTClient.java:132)
	at co.cask.cdap.client.util.RESTClient.execute(RESTClient.java:74)
	at co.cask.cdap.app.etl.batch.TPFSSinkSourceTest.verifyTPFSData(TPFSSinkSourceTest.java:135)
	at co.cask.cdap.app.etl.batch.TPFSSinkSourceTest.testStreamTPFSWithProjection(TPFSSinkSourceTest.java:124)
	at co.cask.cdap.app.etl.batch.TPFSSinkSourceTest.testSpark(TPFSSinkSourceTest.java:85)
Collapse Failed TPFSSinkSourceTest testMR History
Cloudera Manager - 5.12 5 mins
java.io.IOException: 503: No discoverable found for request GET /v3/namespaces/itncm/apps/DatasetAccessApp/versions/-SNAPSHOT/services/TPFSService/methods/tpfs/tpfs1?startTime=1526128051369&endTime=1526128651369 HTTP/1.1
	at co.cask.cdap.client.util.RESTClient.execute(RESTClient.java:132)
	at co.cask.cdap.client.util.RESTClient.execute(RESTClient.java:74)
	at co.cask.cdap.app.etl.batch.TPFSSinkSourceTest.verifyTPFSData(TPFSSinkSourceTest.java:135)
	at co.cask.cdap.app.etl.batch.TPFSSinkSourceTest.testStreamTPFSWithProjection(TPFSSinkSourceTest.java:124)
	at co.cask.cdap.app.etl.batch.TPFSSinkSourceTest.testMR(TPFSSinkSourceTest.java:71)
Collapse Failed ValueMapperTest test History
Cloudera Manager - 5.12 1 min
java.lang.RuntimeException: java.util.concurrent.TimeoutException: Timeout occurred. Expected true but found false.
	at co.cask.cdap.common.utils.Tasks.waitFor(Tasks.java:70)
	at co.cask.cdap.common.utils.Tasks.waitFor(Tasks.java:91)
	at co.cask.cdap.common.utils.Tasks.waitFor(Tasks.java:130)
	at co.cask.cdap.test.remote.RemoteServiceManager.getServiceURL(RemoteServiceManager.java:86)
	at co.cask.cdap.test.AudiTestBase.deployServiceForDataset(AudiTestBase.java:271)
	at co.cask.cdap.test.AudiTestBase.deployServiceForDataset(AudiTestBase.java:254)
	at co.cask.cdap.test.AudiTestBase.getKVTableDataset(AudiTestBase.java:235)
(1 more lines...)
Collapse Failed XMLReaderTest testInvalidPatternWithDeleteAction History
Cloudera Manager - 5.12 1 min
java.io.IOException: 503: No discoverable found for request POST /v3/namespaces/itncm/apps/UploadFile/versions/-SNAPSHOT/services/FileSetService/methods/xmlreadersource/create HTTP/1.1
	at co.cask.cdap.client.util.RESTClient.execute(RESTClient.java:132)
	at co.cask.cdap.client.util.RESTClient.execute(RESTClient.java:74)
	at co.cask.cdap.app.etl.batch.XMLReaderTest.testSetup(XMLReaderTest.java:89)
Collapse Failed XMLReaderTest testPreProcessingNotRequired History
Cloudera Manager - 5.12 2 mins
java.io.IOException: 409: Dataset 'xmlreadersource' already exists
	at co.cask.cdap.client.util.RESTClient.execute(RESTClient.java:132)
	at co.cask.cdap.client.util.RESTClient.execute(RESTClient.java:74)
	at co.cask.cdap.app.etl.batch.XMLReaderTest.testSetup(XMLReaderTest.java:89)
Collapse Failed XMLReaderTest testInvalidNodePathWithMoveAction History
Cloudera Manager - 5.12 2 mins
java.io.IOException: 503: No discoverable found for request POST /v3/namespaces/itncm/apps/UploadFile/versions/-SNAPSHOT/services/FileSetService/methods/xmlreadersource/create HTTP/1.1
	at co.cask.cdap.client.util.RESTClient.execute(RESTClient.java:132)
	at co.cask.cdap.client.util.RESTClient.execute(RESTClient.java:74)
	at co.cask.cdap.app.etl.batch.XMLReaderTest.testSetup(XMLReaderTest.java:89)
Collapse Failed XMLReaderTest testPatternWithDeleteAction History
Cloudera Manager - 5.12 1 min
java.io.IOException: 409: Dataset 'xmlreadersource' already exists
	at co.cask.cdap.client.util.RESTClient.execute(RESTClient.java:132)
	at co.cask.cdap.client.util.RESTClient.execute(RESTClient.java:74)
	at co.cask.cdap.app.etl.batch.XMLReaderTest.testSetup(XMLReaderTest.java:89)
Collapse Failed XMLReaderTest testPreProcessingRequired History
Cloudera Manager - 5.12 2 mins
java.io.IOException: 503: No discoverable found for request POST /v3/namespaces/itncm/apps/UploadFile/versions/-SNAPSHOT/services/FileSetService/methods/xmlreadersource/create HTTP/1.1
	at co.cask.cdap.client.util.RESTClient.execute(RESTClient.java:132)
	at co.cask.cdap.client.util.RESTClient.execute(RESTClient.java:74)
	at co.cask.cdap.app.etl.batch.XMLReaderTest.testSetup(XMLReaderTest.java:89)
Collapse Failed DataStreamsTest testDataStreams History
Cloudera Manager - 5.12 1 min
java.io.IOException: 409: Dataset 'testFileSet' already exists
	at co.cask.cdap.client.util.RESTClient.execute(RESTClient.java:132)
	at co.cask.cdap.client.util.RESTClient.execute(RESTClient.java:74)
	at co.cask.cdap.app.etl.realtime.DataStreamsTest.testDataStreams(DataStreamsTest.java:98)
Collapse Failed WranglerServiceTest test History
Cloudera Manager - 5.12 2 mins
java.io.IOException: 503: No discoverable found for request PUT /v3/namespaces/itncm/apps/dataprep/versions/-SNAPSHOT/services/service/methods/workspaces/test_ws HTTP/1.1
	at co.cask.cdap.client.util.RESTClient.execute(RESTClient.java:132)
	at co.cask.cdap.client.util.RESTClient.execute(RESTClient.java:74)
	at co.cask.cdap.app.etl.wrangler.WranglerServiceTest.createAndUploadWorkspace(WranglerServiceTest.java:131)
	at co.cask.cdap.app.etl.wrangler.WranglerServiceTest.test(WranglerServiceTest.java:118)
Collapse Failed WranglerTest testWranglerMR History
Cloudera Manager - 5.12 5 mins
java.io.IOException: 503: No discoverable found for request GET /v3/namespaces/itncm/apps/DatasetAccessApp/versions/-SNAPSHOT/services/SnapshotFilesetService/methods/read/SnapshotAvro HTTP/1.1
	at co.cask.cdap.client.util.RESTClient.execute(RESTClient.java:132)
	at co.cask.cdap.client.util.RESTClient.execute(RESTClient.java:74)
	at co.cask.cdap.app.etl.wrangler.WranglerTest.readOutput(WranglerTest.java:237)
	at co.cask.cdap.app.etl.wrangler.WranglerTest.testWrangler(WranglerTest.java:219)
	at co.cask.cdap.app.etl.wrangler.WranglerTest.testWranglerMR(WranglerTest.java:85)
Collapse Failed WranglerTest testWranglerSpark History
Cloudera Manager - 5.12 5 mins
java.io.IOException: 503: No discoverable found for request GET /v3/namespaces/itncm/apps/DatasetAccessApp/versions/-SNAPSHOT/services/SnapshotFilesetService/methods/read/SnapshotAvro HTTP/1.1
	at co.cask.cdap.client.util.RESTClient.execute(RESTClient.java:132)
	at co.cask.cdap.client.util.RESTClient.execute(RESTClient.java:74)
	at co.cask.cdap.app.etl.wrangler.WranglerTest.readOutput(WranglerTest.java:237)
	at co.cask.cdap.app.etl.wrangler.WranglerTest.testWrangler(WranglerTest.java:219)
	at co.cask.cdap.app.etl.wrangler.WranglerTest.testWranglerSpark(WranglerTest.java:99)
Collapse Failed PermissionTest test History
Cloudera Manager - 5.12 1 min
java.io.IOException: 503: No discoverable found for request GET /v3/namespaces/itncm/apps/PermissionApp/versions/-SNAPSHOT/services/FileService/methods/groups HTTP/1.1
	at co.cask.cdap.client.util.RESTClient.execute(RESTClient.java:132)
	at co.cask.cdap.client.util.RESTClient.execute(RESTClient.java:69)
	at co.cask.cdap.app.fileset.PermissionTest.test(PermissionTest.java:86)
Collapse Failed ReadlessIncrementTest testReadlessIncrementsInMapReduce History
Cloudera Manager - 5.12 5 mins
java.util.concurrent.TimeoutException: Timeout occurred. Expected true but found false.
	at co.cask.cdap.common.utils.Tasks.waitFor(Tasks.java:70)
	at co.cask.cdap.common.utils.Tasks.waitFor(Tasks.java:91)
	at co.cask.cdap.common.utils.Tasks.waitFor(Tasks.java:130)
	at co.cask.cdap.test.AbstractProgramManager.waitForRuns(AbstractProgramManager.java:82)
	at co.cask.cdap.test.AbstractProgramManager.waitForRun(AbstractProgramManager.java:76)
	at co.cask.cdap.app.mapreduce.readless.ReadlessIncrementTest.testReadlessIncrementsInMapReduce(ReadlessIncrementTest.java:67)
Collapse Failed HangingWorkerTest testRestart History
Cloudera Manager - 5.12 2 mins
java.util.concurrent.ExecutionException: java.lang.RuntimeException: java.io.IOException: 503: No discoverable found for request POST /v3/namespaces/itncm/apps/HangingWorkerDataset/versions/-SNAPSHOT/services/DatasetService/methods/read HTTP/1.1
	at co.cask.cdap.client.util.RESTClient.execute(RESTClient.java:132)
	at co.cask.cdap.client.util.RESTClient.execute(RESTClient.java:91)
	at co.cask.cdap.remote.dataset.kvtable.RemoteKeyValueTable.doPost(RemoteKeyValueTable.java:170)
	at co.cask.cdap.remote.dataset.kvtable.RemoteKeyValueTable.doPost(RemoteKeyValueTable.java:163)
	at co.cask.cdap.remote.dataset.kvtable.RemoteKeyValueTable.read(RemoteKeyValueTable.java:77)
	at co.cask.cdap.remote.dataset.kvtable.RemoteKeyValueTable.read(RemoteKeyValueTable.java:70)
	at co.cask.cdap.app.restart.HangingWorkerTest$1.call(HangingWorkerTest.java:61)
(3 more lines...)
Collapse Failed ServiceWorkerTest test History
Cloudera Manager - 5.12 1 min
java.io.IOException: 503: No discoverable found for request GET /v3/namespaces/itncm/apps/ServiceApplication/versions/-SNAPSHOT/services/HttpService/methods/read/testKey HTTP/1.1
	at co.cask.cdap.client.util.RESTClient.execute(RESTClient.java:132)
	at co.cask.cdap.client.util.RESTClient.execute(RESTClient.java:69)
	at co.cask.cdap.app.serviceworker.ServiceWorkerTest.test(ServiceWorkerTest.java:82)
Collapse Failed ApplicationVersionTest testRouteConfig History
Cloudera Manager - 5.12 2 mins
java.lang.AssertionError: null
	at org.junit.Assert.fail(Assert.java:86)
	at org.junit.Assert.fail(Assert.java:95)
	at co.cask.cdap.apps.ApplicationVersionTest.assureBothVersionsReached(ApplicationVersionTest.java:297)
	at co.cask.cdap.apps.ApplicationVersionTest.testRouteConfig(ApplicationVersionTest.java:203)
Collapse Failed ApplicationVersionTest testAppVersionsCreationUpdateDeletion History
Cloudera Manager - 5.12 2 mins
java.io.IOException: 503: No discoverable found for request GET /v3/namespaces/itncm/apps/ConfigTestApp/versions/v1-SNAPSHOT/services/simpleService/methods/ping HTTP/1.1
	at co.cask.cdap.client.util.RESTClient.execute(RESTClient.java:132)
	at co.cask.cdap.client.util.RESTClient.execute(RESTClient.java:69)
	at co.cask.cdap.apps.ApplicationVersionTest.testAppVersionsCreationUpdateDeletion(ApplicationVersionTest.java:106)
Collapse Failed DatasetTest test History
Cloudera Manager - 5.12 3 mins
java.util.concurrent.TimeoutException: Time limit reached. Got '0' instead of '1'
	at co.cask.cdap.client.MetricsClient$3.doWaitFor(MetricsClient.java:286)
	at co.cask.cdap.client.MetricsClient$3.waitForProcessed(MetricsClient.java:256)
	at co.cask.cdap.apps.DatasetTest.test(DatasetTest.java:109)
Collapse Failed ExploreTest test History
Cloudera Manager - 5.12 4 mins
java.util.concurrent.TimeoutException: Time limit reached. Got '0' instead of '4'
	at co.cask.cdap.client.MetricsClient$3.doWaitFor(MetricsClient.java:286)
	at co.cask.cdap.client.MetricsClient$3.waitForProcessed(MetricsClient.java:256)
	at co.cask.cdap.apps.explore.ExploreTest.sendInputData(ExploreTest.java:245)
	at co.cask.cdap.apps.explore.ExploreTest.test(ExploreTest.java:69)
Collapse Failed ExploreTest testSubqueryInWhereClause History
Cloudera Manager - 5.12 4 mins
java.util.concurrent.TimeoutException: Time limit reached. Got '0' instead of '4'
	at co.cask.cdap.client.MetricsClient$3.doWaitFor(MetricsClient.java:286)
	at co.cask.cdap.client.MetricsClient$3.waitForProcessed(MetricsClient.java:256)
	at co.cask.cdap.apps.explore.ExploreTest.sendInputData(ExploreTest.java:245)
	at co.cask.cdap.apps.explore.ExploreTest.testSubqueryInWhereClause(ExploreTest.java:568)
Collapse Failed FileSetTest test History
Cloudera Manager - 5.12 2 mins
java.io.IOException: 503: No discoverable found for request PUT /v3/namespaces/itncm/apps/FileSetExample/versions/-SNAPSHOT/services/FileSetService/methods/lines?path=myFile.txt HTTP/1.1
	at co.cask.cdap.client.util.RESTClient.execute(RESTClient.java:132)
	at co.cask.cdap.client.util.RESTClient.execute(RESTClient.java:69)
	at co.cask.cdap.apps.fileset.FileSetTest.test(FileSetTest.java:72)
Collapse Failed PartitionCorrectorTest test History
Cloudera Manager - 5.12 2 mins
java.io.IOException: 503: No discoverable found for request PUT /v3/namespaces/itncm/apps/PFSApp/versions/-SNAPSHOT/services/PFSService/methods/0 HTTP/1.1
	at co.cask.cdap.client.util.RESTClient.execute(RESTClient.java:132)
	at co.cask.cdap.client.util.RESTClient.execute(RESTClient.java:69)
	at co.cask.cdap.apps.fileset.PartitionCorrectorTest.test(PartitionCorrectorTest.java:65)
Collapse Failed PartitionedFileSetUpdateTest test History
Cloudera Manager - 5.12 1 min
java.io.IOException: 503: No discoverable found for request PUT /v3/namespaces/itncm/apps/PFSApp/versions/-SNAPSHOT/services/PFSService/methods/1 HTTP/1.1
	at co.cask.cdap.client.util.RESTClient.execute(RESTClient.java:132)
	at co.cask.cdap.client.util.RESTClient.execute(RESTClient.java:69)
	at co.cask.cdap.apps.fileset.PartitionedFileSetUpdateTest.test(PartitionedFileSetUpdateTest.java:74)
Collapse Failed PurchaseAudiTest test History
Cloudera Manager - 5.12 2 mins
java.util.concurrent.TimeoutException: Time limit reached. Got '0' instead of '1'
	at co.cask.cdap.client.MetricsClient$3.doWaitFor(MetricsClient.java:286)
	at co.cask.cdap.client.MetricsClient$3.waitForProcessed(MetricsClient.java:256)
	at co.cask.cdap.apps.purchase.PurchaseAudiTest.test(PurchaseAudiTest.java:95)
Collapse Failed SparkPageRankAppTest test History
Cloudera Manager - 5.12 11 mins
java.util.concurrent.TimeoutException: Timeout occurred. Expected true but found false.
	at co.cask.cdap.common.utils.Tasks.waitFor(Tasks.java:70)
	at co.cask.cdap.common.utils.Tasks.waitFor(Tasks.java:91)
	at co.cask.cdap.common.utils.Tasks.waitFor(Tasks.java:130)
	at co.cask.cdap.test.AbstractProgramManager.waitForRuns(AbstractProgramManager.java:82)
	at co.cask.cdap.test.AbstractProgramManager.waitForRun(AbstractProgramManager.java:76)
	at co.cask.cdap.apps.spark.sparkpagerank.SparkPageRankAppTest.test(SparkPageRankAppTest.java:141)
Collapse Failed TrackerTest test History
Cloudera Manager - 5.12 3 mins
java.lang.RuntimeException: java.util.concurrent.TimeoutException: Timeout occurred. Expected true but found false.
	at co.cask.cdap.common.utils.Tasks.waitFor(Tasks.java:70)
	at co.cask.cdap.common.utils.Tasks.waitFor(Tasks.java:91)
	at co.cask.cdap.common.utils.Tasks.waitFor(Tasks.java:130)
	at co.cask.cdap.test.remote.RemoteServiceManager.getServiceURL(RemoteServiceManager.java:86)
	at co.cask.cdap.apps.tracker.TrackerTestBase.enableTracker(TrackerTestBase.java:110)
	at co.cask.cdap.apps.tracker.TrackerTest.test(TrackerTest.java:47)
Collapse Failed TransactionTimeoutTest testFlowletTimeouts History
Cloudera Manager - 5.12 2 mins
java.util.concurrent.TimeoutException: Time limit reached. Got '0' instead of '1'
	at co.cask.cdap.client.MetricsClient$3.doWaitFor(MetricsClient.java:286)
	at co.cask.cdap.client.MetricsClient$3.waitForProcessed(MetricsClient.java:256)
	at co.cask.cdap.apps.transaction.TransactionTimeoutTest.testFlowletTimeouts(TransactionTimeoutTest.java:65)
Collapse Failed WordCountTest test History
Cloudera Manager - 5.12 2 mins
java.util.concurrent.TimeoutException: Time limit reached. Got '0' instead of '2'
	at co.cask.cdap.client.MetricsClient$3.doWaitFor(MetricsClient.java:286)
	at co.cask.cdap.client.MetricsClient$3.waitForProcessed(MetricsClient.java:256)
	at co.cask.cdap.apps.wordcount.WordCountTest.test(WordCountTest.java:92)
Collapse Failed RemoteCubeTest test History
Cloudera Manager - 5.12 2 mins
java.lang.RuntimeException: java.io.IOException: 503: No discoverable found for request POST /v3/namespaces/itncm/apps/myCube/versions/-SNAPSHOT/services/DatasetService/methods/add HTTP/1.1
	at co.cask.cdap.client.util.RESTClient.execute(RESTClient.java:132)
	at co.cask.cdap.client.util.RESTClient.execute(RESTClient.java:91)
	at co.cask.cdap.remote.dataset.cube.RemoteCube.doPost(RemoteCube.java:116)
	at co.cask.cdap.remote.dataset.cube.RemoteCube.add(RemoteCube.java:72)
	at co.cask.cdap.remote.dataset.test.RemoteCubeTest.test(RemoteCubeTest.java:66)
Collapse Failed RemoteKeyValueTest test History
Cloudera Manager - 5.12 1 min
java.lang.RuntimeException: java.io.IOException: 503: No discoverable found for request POST /v3/namespaces/itncm/apps/kvTable/versions/-SNAPSHOT/services/DatasetService/methods/read HTTP/1.1
	at co.cask.cdap.client.util.RESTClient.execute(RESTClient.java:132)
	at co.cask.cdap.client.util.RESTClient.execute(RESTClient.java:91)
	at co.cask.cdap.remote.dataset.kvtable.RemoteKeyValueTable.doPost(RemoteKeyValueTable.java:170)
	at co.cask.cdap.remote.dataset.kvtable.RemoteKeyValueTable.doPost(RemoteKeyValueTable.java:163)
	at co.cask.cdap.remote.dataset.kvtable.RemoteKeyValueTable.read(RemoteKeyValueTable.java:77)
	at co.cask.cdap.remote.dataset.kvtable.RemoteKeyValueTable.read(RemoteKeyValueTable.java:70)
	at co.cask.cdap.remote.dataset.test.RemoteKeyValueTest.test(RemoteKeyValueTest.java:37)
Collapse Failed RemoteTableTest test History
Cloudera Manager - 5.12 1 min
java.lang.RuntimeException: java.io.IOException: 503: No discoverable found for request POST /v3/namespaces/itncm/apps/table/versions/-SNAPSHOT/services/DatasetService/methods/get HTTP/1.1
	at co.cask.cdap.client.util.RESTClient.execute(RESTClient.java:132)
	at co.cask.cdap.client.util.RESTClient.execute(RESTClient.java:91)
	at co.cask.cdap.remote.dataset.table.RemoteTable.doPost(RemoteTable.java:139)
	at co.cask.cdap.remote.dataset.table.RemoteTable.doPost(RemoteTable.java:132)
	at co.cask.cdap.remote.dataset.table.RemoteTable.get(RemoteTable.java:64)
	at co.cask.cdap.remote.dataset.test.RemoteTableTest.test(RemoteTableTest.java:40)
Existing test failures 3
Status Test Failing since View job Duration
java.io.IOException: 409: Dataset 'inputDataset' already exists
	at co.cask.cdap.client.util.RESTClient.execute(RESTClient.java:132)
	at co.cask.cdap.client.util.RESTClient.execute(RESTClient.java:69)
	at co.cask.cdap.app.etl.batch.HivePluginTest.testHivePlugins(HivePluginTest.java:95)
java.util.concurrent.TimeoutException: Time limit reached. Got '0' instead of '1'
	at co.cask.cdap.client.MetricsClient$3.doWaitFor(MetricsClient.java:286)
	at co.cask.cdap.client.MetricsClient$3.waitForProcessed(MetricsClient.java:256)
	at co.cask.cdap.apps.metadata.PurchaseMetadataTest.testLineage(PurchaseMetadataTest.java:121)
java.lang.AssertionError: null
	at org.junit.Assert.fail(Assert.java:86)
	at org.junit.Assert.assertTrue(Assert.java:41)
	at org.junit.Assert.assertTrue(Assert.java:52)
	at co.cask.cdap.apps.workflow.WorkflowTest.assertTokenAtTopNMRNode(WorkflowTest.java:226)
	at co.cask.cdap.apps.workflow.WorkflowTest.assertWorkflowToken(WorkflowTest.java:165)
	at co.cask.cdap.apps.workflow.WorkflowTest.testWorkflow(WorkflowTest.java:140)
	at co.cask.cdap.apps.workflow.WorkflowTest.testLDA(WorkflowTest.java:95)