Build #77

Build: #77 failed Scheduled

Stages & jobs

  1. Variables

  2. Spinup and Test

Build result summary

Details

Completed
Duration
262 minutes
Labels
None
Revisions
CDAP Integration Tests
1da0b96664f63000618060df74596dfe49f3c26b 1da0b96664f63000618060df74596dfe49f3c26b
Coopr-internal
b76d80c44be4d9e818d7365bed9a7aee9dc2ee4f b76d80c44be4d9e818d7365bed9a7aee9dc2ee4f
Total tests
62
Failing since
#60 (Scheduled – )
Fixed in
#153 (Manual run by Matt Wuenschel)

Responsible

This build has been failing since #60
No one has taken responsibility

Configuration changes

Plan configuration has changed since the last successful build. See the plan audit log for more details.

Tests

Existing test failures 3
Status Test Failing since View job Duration
java.util.concurrent.TimeoutException: Timeout occurred. Expected true but found false.
	at co.cask.cdap.common.utils.Tasks.waitFor(Tasks.java:70)
	at co.cask.cdap.common.utils.Tasks.waitFor(Tasks.java:91)
	at co.cask.cdap.common.utils.Tasks.waitFor(Tasks.java:130)
	at co.cask.cdap.test.AbstractProgramManager.waitForRuns(AbstractProgramManager.java:82)
	at co.cask.cdap.test.AbstractProgramManager.waitForRun(AbstractProgramManager.java:76)
	at co.cask.cdap.app.etl.batch.HivePluginTest.testHivePlugins(HivePluginTest.java:136)
java.lang.AssertionError: expected:<LineageRecord{start=1526043152, end=1526053152, relations=[RelationRecord{data='stream.itncm.purchaseStream', program='flows.itncm.PurchaseHistory.PurchaseFlow', accesses=[read], runs=[2b970c05-551a-11e8-8889-42010ad2000b], components=[reader]}, RelationRecord{data='dataset.itncm.purchases', program='flows.itncm.PurchaseHistory.PurchaseFlow', accesses=[write], runs=[2b970c05-551a-11e8-8889-42010ad2000b], components=[collector]}], programs={flows.itncm.PurchaseHistory.PurchaseFlow=ProgramRecord{entityId=program:itncm.PurchaseHistory.-SNAPSHOT.flow.PurchaseFlow}}, data={dataset.itncm.purchases=DataRecord{entityId=dataset:itncm.purchases}, stream.itncm.purchaseStream=DataRecord{entityId=stream:itncm.purchaseStream}}}> but was:<LineageRecord{start=1526043152, end=1526053152, relations=[RelationRecord{data='dataset.itncm.purchases', program='flows.itncm.PurchaseHistory.PurchaseFlow', accesses=[unknown], runs=[2b970c05-551a-11e8-8889-42010ad2000b], components=[collector]}, RelationRecord{data='stream.itncm.purchaseStream', program='flows.itncm.PurchaseHistory.PurchaseFlow', accesses=[read], runs=[2b970c05-551a-11e8-8889-42010ad2000b], components=[reader]}], programs={flows.itncm.PurchaseHistory.PurchaseFlow=ProgramRecord{entityId=program:itncm.PurchaseHistory.-SNAPSHOT.flow.PurchaseFlow}}, data={dataset.itncm.purchases=DataRecord{entityId=dataset:itncm.purchases}, stream.itncm.purchaseStream=DataRecord{entityId=stream:itncm.purchaseStream}}}>
	at org.junit.Assert.fail(Assert.java:88)
	at org.junit.Assert.failNotEquals(Assert.java:743)
	at org.junit.Assert.assertEquals(Assert.java:118)
	at org.junit.Assert.assertEquals(Assert.java:144)
	at co.cask.cdap.apps.metadata.PurchaseMetadataTest.testLineage(PurchaseMetadataTest.java:138)
java.lang.AssertionError: null
	at org.junit.Assert.fail(Assert.java:86)
	at org.junit.Assert.assertTrue(Assert.java:41)
	at org.junit.Assert.assertTrue(Assert.java:52)
	at co.cask.cdap.apps.workflow.WorkflowTest.assertTokenAtTopNMRNode(WorkflowTest.java:226)
	at co.cask.cdap.apps.workflow.WorkflowTest.assertWorkflowToken(WorkflowTest.java:165)
	at co.cask.cdap.apps.workflow.WorkflowTest.testWorkflow(WorkflowTest.java:140)
	at co.cask.cdap.apps.workflow.WorkflowTest.testLDA(WorkflowTest.java:95)
Fixed tests 1
Status Test Failing since View job Duration
Successful PermissionTest test History
Failing since build #72 (Scheduled) Cloudera Manager - 5.12 11 mins