Build #581

Build: #581 failed Scheduled

Stages & jobs

  1. Variables

  2. Spinup and Test

Test results

  • 45 tests in total
  • 6 tests failed
  • 1 failure is new
  • 202 minutes taken in total.
New test failures 1
Status Test View job Duration
Collapse Failed HivePluginTest testHivePlugins History
Cloudera Manager - 5.12 1 sec
java.net.ConnectException: Connection refused
	at java.net.PlainSocketImpl.socketConnect(Native Method)
	at java.net.AbstractPlainSocketImpl.doConnect(AbstractPlainSocketImpl.java:350)
	at java.net.AbstractPlainSocketImpl.connectToAddress(AbstractPlainSocketImpl.java:206)
	at java.net.AbstractPlainSocketImpl.connect(AbstractPlainSocketImpl.java:188)
	at java.net.SocksSocketImpl.connect(SocksSocketImpl.java:392)
	at java.net.Socket.connect(Socket.java:589)
	at sun.net.NetworkClient.doConnect(NetworkClient.java:175)
(14 more lines...)
Existing test failures 5
Status Test Failing since View job Duration
java.util.concurrent.TimeoutException: Timeout occurred. Expected true but found false.
	at io.cdap.cdap.common.utils.Tasks.waitFor(Tasks.java:70)
	at io.cdap.cdap.common.utils.Tasks.waitFor(Tasks.java:91)
	at io.cdap.cdap.common.utils.Tasks.waitFor(Tasks.java:130)
	at io.cdap.cdap.test.AbstractProgramManager.waitForRuns(AbstractProgramManager.java:96)
	at io.cdap.cdap.test.AbstractProgramManager.waitForRun(AbstractProgramManager.java:90)
	at io.cdap.cdap.app.etl.batch.BatchJoinerTest.testJoiner(BatchJoinerTest.java:216)
	at io.cdap.cdap.app.etl.batch.BatchJoinerTest.testJoinerSpark(BatchJoinerTest.java:93)
java.util.concurrent.TimeoutException: Timeout occurred. Expected true but found false.
	at io.cdap.cdap.common.utils.Tasks.waitFor(Tasks.java:70)
	at io.cdap.cdap.common.utils.Tasks.waitFor(Tasks.java:91)
	at io.cdap.cdap.common.utils.Tasks.waitFor(Tasks.java:130)
	at io.cdap.cdap.test.AbstractProgramManager.waitForRuns(AbstractProgramManager.java:96)
	at io.cdap.cdap.test.AbstractProgramManager.waitForRun(AbstractProgramManager.java:90)
	at io.cdap.cdap.app.etl.batch.TPFSParquetSinkSourceTest.testTPFSWithProjection(TPFSParquetSinkSourceTest.java:91)
	at io.cdap.cdap.app.etl.batch.TPFSParquetSinkSourceTest.testSpark(TPFSParquetSinkSourceTest.java:69)
java.util.concurrent.TimeoutException: Timeout occurred. Expected true but found false.
	at io.cdap.cdap.common.utils.Tasks.waitFor(Tasks.java:70)
	at io.cdap.cdap.common.utils.Tasks.waitFor(Tasks.java:91)
	at io.cdap.cdap.app.etl.realtime.DataStreamsTest.verifyOutput(DataStreamsTest.java:156)
	at io.cdap.cdap.app.etl.realtime.DataStreamsTest.testDataStreams(DataStreamsTest.java:146)
java.util.concurrent.TimeoutException: Timeout occurred. Expected true but found false.
	at io.cdap.cdap.common.utils.Tasks.waitFor(Tasks.java:70)
	at io.cdap.cdap.common.utils.Tasks.waitFor(Tasks.java:91)
	at io.cdap.cdap.common.utils.Tasks.waitFor(Tasks.java:130)
	at io.cdap.cdap.test.AbstractProgramManager.waitForRuns(AbstractProgramManager.java:96)
	at io.cdap.cdap.test.AbstractProgramManager.waitForRun(AbstractProgramManager.java:90)
	at io.cdap.cdap.app.etl.wrangler.WranglerTest.testWrangler(WranglerTest.java:166)
	at io.cdap.cdap.app.etl.wrangler.WranglerTest.testWranglerSpark(WranglerTest.java:88)
java.lang.RuntimeException: java.io.IOException: Service 'dataset.service' is not available. Please wait until it is up and running.
	at io.cdap.cdap.client.util.RESTClient.upload(RESTClient.java:160)
	at io.cdap.cdap.client.ApplicationClient.deployApp(ApplicationClient.java:449)
	at io.cdap.cdap.client.ApplicationClient.deploy(ApplicationClient.java:377)
	at io.cdap.cdap.client.ApplicationClient.deploy(ApplicationClient.java:353)
	at io.cdap.cdap.test.IntegrationTestManager.deployApplication(IntegrationTestManager.java:180)
	at io.cdap.cdap.test.AbstractTestManager.deployApplication(AbstractTestManager.java:43)
	at io.cdap.cdap.test.IntegrationTestBase.deployApplication(IntegrationTestBase.java:368)
(2 more lines...)