Build #545

Build: #545 failed Scheduled with changes by albertshau <ashau@google.com> and Ali Anwar

Stages & jobs

  1. Variables

  2. Spinup and Test

Build result summary

Details

Completed
Duration
237 minutes
Labels
None
Revisions
caskdata/cdap-integration-tests
f7ffcfd0e88141efda2949d695c99aa50273dc2f f7ffcfd0e88141efda2949d695c99aa50273dc2f
caskdata/coopr-internal
b7a74651688c18a871aa4e50e8004389d7b5e2ef b7a74651688c18a871aa4e50e8004389d7b5e2ef
Total tests
46
Failing since
#436 (Scheduled – )

Responsible

This build has been failing since #436
No one has taken responsibility

Code commits

caskdata/cdap-integration-tests
Author Commit Message Commit date
albertshau <ashau@google.com> albertshau <ashau@google.com> f7ffcfd0e88141efda2949d695c99aa50273dc2f f7ffcfd0e88141efda2949d695c99aa50273dc2f Merge pull request #1029 from cdapio/fix-profile-creation
Fix dataproc profile creation to only set region
albertshau <ashau@google.com> albertshau <ashau@google.com> 47bc1c2e6da0a36091cf075e53a008a545e8d52a 47bc1c2e6da0a36091cf075e53a008a545e8d52a Fix dataproc profile creation to only set region
albertshau <ashau@google.com> albertshau <ashau@google.com> a445544d05ec43b670535a2de2b522768fceebfe a445544d05ec43b670535a2de2b522768fceebfe Merge pull request #1027 from cdapio/group-cloud-tests
Create a GCP test suite and fix tests to set project for plugins
albertshau <ashau@google.com> albertshau <ashau@google.com> eb57a1c2b4ea3b4df3927327a5f786c0da56323e m eb57a1c2b4ea3b4df3927327a5f786c0da56323e Create a GCP test suite and fix tests to set project for plugins
Fixed the bigtable test to create an instance at the start of the
tests instead of requiring that an instance is already setup.

Added artifact info to all of the pipelines so that they are
viewable through the UI.

Fixed datetime checks for failing BigQuery test
Ali Anwar Ali Anwar b4f627d73d515f12b67dcacc3ebcb88c7dff7b8d b4f627d73d515f12b67dcacc3ebcb88c7dff7b8d Merge pull request #1028 from cdapio/increase-program-timeout
Increase default program timeout to 120 seconds.

Tests

New test failures 1
Status Test View job Duration
Collapse Failed ApplicationTest test History
Cloudera Manager - 5.12 1 min
java.lang.RuntimeException: java.io.IOException: Service 'dataset.service' is not available. Please wait until it is up and running.
	at io.cdap.cdap.client.util.RESTClient.upload(RESTClient.java:160)
	at io.cdap.cdap.client.ApplicationClient.deployApp(ApplicationClient.java:449)
	at io.cdap.cdap.client.ApplicationClient.deploy(ApplicationClient.java:377)
	at io.cdap.cdap.client.ApplicationClient.deploy(ApplicationClient.java:353)
	at io.cdap.cdap.test.IntegrationTestManager.deployApplication(IntegrationTestManager.java:180)
	at io.cdap.cdap.test.AbstractTestManager.deployApplication(AbstractTestManager.java:43)
	at io.cdap.cdap.test.IntegrationTestBase.deployApplication(IntegrationTestBase.java:368)
(2 more lines...)
Existing test failures 4
Status Test Failing since View job Duration
java.util.concurrent.TimeoutException: Timeout occurred. Expected true but found false.
	at io.cdap.cdap.common.utils.Tasks.waitFor(Tasks.java:70)
	at io.cdap.cdap.common.utils.Tasks.waitFor(Tasks.java:91)
	at io.cdap.cdap.common.utils.Tasks.waitFor(Tasks.java:130)
	at io.cdap.cdap.test.AbstractProgramManager.waitForRuns(AbstractProgramManager.java:96)
	at io.cdap.cdap.test.AbstractProgramManager.waitForRun(AbstractProgramManager.java:90)
	at io.cdap.cdap.app.etl.batch.BatchJoinerTest.testJoiner(BatchJoinerTest.java:216)
	at io.cdap.cdap.app.etl.batch.BatchJoinerTest.testJoinerSpark(BatchJoinerTest.java:93)
java.util.concurrent.TimeoutException: Timeout occurred. Expected true but found false.
	at io.cdap.cdap.common.utils.Tasks.waitFor(Tasks.java:70)
	at io.cdap.cdap.common.utils.Tasks.waitFor(Tasks.java:91)
	at io.cdap.cdap.common.utils.Tasks.waitFor(Tasks.java:130)
	at io.cdap.cdap.test.AbstractProgramManager.waitForRuns(AbstractProgramManager.java:96)
	at io.cdap.cdap.test.AbstractProgramManager.waitForRun(AbstractProgramManager.java:90)
	at io.cdap.cdap.app.etl.batch.TPFSParquetSinkSourceTest.testTPFSWithProjection(TPFSParquetSinkSourceTest.java:91)
	at io.cdap.cdap.app.etl.batch.TPFSParquetSinkSourceTest.testSpark(TPFSParquetSinkSourceTest.java:69)
java.util.concurrent.TimeoutException: Timeout occurred. Expected true but found false.
	at io.cdap.cdap.common.utils.Tasks.waitFor(Tasks.java:70)
	at io.cdap.cdap.common.utils.Tasks.waitFor(Tasks.java:91)
	at io.cdap.cdap.app.etl.realtime.DataStreamsTest.verifyOutput(DataStreamsTest.java:156)
	at io.cdap.cdap.app.etl.realtime.DataStreamsTest.testDataStreams(DataStreamsTest.java:146)
java.util.concurrent.TimeoutException: Timeout occurred. Expected true but found false.
	at io.cdap.cdap.common.utils.Tasks.waitFor(Tasks.java:70)
	at io.cdap.cdap.common.utils.Tasks.waitFor(Tasks.java:91)
	at io.cdap.cdap.common.utils.Tasks.waitFor(Tasks.java:130)
	at io.cdap.cdap.test.AbstractProgramManager.waitForRuns(AbstractProgramManager.java:96)
	at io.cdap.cdap.test.AbstractProgramManager.waitForRun(AbstractProgramManager.java:90)
	at io.cdap.cdap.app.etl.wrangler.WranglerTest.testWrangler(WranglerTest.java:166)
	at io.cdap.cdap.app.etl.wrangler.WranglerTest.testWranglerSpark(WranglerTest.java:88)
Fixed tests 1
Status Test Failing since View job Duration
Successful XMLReaderTest testPreProcessingRequired History
Failing since build #544 (Scheduled) Cloudera Manager - 5.12 4 mins