Build #531

Stages & jobs

  1. Variables

  2. Spinup and Test

Build result summary

Details

Completed
Duration
236 minutes
Labels
None
Revisions
caskdata/cdap-integration-tests
e53fac8e1947c40d5ddfbf815e247e88d2d867ef e53fac8e1947c40d5ddfbf815e247e88d2d867ef
caskdata/coopr-internal
b7a74651688c18a871aa4e50e8004389d7b5e2ef b7a74651688c18a871aa4e50e8004389d7b5e2ef
Total tests
46
Failing since
#436 (Scheduled – )

Responsible

This build has been failing since #436
No one has taken responsibility

Code commits

caskdata/cdap-integration-tests
Author Commit Message Commit date
albertshau <ashau@google.com> albertshau <ashau@google.com> e53fac8e1947c40d5ddfbf815e247e88d2d867ef e53fac8e1947c40d5ddfbf815e247e88d2d867ef Merge pull request #1021 from cdapio/revert-1020-feature/CDAP-15735_Added_tests_for_Array_in_Spanner_plugin
Revert "CDAP-15735 Support all data types in integration tests for Spanner"
albertshau <ashau@google.com> albertshau <ashau@google.com> 9bed0fc6d921b6b2ebd1ad6150d07cb047a0da6e 9bed0fc6d921b6b2ebd1ad6150d07cb047a0da6e Revert "CDAP-15735 Support all data types in integration tests for Spanner"
albertshau <ashau@google.com> albertshau <ashau@google.com> 1613b2626be0a90f53c09112f981216083d2dbbb 1613b2626be0a90f53c09112f981216083d2dbbb Merge pull request #1020 from vladhlinskiy/feature/CDAP-15735_Added_tests_for_Array_in_Spanner_plugin
CDAP-15735 Support all data types in integration tests for Spanner
Vlad Hlinskiy <vglinskiy@cybervisiontech.com> Vlad Hlinskiy <vglinskiy@cybervisiontech.com> 1a0178db3cd282d76d2b479fe13e6d33aeeb191a 1a0178db3cd282d76d2b479fe13e6d33aeeb191a CDAP-15735 Support all data types in integration tests for Spanner
albertshau <ashau@google.com> albertshau <ashau@google.com> 3327f829fe5e740dae1974ba15e73ffd71b219e8 3327f829fe5e740dae1974ba15e73ffd71b219e8 Merge pull request #1019 from vladhlinskiy/feature/CDAP-15731-GCS-Data-Types
CDAP-15731 Support all data types in integration tests for GCS

Tests

New test failures 1
Status Test View job Duration
Collapse Failed HivePluginTest testHivePlugins History
Cloudera Manager - 5.12 1 sec
java.io.IOException: 500: Unable to validate session
	at io.cdap.cdap.client.util.RESTClient.execute(RESTClient.java:132)
	at io.cdap.cdap.client.util.RESTClient.execute(RESTClient.java:82)
	at io.cdap.cdap.app.etl.ETLTestBase.installPluginFromMarket(ETLTestBase.java:193)
	at io.cdap.cdap.app.etl.batch.HivePluginTest.testHivePlugins(HivePluginTest.java:76)
Existing test failures 4
Status Test Failing since View job Duration
java.util.concurrent.TimeoutException: Timeout occurred. Expected true but found false.
	at io.cdap.cdap.common.utils.Tasks.waitFor(Tasks.java:70)
	at io.cdap.cdap.common.utils.Tasks.waitFor(Tasks.java:91)
	at io.cdap.cdap.common.utils.Tasks.waitFor(Tasks.java:130)
	at io.cdap.cdap.test.AbstractProgramManager.waitForRuns(AbstractProgramManager.java:96)
	at io.cdap.cdap.test.AbstractProgramManager.waitForRun(AbstractProgramManager.java:90)
	at io.cdap.cdap.app.etl.batch.BatchJoinerTest.testJoiner(BatchJoinerTest.java:216)
	at io.cdap.cdap.app.etl.batch.BatchJoinerTest.testJoinerSpark(BatchJoinerTest.java:93)
java.util.concurrent.TimeoutException: Timeout occurred. Expected true but found false.
	at io.cdap.cdap.common.utils.Tasks.waitFor(Tasks.java:70)
	at io.cdap.cdap.common.utils.Tasks.waitFor(Tasks.java:91)
	at io.cdap.cdap.common.utils.Tasks.waitFor(Tasks.java:130)
	at io.cdap.cdap.test.AbstractProgramManager.waitForRuns(AbstractProgramManager.java:96)
	at io.cdap.cdap.test.AbstractProgramManager.waitForRun(AbstractProgramManager.java:90)
	at io.cdap.cdap.app.etl.batch.TPFSParquetSinkSourceTest.testTPFSWithProjection(TPFSParquetSinkSourceTest.java:91)
	at io.cdap.cdap.app.etl.batch.TPFSParquetSinkSourceTest.testSpark(TPFSParquetSinkSourceTest.java:69)
java.util.concurrent.TimeoutException: Timeout occurred. Expected true but found false.
	at io.cdap.cdap.common.utils.Tasks.waitFor(Tasks.java:70)
	at io.cdap.cdap.common.utils.Tasks.waitFor(Tasks.java:91)
	at io.cdap.cdap.app.etl.realtime.DataStreamsTest.verifyOutput(DataStreamsTest.java:156)
	at io.cdap.cdap.app.etl.realtime.DataStreamsTest.testDataStreams(DataStreamsTest.java:146)
java.util.concurrent.TimeoutException: Timeout occurred. Expected true but found false.
	at io.cdap.cdap.common.utils.Tasks.waitFor(Tasks.java:70)
	at io.cdap.cdap.common.utils.Tasks.waitFor(Tasks.java:91)
	at io.cdap.cdap.common.utils.Tasks.waitFor(Tasks.java:130)
	at io.cdap.cdap.test.AbstractProgramManager.waitForRuns(AbstractProgramManager.java:96)
	at io.cdap.cdap.test.AbstractProgramManager.waitForRun(AbstractProgramManager.java:90)
	at io.cdap.cdap.app.etl.wrangler.WranglerTest.testWrangler(WranglerTest.java:166)
	at io.cdap.cdap.app.etl.wrangler.WranglerTest.testWranglerSpark(WranglerTest.java:88)

JIRA issues

IssueDescriptionStatus
Unknown Issue TypeCDAP-15731Could not obtain issue details from JIRA
Unknown Issue TypeCDAP-15735Could not obtain issue details from JIRA