Build #136

Build: #136 failed Scheduled

Stages & jobs

  1. Variables

  2. Spinup and Test

Build result summary

Details

Completed
Duration
605 minutes
Labels
None
Revisions
CDAP Integration Tests
06cf92c395432016f2cda655ea4e9ec18b7b248a 06cf92c395432016f2cda655ea4e9ec18b7b248a
Coopr-internal
1e6163ce92629a2f8229cd1c44ab8b1f98da833a 1e6163ce92629a2f8229cd1c44ab8b1f98da833a
Total tests
59
Failing since
#60 (Scheduled – )
Fixed in
#153 (Manual run by Matt Wuenschel)

Responsible

This build has been failing since #60
No one has taken responsibility

Configuration changes

Plan configuration has changed since the last successful build. See the plan audit log for more details.

Tests

Existing test failures 50
Status Test Failing since View job Duration
java.util.concurrent.TimeoutException: Timeout occurred. Expected true but found false.
	at co.cask.cdap.common.utils.Tasks.waitFor(Tasks.java:70)
	at co.cask.cdap.common.utils.Tasks.waitFor(Tasks.java:91)
	at co.cask.cdap.app.etl.ETLTestBase.setup(ETLTestBase.java:82)
	at sun.reflect.NativeMethodAccessorImpl.invoke0(Native Method)
	at sun.reflect.NativeMethodAccessorImpl.invoke(NativeMethodAccessorImpl.java:62)
	at sun.reflect.DelegatingMethodAccessorImpl.invoke(DelegatingMethodAccessorImpl.java:43)
	at java.lang.reflect.Method.invoke(Method.java:498)
(39 more lines...)
java.util.concurrent.TimeoutException: Timeout occurred. Expected true but found false.
	at co.cask.cdap.common.utils.Tasks.waitFor(Tasks.java:70)
	at co.cask.cdap.common.utils.Tasks.waitFor(Tasks.java:91)
	at co.cask.cdap.app.etl.ETLTestBase.setup(ETLTestBase.java:82)
	at sun.reflect.GeneratedMethodAccessor5.invoke(Unknown Source)
	at sun.reflect.DelegatingMethodAccessorImpl.invoke(DelegatingMethodAccessorImpl.java:43)
	at java.lang.reflect.Method.invoke(Method.java:498)
	at org.junit.runners.model.FrameworkMethod$1.runReflectiveCall(FrameworkMethod.java:47)
(38 more lines...)
java.util.concurrent.TimeoutException: Timeout occurred. Expected true but found false.
	at co.cask.cdap.common.utils.Tasks.waitFor(Tasks.java:70)
	at co.cask.cdap.common.utils.Tasks.waitFor(Tasks.java:91)
	at co.cask.cdap.app.etl.ETLTestBase.setup(ETLTestBase.java:82)
	at sun.reflect.NativeMethodAccessorImpl.invoke0(Native Method)
	at sun.reflect.NativeMethodAccessorImpl.invoke(NativeMethodAccessorImpl.java:62)
	at sun.reflect.DelegatingMethodAccessorImpl.invoke(DelegatingMethodAccessorImpl.java:43)
	at java.lang.reflect.Method.invoke(Method.java:498)
(39 more lines...)
java.util.concurrent.TimeoutException: Timeout occurred. Expected true but found false.
	at co.cask.cdap.common.utils.Tasks.waitFor(Tasks.java:70)
	at co.cask.cdap.common.utils.Tasks.waitFor(Tasks.java:91)
	at co.cask.cdap.app.etl.ETLTestBase.setup(ETLTestBase.java:82)
	at sun.reflect.NativeMethodAccessorImpl.invoke0(Native Method)
	at sun.reflect.NativeMethodAccessorImpl.invoke(NativeMethodAccessorImpl.java:62)
	at sun.reflect.DelegatingMethodAccessorImpl.invoke(DelegatingMethodAccessorImpl.java:43)
	at java.lang.reflect.Method.invoke(Method.java:498)
(39 more lines...)
java.util.concurrent.TimeoutException: Timeout occurred. Expected true but found false.
	at co.cask.cdap.common.utils.Tasks.waitFor(Tasks.java:70)
	at co.cask.cdap.common.utils.Tasks.waitFor(Tasks.java:91)
	at co.cask.cdap.app.etl.ETLTestBase.setup(ETLTestBase.java:82)
	at sun.reflect.NativeMethodAccessorImpl.invoke0(Native Method)
	at sun.reflect.NativeMethodAccessorImpl.invoke(NativeMethodAccessorImpl.java:62)
	at sun.reflect.DelegatingMethodAccessorImpl.invoke(DelegatingMethodAccessorImpl.java:43)
	at java.lang.reflect.Method.invoke(Method.java:498)
(39 more lines...)
java.util.concurrent.TimeoutException: Timeout occurred. Expected true but found false.
	at co.cask.cdap.common.utils.Tasks.waitFor(Tasks.java:70)
	at co.cask.cdap.common.utils.Tasks.waitFor(Tasks.java:91)
	at co.cask.cdap.app.etl.ETLTestBase.setup(ETLTestBase.java:82)
	at sun.reflect.NativeMethodAccessorImpl.invoke0(Native Method)
	at sun.reflect.NativeMethodAccessorImpl.invoke(NativeMethodAccessorImpl.java:62)
	at sun.reflect.DelegatingMethodAccessorImpl.invoke(DelegatingMethodAccessorImpl.java:43)
	at java.lang.reflect.Method.invoke(Method.java:498)
(39 more lines...)
java.util.concurrent.TimeoutException: Timeout occurred. Expected true but found false.
	at co.cask.cdap.common.utils.Tasks.waitFor(Tasks.java:70)
	at co.cask.cdap.common.utils.Tasks.waitFor(Tasks.java:91)
	at co.cask.cdap.app.etl.ETLTestBase.setup(ETLTestBase.java:82)
	at sun.reflect.NativeMethodAccessorImpl.invoke0(Native Method)
	at sun.reflect.NativeMethodAccessorImpl.invoke(NativeMethodAccessorImpl.java:62)
	at sun.reflect.DelegatingMethodAccessorImpl.invoke(DelegatingMethodAccessorImpl.java:43)
	at java.lang.reflect.Method.invoke(Method.java:498)
(39 more lines...)
java.util.concurrent.TimeoutException: Timeout occurred. Expected true but found false.
	at co.cask.cdap.common.utils.Tasks.waitFor(Tasks.java:70)
	at co.cask.cdap.common.utils.Tasks.waitFor(Tasks.java:91)
	at co.cask.cdap.app.etl.ETLTestBase.setup(ETLTestBase.java:82)
	at sun.reflect.NativeMethodAccessorImpl.invoke0(Native Method)
	at sun.reflect.NativeMethodAccessorImpl.invoke(NativeMethodAccessorImpl.java:62)
	at sun.reflect.DelegatingMethodAccessorImpl.invoke(DelegatingMethodAccessorImpl.java:43)
	at java.lang.reflect.Method.invoke(Method.java:498)
(39 more lines...)
java.util.concurrent.TimeoutException: Timeout occurred. Expected true but found false.
	at co.cask.cdap.common.utils.Tasks.waitFor(Tasks.java:70)
	at co.cask.cdap.common.utils.Tasks.waitFor(Tasks.java:91)
	at co.cask.cdap.app.etl.ETLTestBase.setup(ETLTestBase.java:82)
	at sun.reflect.NativeMethodAccessorImpl.invoke0(Native Method)
	at sun.reflect.NativeMethodAccessorImpl.invoke(NativeMethodAccessorImpl.java:62)
	at sun.reflect.DelegatingMethodAccessorImpl.invoke(DelegatingMethodAccessorImpl.java:43)
	at java.lang.reflect.Method.invoke(Method.java:498)
(39 more lines...)
java.util.concurrent.TimeoutException: Timeout occurred. Expected true but found false.
	at co.cask.cdap.common.utils.Tasks.waitFor(Tasks.java:70)
	at co.cask.cdap.common.utils.Tasks.waitFor(Tasks.java:91)
	at co.cask.cdap.app.etl.ETLTestBase.setup(ETLTestBase.java:82)
	at sun.reflect.NativeMethodAccessorImpl.invoke0(Native Method)
	at sun.reflect.NativeMethodAccessorImpl.invoke(NativeMethodAccessorImpl.java:62)
	at sun.reflect.DelegatingMethodAccessorImpl.invoke(DelegatingMethodAccessorImpl.java:43)
	at java.lang.reflect.Method.invoke(Method.java:498)
(39 more lines...)
java.util.concurrent.TimeoutException: Timeout occurred. Expected true but found false.
	at co.cask.cdap.common.utils.Tasks.waitFor(Tasks.java:70)
	at co.cask.cdap.common.utils.Tasks.waitFor(Tasks.java:91)
	at co.cask.cdap.app.etl.ETLTestBase.setup(ETLTestBase.java:82)
	at sun.reflect.NativeMethodAccessorImpl.invoke0(Native Method)
	at sun.reflect.NativeMethodAccessorImpl.invoke(NativeMethodAccessorImpl.java:62)
	at sun.reflect.DelegatingMethodAccessorImpl.invoke(DelegatingMethodAccessorImpl.java:43)
	at java.lang.reflect.Method.invoke(Method.java:498)
(39 more lines...)
java.util.concurrent.TimeoutException: Timeout occurred. Expected true but found false.
	at co.cask.cdap.common.utils.Tasks.waitFor(Tasks.java:70)
	at co.cask.cdap.common.utils.Tasks.waitFor(Tasks.java:91)
	at co.cask.cdap.app.etl.ETLTestBase.setup(ETLTestBase.java:82)
	at sun.reflect.NativeMethodAccessorImpl.invoke0(Native Method)
	at sun.reflect.NativeMethodAccessorImpl.invoke(NativeMethodAccessorImpl.java:62)
	at sun.reflect.DelegatingMethodAccessorImpl.invoke(DelegatingMethodAccessorImpl.java:43)
	at java.lang.reflect.Method.invoke(Method.java:498)
(39 more lines...)
java.util.concurrent.TimeoutException: Timeout occurred. Expected true but found false.
	at co.cask.cdap.common.utils.Tasks.waitFor(Tasks.java:70)
	at co.cask.cdap.common.utils.Tasks.waitFor(Tasks.java:91)
	at co.cask.cdap.app.etl.ETLTestBase.setup(ETLTestBase.java:82)
	at sun.reflect.NativeMethodAccessorImpl.invoke0(Native Method)
	at sun.reflect.NativeMethodAccessorImpl.invoke(NativeMethodAccessorImpl.java:62)
	at sun.reflect.DelegatingMethodAccessorImpl.invoke(DelegatingMethodAccessorImpl.java:43)
	at java.lang.reflect.Method.invoke(Method.java:498)
(39 more lines...)
java.util.concurrent.TimeoutException: Timeout occurred. Expected true but found false.
	at co.cask.cdap.common.utils.Tasks.waitFor(Tasks.java:70)
	at co.cask.cdap.common.utils.Tasks.waitFor(Tasks.java:91)
	at co.cask.cdap.app.etl.ETLTestBase.setup(ETLTestBase.java:82)
	at sun.reflect.NativeMethodAccessorImpl.invoke0(Native Method)
	at sun.reflect.NativeMethodAccessorImpl.invoke(NativeMethodAccessorImpl.java:62)
	at sun.reflect.DelegatingMethodAccessorImpl.invoke(DelegatingMethodAccessorImpl.java:43)
	at java.lang.reflect.Method.invoke(Method.java:498)
(39 more lines...)
java.util.concurrent.TimeoutException: Timeout occurred. Expected true but found false.
	at co.cask.cdap.common.utils.Tasks.waitFor(Tasks.java:70)
	at co.cask.cdap.common.utils.Tasks.waitFor(Tasks.java:91)
	at co.cask.cdap.app.etl.ETLTestBase.setup(ETLTestBase.java:82)
	at sun.reflect.NativeMethodAccessorImpl.invoke0(Native Method)
	at sun.reflect.NativeMethodAccessorImpl.invoke(NativeMethodAccessorImpl.java:62)
	at sun.reflect.DelegatingMethodAccessorImpl.invoke(DelegatingMethodAccessorImpl.java:43)
	at java.lang.reflect.Method.invoke(Method.java:498)
(40 more lines...)
java.util.concurrent.TimeoutException: Timeout occurred. Expected true but found false.
	at co.cask.cdap.common.utils.Tasks.waitFor(Tasks.java:70)
	at co.cask.cdap.common.utils.Tasks.waitFor(Tasks.java:91)
	at co.cask.cdap.app.etl.ETLTestBase.setup(ETLTestBase.java:82)
	at sun.reflect.NativeMethodAccessorImpl.invoke0(Native Method)
	at sun.reflect.NativeMethodAccessorImpl.invoke(NativeMethodAccessorImpl.java:62)
	at sun.reflect.DelegatingMethodAccessorImpl.invoke(DelegatingMethodAccessorImpl.java:43)
	at java.lang.reflect.Method.invoke(Method.java:498)
(40 more lines...)
java.util.concurrent.TimeoutException: Timeout occurred. Expected true but found false.
	at co.cask.cdap.common.utils.Tasks.waitFor(Tasks.java:70)
	at co.cask.cdap.common.utils.Tasks.waitFor(Tasks.java:91)
	at co.cask.cdap.app.etl.ETLTestBase.setup(ETLTestBase.java:82)
	at sun.reflect.GeneratedMethodAccessor5.invoke(Unknown Source)
	at sun.reflect.DelegatingMethodAccessorImpl.invoke(DelegatingMethodAccessorImpl.java:43)
	at java.lang.reflect.Method.invoke(Method.java:498)
	at org.junit.runners.model.FrameworkMethod$1.runReflectiveCall(FrameworkMethod.java:47)
(38 more lines...)
java.util.concurrent.TimeoutException: Timeout occurred. Expected true but found false.
	at co.cask.cdap.common.utils.Tasks.waitFor(Tasks.java:70)
	at co.cask.cdap.common.utils.Tasks.waitFor(Tasks.java:91)
	at co.cask.cdap.app.etl.ETLTestBase.setup(ETLTestBase.java:82)
	at sun.reflect.GeneratedMethodAccessor5.invoke(Unknown Source)
	at sun.reflect.DelegatingMethodAccessorImpl.invoke(DelegatingMethodAccessorImpl.java:43)
	at java.lang.reflect.Method.invoke(Method.java:498)
	at org.junit.runners.model.FrameworkMethod$1.runReflectiveCall(FrameworkMethod.java:47)
(38 more lines...)
java.util.concurrent.TimeoutException: Timeout occurred. Expected true but found false.
	at co.cask.cdap.common.utils.Tasks.waitFor(Tasks.java:70)
	at co.cask.cdap.common.utils.Tasks.waitFor(Tasks.java:91)
	at co.cask.cdap.app.etl.ETLTestBase.setup(ETLTestBase.java:82)
	at sun.reflect.GeneratedMethodAccessor5.invoke(Unknown Source)
	at sun.reflect.DelegatingMethodAccessorImpl.invoke(DelegatingMethodAccessorImpl.java:43)
	at java.lang.reflect.Method.invoke(Method.java:498)
	at org.junit.runners.model.FrameworkMethod$1.runReflectiveCall(FrameworkMethod.java:47)
(38 more lines...)
java.util.concurrent.TimeoutException: Timeout occurred. Expected true but found false.
	at co.cask.cdap.common.utils.Tasks.waitFor(Tasks.java:70)
	at co.cask.cdap.common.utils.Tasks.waitFor(Tasks.java:91)
	at co.cask.cdap.app.etl.ETLTestBase.setup(ETLTestBase.java:82)
	at sun.reflect.GeneratedMethodAccessor5.invoke(Unknown Source)
	at sun.reflect.DelegatingMethodAccessorImpl.invoke(DelegatingMethodAccessorImpl.java:43)
	at java.lang.reflect.Method.invoke(Method.java:498)
	at org.junit.runners.model.FrameworkMethod$1.runReflectiveCall(FrameworkMethod.java:47)
(38 more lines...)
java.util.concurrent.TimeoutException: Timeout occurred. Expected true but found false.
	at co.cask.cdap.common.utils.Tasks.waitFor(Tasks.java:70)
	at co.cask.cdap.common.utils.Tasks.waitFor(Tasks.java:91)
	at co.cask.cdap.app.etl.ETLTestBase.setup(ETLTestBase.java:82)
	at sun.reflect.GeneratedMethodAccessor5.invoke(Unknown Source)
	at sun.reflect.DelegatingMethodAccessorImpl.invoke(DelegatingMethodAccessorImpl.java:43)
	at java.lang.reflect.Method.invoke(Method.java:498)
	at org.junit.runners.model.FrameworkMethod$1.runReflectiveCall(FrameworkMethod.java:47)
(38 more lines...)
java.util.concurrent.TimeoutException: Timeout occurred. Expected true but found false.
	at co.cask.cdap.common.utils.Tasks.waitFor(Tasks.java:70)
	at co.cask.cdap.common.utils.Tasks.waitFor(Tasks.java:91)
	at co.cask.cdap.app.etl.ETLTestBase.setup(ETLTestBase.java:82)
	at sun.reflect.GeneratedMethodAccessor5.invoke(Unknown Source)
	at sun.reflect.DelegatingMethodAccessorImpl.invoke(DelegatingMethodAccessorImpl.java:43)
	at java.lang.reflect.Method.invoke(Method.java:498)
	at org.junit.runners.model.FrameworkMethod$1.runReflectiveCall(FrameworkMethod.java:47)
(38 more lines...)
java.util.concurrent.TimeoutException: Timeout occurred. Expected true but found false.
	at co.cask.cdap.common.utils.Tasks.waitFor(Tasks.java:70)
	at co.cask.cdap.common.utils.Tasks.waitFor(Tasks.java:91)
	at co.cask.cdap.app.etl.ETLTestBase.setup(ETLTestBase.java:82)
	at sun.reflect.GeneratedMethodAccessor5.invoke(Unknown Source)
	at sun.reflect.DelegatingMethodAccessorImpl.invoke(DelegatingMethodAccessorImpl.java:43)
	at java.lang.reflect.Method.invoke(Method.java:498)
	at org.junit.runners.model.FrameworkMethod$1.runReflectiveCall(FrameworkMethod.java:47)
(38 more lines...)
java.util.concurrent.TimeoutException: Timeout occurred. Expected true but found false.
	at co.cask.cdap.common.utils.Tasks.waitFor(Tasks.java:70)
	at co.cask.cdap.common.utils.Tasks.waitFor(Tasks.java:91)
	at co.cask.cdap.app.etl.ETLTestBase.setup(ETLTestBase.java:82)
	at sun.reflect.GeneratedMethodAccessor5.invoke(Unknown Source)
	at sun.reflect.DelegatingMethodAccessorImpl.invoke(DelegatingMethodAccessorImpl.java:43)
	at java.lang.reflect.Method.invoke(Method.java:498)
	at org.junit.runners.model.FrameworkMethod$1.runReflectiveCall(FrameworkMethod.java:47)
(38 more lines...)
java.util.concurrent.TimeoutException: Timeout occurred. Expected true but found false.
	at co.cask.cdap.common.utils.Tasks.waitFor(Tasks.java:70)
	at co.cask.cdap.common.utils.Tasks.waitFor(Tasks.java:91)
	at co.cask.cdap.app.etl.ETLTestBase.setup(ETLTestBase.java:82)
	at sun.reflect.GeneratedMethodAccessor5.invoke(Unknown Source)
	at sun.reflect.DelegatingMethodAccessorImpl.invoke(DelegatingMethodAccessorImpl.java:43)
	at java.lang.reflect.Method.invoke(Method.java:498)
	at org.junit.runners.model.FrameworkMethod$1.runReflectiveCall(FrameworkMethod.java:47)
(38 more lines...)
java.util.concurrent.TimeoutException: Timeout occurred. Expected true but found false.
	at co.cask.cdap.common.utils.Tasks.waitFor(Tasks.java:70)
	at co.cask.cdap.common.utils.Tasks.waitFor(Tasks.java:91)
	at co.cask.cdap.app.etl.ETLTestBase.setup(ETLTestBase.java:82)
	at sun.reflect.NativeMethodAccessorImpl.invoke0(Native Method)
	at sun.reflect.NativeMethodAccessorImpl.invoke(NativeMethodAccessorImpl.java:62)
	at sun.reflect.DelegatingMethodAccessorImpl.invoke(DelegatingMethodAccessorImpl.java:43)
	at java.lang.reflect.Method.invoke(Method.java:498)
(39 more lines...)
java.util.concurrent.TimeoutException: Timeout occurred. Expected true but found false.
	at co.cask.cdap.common.utils.Tasks.waitFor(Tasks.java:70)
	at co.cask.cdap.common.utils.Tasks.waitFor(Tasks.java:91)
	at co.cask.cdap.app.etl.ETLTestBase.setup(ETLTestBase.java:82)
	at sun.reflect.GeneratedMethodAccessor5.invoke(Unknown Source)
	at sun.reflect.DelegatingMethodAccessorImpl.invoke(DelegatingMethodAccessorImpl.java:43)
	at java.lang.reflect.Method.invoke(Method.java:498)
	at org.junit.runners.model.FrameworkMethod$1.runReflectiveCall(FrameworkMethod.java:47)
(38 more lines...)
java.util.concurrent.TimeoutException: Timeout occurred. Expected true but found false.
	at co.cask.cdap.common.utils.Tasks.waitFor(Tasks.java:70)
	at co.cask.cdap.common.utils.Tasks.waitFor(Tasks.java:91)
	at co.cask.cdap.app.etl.ETLTestBase.setup(ETLTestBase.java:82)
	at sun.reflect.GeneratedMethodAccessor5.invoke(Unknown Source)
	at sun.reflect.DelegatingMethodAccessorImpl.invoke(DelegatingMethodAccessorImpl.java:43)
	at java.lang.reflect.Method.invoke(Method.java:498)
	at org.junit.runners.model.FrameworkMethod$1.runReflectiveCall(FrameworkMethod.java:47)
(38 more lines...)
java.util.concurrent.TimeoutException: Timeout occurred. Expected true but found false.
	at co.cask.cdap.common.utils.Tasks.waitFor(Tasks.java:70)
	at co.cask.cdap.common.utils.Tasks.waitFor(Tasks.java:91)
	at co.cask.cdap.app.etl.ETLTestBase.setup(ETLTestBase.java:82)
	at sun.reflect.GeneratedMethodAccessor5.invoke(Unknown Source)
	at sun.reflect.DelegatingMethodAccessorImpl.invoke(DelegatingMethodAccessorImpl.java:43)
	at java.lang.reflect.Method.invoke(Method.java:498)
	at org.junit.runners.model.FrameworkMethod$1.runReflectiveCall(FrameworkMethod.java:47)
(38 more lines...)
java.io.IOException: 503: No discoverable found for request GET /v3/namespaces/itncm/apps/PermissionApp/versions/-SNAPSHOT/services/FileService/methods/list/input HTTP/1.1
	at co.cask.cdap.client.util.RESTClient.execute(RESTClient.java:132)
	at co.cask.cdap.client.util.RESTClient.execute(RESTClient.java:69)
	at co.cask.cdap.app.fileset.PermissionTest.validateGroupAndPermissions(PermissionTest.java:227)
	at co.cask.cdap.app.fileset.PermissionTest.validateGroupAndPermissions(PermissionTest.java:220)
	at co.cask.cdap.app.fileset.PermissionTest.test(PermissionTest.java:110)
java.util.concurrent.TimeoutException: Timeout occurred. Expected true but found false.
	at co.cask.cdap.common.utils.Tasks.waitFor(Tasks.java:70)
	at co.cask.cdap.common.utils.Tasks.waitFor(Tasks.java:91)
	at co.cask.cdap.common.utils.Tasks.waitFor(Tasks.java:130)
	at co.cask.cdap.test.AbstractProgramManager.waitForRuns(AbstractProgramManager.java:81)
	at co.cask.cdap.test.AbstractProgramManager.waitForRun(AbstractProgramManager.java:75)
	at co.cask.cdap.app.mapreduce.readless.ReadlessIncrementTest.testReadlessIncrementsInMapReduce(ReadlessIncrementTest.java:67)
java.util.concurrent.ExecutionException: java.lang.RuntimeException: java.io.IOException: 503: No discoverable found for request POST /v3/namespaces/itncm/apps/HangingWorkerDataset/versions/-SNAPSHOT/services/DatasetService/methods/read HTTP/1.1
	at co.cask.cdap.client.util.RESTClient.execute(RESTClient.java:132)
	at co.cask.cdap.client.util.RESTClient.execute(RESTClient.java:91)
	at co.cask.cdap.remote.dataset.kvtable.RemoteKeyValueTable.doPost(RemoteKeyValueTable.java:170)
	at co.cask.cdap.remote.dataset.kvtable.RemoteKeyValueTable.doPost(RemoteKeyValueTable.java:163)
	at co.cask.cdap.remote.dataset.kvtable.RemoteKeyValueTable.read(RemoteKeyValueTable.java:77)
	at co.cask.cdap.remote.dataset.kvtable.RemoteKeyValueTable.read(RemoteKeyValueTable.java:70)
	at co.cask.cdap.app.restart.HangingWorkerTest$1.call(HangingWorkerTest.java:61)
(3 more lines...)
java.io.IOException: 503: No discoverable found for request GET /v3/namespaces/itncm/apps/ServiceApplication/versions/-SNAPSHOT/services/HttpService/methods/read/testKey HTTP/1.1
	at co.cask.cdap.client.util.RESTClient.execute(RESTClient.java:132)
	at co.cask.cdap.client.util.RESTClient.execute(RESTClient.java:69)
	at co.cask.cdap.app.serviceworker.ServiceWorkerTest.test(ServiceWorkerTest.java:82)
java.io.IOException: 503: No discoverable found for request GET /v3/namespaces/itncm/apps/ConfigTestApp/services/simpleService/methods/ping HTTP/1.1
	at co.cask.cdap.client.util.RESTClient.execute(RESTClient.java:132)
	at co.cask.cdap.client.util.RESTClient.execute(RESTClient.java:74)
	at co.cask.cdap.client.ServiceClient.callServiceMethod(ServiceClient.java:230)
	at co.cask.cdap.apps.ApplicationVersionTest.testRouteConfig(ApplicationVersionTest.java:168)
java.io.IOException: 503: No discoverable found for request GET /v3/namespaces/itncm/apps/ConfigTestApp/versions/v1-SNAPSHOT/services/simpleService/methods/ping HTTP/1.1
	at co.cask.cdap.client.util.RESTClient.execute(RESTClient.java:132)
	at co.cask.cdap.client.util.RESTClient.execute(RESTClient.java:69)
	at co.cask.cdap.apps.ApplicationVersionTest.testAppVersionsCreationUpdateDeletion(ApplicationVersionTest.java:106)
java.util.concurrent.TimeoutException: Time limit reached. Got '0' instead of '1'
	at co.cask.cdap.client.MetricsClient$3.doWaitFor(MetricsClient.java:286)
	at co.cask.cdap.client.MetricsClient$3.waitForProcessed(MetricsClient.java:256)
	at co.cask.cdap.apps.DatasetTest.test(DatasetTest.java:109)
java.util.concurrent.TimeoutException: Time limit reached. Got '0' instead of '4'
	at co.cask.cdap.client.MetricsClient$3.doWaitFor(MetricsClient.java:286)
	at co.cask.cdap.client.MetricsClient$3.waitForProcessed(MetricsClient.java:256)
	at co.cask.cdap.apps.explore.ExploreTest.sendInputData(ExploreTest.java:245)
	at co.cask.cdap.apps.explore.ExploreTest.test(ExploreTest.java:69)
java.util.concurrent.TimeoutException: Time limit reached. Got '0' instead of '4'
	at co.cask.cdap.client.MetricsClient$3.doWaitFor(MetricsClient.java:286)
	at co.cask.cdap.client.MetricsClient$3.waitForProcessed(MetricsClient.java:256)
	at co.cask.cdap.apps.explore.ExploreTest.sendInputData(ExploreTest.java:245)
	at co.cask.cdap.apps.explore.ExploreTest.testSubqueryInWhereClause(ExploreTest.java:568)
java.io.IOException: 503: No discoverable found for request PUT /v3/namespaces/itncm/apps/FileSetExample/versions/-SNAPSHOT/services/FileSetService/methods/lines?path=myFile.txt HTTP/1.1
	at co.cask.cdap.client.util.RESTClient.execute(RESTClient.java:132)
	at co.cask.cdap.client.util.RESTClient.execute(RESTClient.java:69)
	at co.cask.cdap.apps.fileset.FileSetTest.test(FileSetTest.java:72)
java.io.IOException: 503: No discoverable found for request PUT /v3/namespaces/itncm/apps/PFSApp/versions/-SNAPSHOT/services/PFSService/methods/0 HTTP/1.1
	at co.cask.cdap.client.util.RESTClient.execute(RESTClient.java:132)
	at co.cask.cdap.client.util.RESTClient.execute(RESTClient.java:69)
	at co.cask.cdap.apps.fileset.PartitionCorrectorTest.test(PartitionCorrectorTest.java:65)
java.io.IOException: 503: No discoverable found for request PUT /v3/namespaces/itncm/apps/PFSApp/versions/-SNAPSHOT/services/PFSService/methods/1 HTTP/1.1
	at co.cask.cdap.client.util.RESTClient.execute(RESTClient.java:132)
	at co.cask.cdap.client.util.RESTClient.execute(RESTClient.java:69)
	at co.cask.cdap.apps.fileset.PartitionedFileSetUpdateTest.test(PartitionedFileSetUpdateTest.java:74)
java.util.concurrent.TimeoutException: Time limit reached. Got '0' instead of '1'
	at co.cask.cdap.client.MetricsClient$3.doWaitFor(MetricsClient.java:286)
	at co.cask.cdap.client.MetricsClient$3.waitForProcessed(MetricsClient.java:256)
	at co.cask.cdap.apps.metadata.PurchaseMetadataTest.testLineage(PurchaseMetadataTest.java:121)
java.util.concurrent.TimeoutException: Time limit reached. Got '0' instead of '1'
	at co.cask.cdap.client.MetricsClient$3.doWaitFor(MetricsClient.java:286)
	at co.cask.cdap.client.MetricsClient$3.waitForProcessed(MetricsClient.java:256)
	at co.cask.cdap.apps.purchase.PurchaseAudiTest.test(PurchaseAudiTest.java:95)
java.util.concurrent.TimeoutException: Timeout occurred. Expected true but found false.
	at co.cask.cdap.common.utils.Tasks.waitFor(Tasks.java:70)
	at co.cask.cdap.common.utils.Tasks.waitFor(Tasks.java:91)
	at co.cask.cdap.common.utils.Tasks.waitFor(Tasks.java:130)
	at co.cask.cdap.test.AbstractProgramManager.waitForRuns(AbstractProgramManager.java:81)
	at co.cask.cdap.test.AbstractProgramManager.waitForRun(AbstractProgramManager.java:75)
	at co.cask.cdap.apps.spark.sparkpagerank.SparkPageRankAppTest.test(SparkPageRankAppTest.java:141)
java.util.concurrent.TimeoutException: Time limit reached. Got '0' instead of '20'
	at co.cask.cdap.client.MetricsClient$3.doWaitFor(MetricsClient.java:286)
	at co.cask.cdap.client.MetricsClient$3.waitForProcessed(MetricsClient.java:256)
	at co.cask.cdap.apps.tracker.TrackerTestBase.waitforProcessed(TrackerTestBase.java:115)
	at co.cask.cdap.apps.tracker.TrackerTest.test(TrackerTest.java:52)
java.util.concurrent.TimeoutException: Time limit reached. Got '0' instead of '1'
	at co.cask.cdap.client.MetricsClient$3.doWaitFor(MetricsClient.java:286)
	at co.cask.cdap.client.MetricsClient$3.waitForProcessed(MetricsClient.java:256)
	at co.cask.cdap.apps.transaction.TransactionTimeoutTest.testFlowletTimeouts(TransactionTimeoutTest.java:65)
java.util.concurrent.TimeoutException: Time limit reached. Got '0' instead of '2'
	at co.cask.cdap.client.MetricsClient$3.doWaitFor(MetricsClient.java:286)
	at co.cask.cdap.client.MetricsClient$3.waitForProcessed(MetricsClient.java:256)
	at co.cask.cdap.apps.wordcount.WordCountTest.test(WordCountTest.java:92)
java.lang.RuntimeException: java.io.IOException: 503: No discoverable found for request POST /v3/namespaces/itncm/apps/myCube/versions/-SNAPSHOT/services/DatasetService/methods/add HTTP/1.1
	at co.cask.cdap.client.util.RESTClient.execute(RESTClient.java:132)
	at co.cask.cdap.client.util.RESTClient.execute(RESTClient.java:91)
	at co.cask.cdap.remote.dataset.cube.RemoteCube.doPost(RemoteCube.java:116)
	at co.cask.cdap.remote.dataset.cube.RemoteCube.add(RemoteCube.java:72)
	at co.cask.cdap.remote.dataset.test.RemoteCubeTest.test(RemoteCubeTest.java:66)
java.lang.RuntimeException: java.io.IOException: 503: No discoverable found for request POST /v3/namespaces/itncm/apps/kvTable/versions/-SNAPSHOT/services/DatasetService/methods/read HTTP/1.1
	at co.cask.cdap.client.util.RESTClient.execute(RESTClient.java:132)
	at co.cask.cdap.client.util.RESTClient.execute(RESTClient.java:91)
	at co.cask.cdap.remote.dataset.kvtable.RemoteKeyValueTable.doPost(RemoteKeyValueTable.java:170)
	at co.cask.cdap.remote.dataset.kvtable.RemoteKeyValueTable.doPost(RemoteKeyValueTable.java:163)
	at co.cask.cdap.remote.dataset.kvtable.RemoteKeyValueTable.read(RemoteKeyValueTable.java:77)
	at co.cask.cdap.remote.dataset.kvtable.RemoteKeyValueTable.read(RemoteKeyValueTable.java:70)
	at co.cask.cdap.remote.dataset.test.RemoteKeyValueTest.test(RemoteKeyValueTest.java:37)
java.lang.RuntimeException: java.io.IOException: 503: No discoverable found for request POST /v3/namespaces/itncm/apps/table/versions/-SNAPSHOT/services/DatasetService/methods/get HTTP/1.1
	at co.cask.cdap.client.util.RESTClient.execute(RESTClient.java:132)
	at co.cask.cdap.client.util.RESTClient.execute(RESTClient.java:91)
	at co.cask.cdap.remote.dataset.table.RemoteTable.doPost(RemoteTable.java:139)
	at co.cask.cdap.remote.dataset.table.RemoteTable.doPost(RemoteTable.java:132)
	at co.cask.cdap.remote.dataset.table.RemoteTable.get(RemoteTable.java:64)
	at co.cask.cdap.remote.dataset.test.RemoteTableTest.test(RemoteTableTest.java:40)
Fixed tests 1
Status Test Failing since View job Duration
Successful WorkflowTest testKMeans History
Failing since build #135 (Scheduled) Cloudera Manager - 5.12 7 mins