Build #45

Build: #45 failed Scheduled

Stages & jobs

  1. Variables

  2. Spinup and Test

Build result summary

Details

Completed
Duration
729 minutes
Labels
None
Revisions
CDAP Integration Tests
4916a5d854c04e668aa7428dd0aeb0457b68aeff 4916a5d854c04e668aa7428dd0aeb0457b68aeff
Coopr-internal
e9483d7b778fc52faaec1bca4f5183a2c60ca351 e9483d7b778fc52faaec1bca4f5183a2c60ca351
Total tests
64
Failing since
#34 (Scheduled – )
Fixed in
#47 (Scheduled)

Responsible

This build has been failing since #34
No one has taken responsibility

Configuration changes

Plan configuration has changed since the last successful build. See the plan audit log for more details.

Tests

New test failures 63
Status Test View job Duration
Collapse Failed KVTableWithProjectionTest testKVTableWithProjection History

Failing on the develop branch.

Ambari - HDP 2.6 10 mins
java.lang.RuntimeException: java.util.concurrent.TimeoutException: CDAP Services are not available. Retried for 600 seconds.
	at com.google.common.base.Throwables.propagate(Throwables.java:160)
	at co.cask.cdap.test.IntegrationTestBase.checkSystemServices(IntegrationTestBase.java:206)
	at co.cask.cdap.test.IntegrationTestBase.setUp(IntegrationTestBase.java:101)
	at sun.reflect.GeneratedMethodAccessor1.invoke(Unknown Source)
	at sun.reflect.DelegatingMethodAccessorImpl.invoke(DelegatingMethodAccessorImpl.java:43)
	at java.lang.reflect.Method.invoke(Method.java:498)
	at org.junit.runners.model.FrameworkMethod$1.runReflectiveCall(FrameworkMethod.java:47)
(68 more lines...)
Collapse Failed StreamTPFSWithProjectionTest testStreamTPFSWithProjection History

Failing on the develop branch.

Ambari - HDP 2.6 10 mins
java.lang.RuntimeException: java.util.concurrent.TimeoutException: CDAP Services are not available. Retried for 600 seconds.
	at com.google.common.base.Throwables.propagate(Throwables.java:160)
	at co.cask.cdap.test.IntegrationTestBase.checkSystemServices(IntegrationTestBase.java:206)
	at co.cask.cdap.test.IntegrationTestBase.setUp(IntegrationTestBase.java:101)
	at sun.reflect.GeneratedMethodAccessor1.invoke(Unknown Source)
	at sun.reflect.DelegatingMethodAccessorImpl.invoke(DelegatingMethodAccessorImpl.java:43)
	at java.lang.reflect.Method.invoke(Method.java:498)
	at org.junit.runners.model.FrameworkMethod$1.runReflectiveCall(FrameworkMethod.java:47)
(68 more lines...)
Collapse Failed BatchAggregatorTest test History

Failing on the develop branch.

Ambari - HDP 2.6 10 mins
java.lang.RuntimeException: java.util.concurrent.TimeoutException: CDAP Services are not available. Retried for 600 seconds.
	at com.google.common.base.Throwables.propagate(Throwables.java:160)
	at co.cask.cdap.test.IntegrationTestBase.checkSystemServices(IntegrationTestBase.java:206)
	at co.cask.cdap.test.IntegrationTestBase.setUp(IntegrationTestBase.java:101)
	at sun.reflect.NativeMethodAccessorImpl.invoke0(Native Method)
	at sun.reflect.NativeMethodAccessorImpl.invoke(NativeMethodAccessorImpl.java:62)
	at sun.reflect.DelegatingMethodAccessorImpl.invoke(DelegatingMethodAccessorImpl.java:43)
	at java.lang.reflect.Method.invoke(Method.java:498)
(70 more lines...)
Collapse Failed BatchCubeSinkTest test History

Failing on the develop branch.

Ambari - HDP 2.6 10 mins
java.lang.RuntimeException: java.util.concurrent.TimeoutException: CDAP Services are not available. Retried for 600 seconds.
	at com.google.common.base.Throwables.propagate(Throwables.java:160)
	at co.cask.cdap.test.IntegrationTestBase.checkSystemServices(IntegrationTestBase.java:206)
	at co.cask.cdap.test.IntegrationTestBase.setUp(IntegrationTestBase.java:101)
	at sun.reflect.NativeMethodAccessorImpl.invoke0(Native Method)
	at sun.reflect.NativeMethodAccessorImpl.invoke(NativeMethodAccessorImpl.java:62)
	at sun.reflect.DelegatingMethodAccessorImpl.invoke(DelegatingMethodAccessorImpl.java:43)
	at java.lang.reflect.Method.invoke(Method.java:498)
(70 more lines...)
Collapse Failed BatchJoinerTest testJoinerMR History

Failing on the develop branch.

Ambari - HDP 2.6 10 mins
java.lang.RuntimeException: java.util.concurrent.TimeoutException: CDAP Services are not available. Retried for 600 seconds.
	at com.google.common.base.Throwables.propagate(Throwables.java:160)
	at co.cask.cdap.test.IntegrationTestBase.checkSystemServices(IntegrationTestBase.java:206)
	at co.cask.cdap.test.IntegrationTestBase.setUp(IntegrationTestBase.java:101)
	at sun.reflect.NativeMethodAccessorImpl.invoke0(Native Method)
	at sun.reflect.NativeMethodAccessorImpl.invoke(NativeMethodAccessorImpl.java:62)
	at sun.reflect.DelegatingMethodAccessorImpl.invoke(DelegatingMethodAccessorImpl.java:43)
	at java.lang.reflect.Method.invoke(Method.java:498)
(70 more lines...)
Collapse Failed BatchJoinerTest testJoinerSpark History

Failing on the develop branch.

Ambari - HDP 2.6 10 mins
java.lang.RuntimeException: java.util.concurrent.TimeoutException: CDAP Services are not available. Retried for 600 seconds.
	at com.google.common.base.Throwables.propagate(Throwables.java:160)
	at co.cask.cdap.test.IntegrationTestBase.checkSystemServices(IntegrationTestBase.java:206)
	at co.cask.cdap.test.IntegrationTestBase.setUp(IntegrationTestBase.java:101)
	at sun.reflect.NativeMethodAccessorImpl.invoke0(Native Method)
	at sun.reflect.NativeMethodAccessorImpl.invoke(NativeMethodAccessorImpl.java:62)
	at sun.reflect.DelegatingMethodAccessorImpl.invoke(DelegatingMethodAccessorImpl.java:43)
	at java.lang.reflect.Method.invoke(Method.java:498)
(70 more lines...)
Collapse Failed ETLMapReduceTest testTableToTableWithValidations History

Failing on the develop branch.

Ambari - HDP 2.6 10 mins
java.lang.RuntimeException: java.util.concurrent.TimeoutException: CDAP Services are not available. Retried for 600 seconds.
	at com.google.common.base.Throwables.propagate(Throwables.java:160)
	at co.cask.cdap.test.IntegrationTestBase.checkSystemServices(IntegrationTestBase.java:206)
	at co.cask.cdap.test.IntegrationTestBase.setUp(IntegrationTestBase.java:101)
	at sun.reflect.NativeMethodAccessorImpl.invoke0(Native Method)
	at sun.reflect.NativeMethodAccessorImpl.invoke(NativeMethodAccessorImpl.java:62)
	at sun.reflect.DelegatingMethodAccessorImpl.invoke(DelegatingMethodAccessorImpl.java:43)
	at java.lang.reflect.Method.invoke(Method.java:498)
(70 more lines...)
Collapse Failed ETLMapReduceTest testKVToKV History

Failing on the develop branch.

Ambari - HDP 2.6 10 mins
java.lang.RuntimeException: java.util.concurrent.TimeoutException: CDAP Services are not available. Retried for 600 seconds.
	at com.google.common.base.Throwables.propagate(Throwables.java:160)
	at co.cask.cdap.test.IntegrationTestBase.checkSystemServices(IntegrationTestBase.java:206)
	at co.cask.cdap.test.IntegrationTestBase.setUp(IntegrationTestBase.java:101)
	at sun.reflect.NativeMethodAccessorImpl.invoke0(Native Method)
	at sun.reflect.NativeMethodAccessorImpl.invoke(NativeMethodAccessorImpl.java:62)
	at sun.reflect.DelegatingMethodAccessorImpl.invoke(DelegatingMethodAccessorImpl.java:43)
	at java.lang.reflect.Method.invoke(Method.java:498)
(70 more lines...)
Collapse Failed ETLMapReduceTest testDAGSchemaChanges History

Failing on the develop branch.

Ambari - HDP 2.6 10 mins
java.lang.RuntimeException: java.util.concurrent.TimeoutException: CDAP Services are not available. Retried for 600 seconds.
	at com.google.common.base.Throwables.propagate(Throwables.java:160)
	at co.cask.cdap.test.IntegrationTestBase.checkSystemServices(IntegrationTestBase.java:206)
	at co.cask.cdap.test.IntegrationTestBase.setUp(IntegrationTestBase.java:101)
	at sun.reflect.NativeMethodAccessorImpl.invoke0(Native Method)
	at sun.reflect.NativeMethodAccessorImpl.invoke(NativeMethodAccessorImpl.java:62)
	at sun.reflect.DelegatingMethodAccessorImpl.invoke(DelegatingMethodAccessorImpl.java:43)
	at java.lang.reflect.Method.invoke(Method.java:498)
(70 more lines...)
Collapse Failed ETLMapReduceTest testDAGInvalidSchema History

Failing on the develop branch.

Ambari - HDP 2.6 10 mins
java.lang.RuntimeException: java.util.concurrent.TimeoutException: CDAP Services are not available. Retried for 600 seconds.
	at com.google.common.base.Throwables.propagate(Throwables.java:160)
	at co.cask.cdap.test.IntegrationTestBase.checkSystemServices(IntegrationTestBase.java:206)
	at co.cask.cdap.test.IntegrationTestBase.setUp(IntegrationTestBase.java:101)
	at sun.reflect.NativeMethodAccessorImpl.invoke0(Native Method)
	at sun.reflect.NativeMethodAccessorImpl.invoke(NativeMethodAccessorImpl.java:62)
	at sun.reflect.DelegatingMethodAccessorImpl.invoke(DelegatingMethodAccessorImpl.java:43)
	at java.lang.reflect.Method.invoke(Method.java:498)
(70 more lines...)
Collapse Failed ETLMapReduceTest testDAG History

Failing on the develop branch.

Ambari - HDP 2.6 10 mins
java.lang.RuntimeException: java.util.concurrent.TimeoutException: CDAP Services are not available. Retried for 600 seconds.
	at com.google.common.base.Throwables.propagate(Throwables.java:160)
	at co.cask.cdap.test.IntegrationTestBase.checkSystemServices(IntegrationTestBase.java:206)
	at co.cask.cdap.test.IntegrationTestBase.setUp(IntegrationTestBase.java:101)
	at sun.reflect.NativeMethodAccessorImpl.invoke0(Native Method)
	at sun.reflect.NativeMethodAccessorImpl.invoke(NativeMethodAccessorImpl.java:62)
	at sun.reflect.DelegatingMethodAccessorImpl.invoke(DelegatingMethodAccessorImpl.java:43)
	at java.lang.reflect.Method.invoke(Method.java:498)
(70 more lines...)
Collapse Failed ExcelInputReaderTest testExcelReaderReprocessFalse History

Failing on the develop branch.

Ambari - HDP 2.6 10 mins
java.lang.RuntimeException: java.util.concurrent.TimeoutException: CDAP Services are not available. Retried for 600 seconds.
	at com.google.common.base.Throwables.propagate(Throwables.java:160)
	at co.cask.cdap.test.IntegrationTestBase.checkSystemServices(IntegrationTestBase.java:206)
	at co.cask.cdap.test.IntegrationTestBase.setUp(IntegrationTestBase.java:101)
	at sun.reflect.NativeMethodAccessorImpl.invoke0(Native Method)
	at sun.reflect.NativeMethodAccessorImpl.invoke(NativeMethodAccessorImpl.java:62)
	at sun.reflect.DelegatingMethodAccessorImpl.invoke(DelegatingMethodAccessorImpl.java:43)
	at java.lang.reflect.Method.invoke(Method.java:498)
(70 more lines...)
Collapse Failed ExcelInputReaderTest testExcelReader History

Failing on the develop branch.

Ambari - HDP 2.6 10 mins
java.lang.RuntimeException: java.util.concurrent.TimeoutException: CDAP Services are not available. Retried for 600 seconds.
	at com.google.common.base.Throwables.propagate(Throwables.java:160)
	at co.cask.cdap.test.IntegrationTestBase.checkSystemServices(IntegrationTestBase.java:206)
	at co.cask.cdap.test.IntegrationTestBase.setUp(IntegrationTestBase.java:101)
	at sun.reflect.NativeMethodAccessorImpl.invoke0(Native Method)
	at sun.reflect.NativeMethodAccessorImpl.invoke(NativeMethodAccessorImpl.java:62)
	at sun.reflect.DelegatingMethodAccessorImpl.invoke(DelegatingMethodAccessorImpl.java:43)
	at java.lang.reflect.Method.invoke(Method.java:498)
(70 more lines...)
Collapse Failed HivePluginTest testHivePlugins History

Failing on the develop branch.

Ambari - HDP 2.6 10 mins
java.lang.RuntimeException: java.util.concurrent.TimeoutException: CDAP Services are not available. Retried for 600 seconds.
	at com.google.common.base.Throwables.propagate(Throwables.java:160)
	at co.cask.cdap.test.IntegrationTestBase.checkSystemServices(IntegrationTestBase.java:206)
	at co.cask.cdap.test.IntegrationTestBase.setUp(IntegrationTestBase.java:101)
	at sun.reflect.GeneratedMethodAccessor1.invoke(Unknown Source)
	at sun.reflect.DelegatingMethodAccessorImpl.invoke(DelegatingMethodAccessorImpl.java:43)
	at java.lang.reflect.Method.invoke(Method.java:498)
	at org.junit.runners.model.FrameworkMethod$1.runReflectiveCall(FrameworkMethod.java:47)
(68 more lines...)
Collapse Failed NormalizeTest testNormalizeWithEmptyAttributeValue History

Failing on the develop branch.

Ambari - HDP 2.6 10 mins
java.lang.RuntimeException: java.util.concurrent.TimeoutException: CDAP Services are not available. Retried for 600 seconds.
	at com.google.common.base.Throwables.propagate(Throwables.java:160)
	at co.cask.cdap.test.IntegrationTestBase.checkSystemServices(IntegrationTestBase.java:206)
	at co.cask.cdap.test.IntegrationTestBase.setUp(IntegrationTestBase.java:101)
	at sun.reflect.GeneratedMethodAccessor1.invoke(Unknown Source)
	at sun.reflect.DelegatingMethodAccessorImpl.invoke(DelegatingMethodAccessorImpl.java:43)
	at java.lang.reflect.Method.invoke(Method.java:498)
	at org.junit.runners.model.FrameworkMethod$1.runReflectiveCall(FrameworkMethod.java:47)
(70 more lines...)
Collapse Failed NormalizeTest testNormalize History

Failing on the develop branch.

Ambari - HDP 2.6 10 mins
java.lang.RuntimeException: java.util.concurrent.TimeoutException: CDAP Services are not available. Retried for 600 seconds.
	at com.google.common.base.Throwables.propagate(Throwables.java:160)
	at co.cask.cdap.test.IntegrationTestBase.checkSystemServices(IntegrationTestBase.java:206)
	at co.cask.cdap.test.IntegrationTestBase.setUp(IntegrationTestBase.java:101)
	at sun.reflect.GeneratedMethodAccessor1.invoke(Unknown Source)
	at sun.reflect.DelegatingMethodAccessorImpl.invoke(DelegatingMethodAccessorImpl.java:43)
	at java.lang.reflect.Method.invoke(Method.java:498)
	at org.junit.runners.model.FrameworkMethod$1.runReflectiveCall(FrameworkMethod.java:47)
(70 more lines...)
Collapse Failed RowDenormalizerTest test History

Failing on the develop branch.

Ambari - HDP 2.6 10 mins
java.lang.RuntimeException: java.util.concurrent.TimeoutException: CDAP Services are not available. Retried for 600 seconds.
	at com.google.common.base.Throwables.propagate(Throwables.java:160)
	at co.cask.cdap.test.IntegrationTestBase.checkSystemServices(IntegrationTestBase.java:206)
	at co.cask.cdap.test.IntegrationTestBase.setUp(IntegrationTestBase.java:101)
	at sun.reflect.GeneratedMethodAccessor1.invoke(Unknown Source)
	at sun.reflect.DelegatingMethodAccessorImpl.invoke(DelegatingMethodAccessorImpl.java:43)
	at java.lang.reflect.Method.invoke(Method.java:498)
	at org.junit.runners.model.FrameworkMethod$1.runReflectiveCall(FrameworkMethod.java:47)
(68 more lines...)
Collapse Failed TPFSSinkSourceTest testSpark History

Failing on the develop branch.

Ambari - HDP 2.6 10 mins
java.lang.RuntimeException: java.util.concurrent.TimeoutException: CDAP Services are not available. Retried for 600 seconds.
	at com.google.common.base.Throwables.propagate(Throwables.java:160)
	at co.cask.cdap.test.IntegrationTestBase.checkSystemServices(IntegrationTestBase.java:206)
	at co.cask.cdap.test.IntegrationTestBase.setUp(IntegrationTestBase.java:101)
	at sun.reflect.GeneratedMethodAccessor1.invoke(Unknown Source)
	at sun.reflect.DelegatingMethodAccessorImpl.invoke(DelegatingMethodAccessorImpl.java:43)
	at java.lang.reflect.Method.invoke(Method.java:498)
	at org.junit.runners.model.FrameworkMethod$1.runReflectiveCall(FrameworkMethod.java:47)
(68 more lines...)
Collapse Failed TPFSSinkSourceTest testMR History

Failing on the develop branch.

Ambari - HDP 2.6 10 mins
java.lang.RuntimeException: java.util.concurrent.TimeoutException: CDAP Services are not available. Retried for 600 seconds.
	at com.google.common.base.Throwables.propagate(Throwables.java:160)
	at co.cask.cdap.test.IntegrationTestBase.checkSystemServices(IntegrationTestBase.java:206)
	at co.cask.cdap.test.IntegrationTestBase.setUp(IntegrationTestBase.java:101)
	at sun.reflect.GeneratedMethodAccessor1.invoke(Unknown Source)
	at sun.reflect.DelegatingMethodAccessorImpl.invoke(DelegatingMethodAccessorImpl.java:43)
	at java.lang.reflect.Method.invoke(Method.java:498)
	at org.junit.runners.model.FrameworkMethod$1.runReflectiveCall(FrameworkMethod.java:47)
(68 more lines...)
Collapse Failed ValueMapperTest test History

Failing on the develop branch.

Ambari - HDP 2.6 10 mins
java.lang.RuntimeException: java.util.concurrent.TimeoutException: CDAP Services are not available. Retried for 600 seconds.
	at com.google.common.base.Throwables.propagate(Throwables.java:160)
	at co.cask.cdap.test.IntegrationTestBase.checkSystemServices(IntegrationTestBase.java:206)
	at co.cask.cdap.test.IntegrationTestBase.setUp(IntegrationTestBase.java:101)
	at sun.reflect.GeneratedMethodAccessor1.invoke(Unknown Source)
	at sun.reflect.DelegatingMethodAccessorImpl.invoke(DelegatingMethodAccessorImpl.java:43)
	at java.lang.reflect.Method.invoke(Method.java:498)
	at org.junit.runners.model.FrameworkMethod$1.runReflectiveCall(FrameworkMethod.java:47)
(68 more lines...)
Collapse Failed XMLReaderTest testInvalidNodePathWithMoveAction History

Failing on the develop branch.

Ambari - HDP 2.6 10 mins
java.lang.RuntimeException: java.util.concurrent.TimeoutException: CDAP Services are not available. Retried for 600 seconds.
	at com.google.common.base.Throwables.propagate(Throwables.java:160)
	at co.cask.cdap.test.IntegrationTestBase.checkSystemServices(IntegrationTestBase.java:206)
	at co.cask.cdap.test.IntegrationTestBase.setUp(IntegrationTestBase.java:101)
	at sun.reflect.GeneratedMethodAccessor1.invoke(Unknown Source)
	at sun.reflect.DelegatingMethodAccessorImpl.invoke(DelegatingMethodAccessorImpl.java:43)
	at java.lang.reflect.Method.invoke(Method.java:498)
	at org.junit.runners.model.FrameworkMethod$1.runReflectiveCall(FrameworkMethod.java:47)
(68 more lines...)
Collapse Failed XMLReaderTest testPatternWithDeleteAction History

Failing on the develop branch.

Ambari - HDP 2.6 10 mins
java.lang.RuntimeException: java.util.concurrent.TimeoutException: CDAP Services are not available. Retried for 600 seconds.
	at com.google.common.base.Throwables.propagate(Throwables.java:160)
	at co.cask.cdap.test.IntegrationTestBase.checkSystemServices(IntegrationTestBase.java:206)
	at co.cask.cdap.test.IntegrationTestBase.setUp(IntegrationTestBase.java:101)
	at sun.reflect.GeneratedMethodAccessor1.invoke(Unknown Source)
	at sun.reflect.DelegatingMethodAccessorImpl.invoke(DelegatingMethodAccessorImpl.java:43)
	at java.lang.reflect.Method.invoke(Method.java:498)
	at org.junit.runners.model.FrameworkMethod$1.runReflectiveCall(FrameworkMethod.java:47)
(68 more lines...)
Collapse Failed XMLReaderTest testPreProcessingRequired History

Failing on the develop branch.

Ambari - HDP 2.6 10 mins
java.lang.RuntimeException: java.util.concurrent.TimeoutException: CDAP Services are not available. Retried for 600 seconds.
	at com.google.common.base.Throwables.propagate(Throwables.java:160)
	at co.cask.cdap.test.IntegrationTestBase.checkSystemServices(IntegrationTestBase.java:206)
	at co.cask.cdap.test.IntegrationTestBase.setUp(IntegrationTestBase.java:101)
	at sun.reflect.GeneratedMethodAccessor1.invoke(Unknown Source)
	at sun.reflect.DelegatingMethodAccessorImpl.invoke(DelegatingMethodAccessorImpl.java:43)
	at java.lang.reflect.Method.invoke(Method.java:498)
	at org.junit.runners.model.FrameworkMethod$1.runReflectiveCall(FrameworkMethod.java:47)
(68 more lines...)
Collapse Failed XMLReaderTest testInvalidPatternWithDeleteAction History

Failing on the develop branch.

Ambari - HDP 2.6 10 mins
java.lang.RuntimeException: java.util.concurrent.TimeoutException: CDAP Services are not available. Retried for 600 seconds.
	at com.google.common.base.Throwables.propagate(Throwables.java:160)
	at co.cask.cdap.test.IntegrationTestBase.checkSystemServices(IntegrationTestBase.java:206)
	at co.cask.cdap.test.IntegrationTestBase.setUp(IntegrationTestBase.java:101)
	at sun.reflect.GeneratedMethodAccessor1.invoke(Unknown Source)
	at sun.reflect.DelegatingMethodAccessorImpl.invoke(DelegatingMethodAccessorImpl.java:43)
	at java.lang.reflect.Method.invoke(Method.java:498)
	at org.junit.runners.model.FrameworkMethod$1.runReflectiveCall(FrameworkMethod.java:47)
(68 more lines...)
Collapse Failed XMLReaderTest testPreProcessingNotRequired History

Failing on the develop branch.

Ambari - HDP 2.6 10 mins
java.lang.RuntimeException: java.util.concurrent.TimeoutException: CDAP Services are not available. Retried for 600 seconds.
	at com.google.common.base.Throwables.propagate(Throwables.java:160)
	at co.cask.cdap.test.IntegrationTestBase.checkSystemServices(IntegrationTestBase.java:206)
	at co.cask.cdap.test.IntegrationTestBase.setUp(IntegrationTestBase.java:101)
	at sun.reflect.GeneratedMethodAccessor1.invoke(Unknown Source)
	at sun.reflect.DelegatingMethodAccessorImpl.invoke(DelegatingMethodAccessorImpl.java:43)
	at java.lang.reflect.Method.invoke(Method.java:498)
	at org.junit.runners.model.FrameworkMethod$1.runReflectiveCall(FrameworkMethod.java:47)
(68 more lines...)
Collapse Failed DataStreamsTest testDataStreams History

Failing on the develop branch.

Ambari - HDP 2.6 10 mins
java.lang.RuntimeException: java.util.concurrent.TimeoutException: CDAP Services are not available. Retried for 600 seconds.
	at com.google.common.base.Throwables.propagate(Throwables.java:160)
	at co.cask.cdap.test.IntegrationTestBase.checkSystemServices(IntegrationTestBase.java:206)
	at co.cask.cdap.test.IntegrationTestBase.setUp(IntegrationTestBase.java:101)
	at sun.reflect.NativeMethodAccessorImpl.invoke0(Native Method)
	at sun.reflect.NativeMethodAccessorImpl.invoke(NativeMethodAccessorImpl.java:62)
	at sun.reflect.DelegatingMethodAccessorImpl.invoke(DelegatingMethodAccessorImpl.java:43)
	at java.lang.reflect.Method.invoke(Method.java:498)
(70 more lines...)
Collapse Failed WranglerServiceTest test History

Failing on the develop branch.

Ambari - HDP 2.6 10 mins
java.lang.RuntimeException: java.util.concurrent.TimeoutException: CDAP Services are not available. Retried for 600 seconds.
	at com.google.common.base.Throwables.propagate(Throwables.java:160)
	at co.cask.cdap.test.IntegrationTestBase.checkSystemServices(IntegrationTestBase.java:206)
	at co.cask.cdap.test.IntegrationTestBase.setUp(IntegrationTestBase.java:101)
	at sun.reflect.GeneratedMethodAccessor1.invoke(Unknown Source)
	at sun.reflect.DelegatingMethodAccessorImpl.invoke(DelegatingMethodAccessorImpl.java:43)
	at java.lang.reflect.Method.invoke(Method.java:498)
	at org.junit.runners.model.FrameworkMethod$1.runReflectiveCall(FrameworkMethod.java:47)
(68 more lines...)
Collapse Failed WranglerTest testWranglerMR History

Failing on the develop branch.

Ambari - HDP 2.6 10 mins
java.lang.RuntimeException: java.util.concurrent.TimeoutException: CDAP Services are not available. Retried for 600 seconds.
	at com.google.common.base.Throwables.propagate(Throwables.java:160)
	at co.cask.cdap.test.IntegrationTestBase.checkSystemServices(IntegrationTestBase.java:206)
	at co.cask.cdap.test.IntegrationTestBase.setUp(IntegrationTestBase.java:101)
	at sun.reflect.GeneratedMethodAccessor1.invoke(Unknown Source)
	at sun.reflect.DelegatingMethodAccessorImpl.invoke(DelegatingMethodAccessorImpl.java:43)
	at java.lang.reflect.Method.invoke(Method.java:498)
	at org.junit.runners.model.FrameworkMethod$1.runReflectiveCall(FrameworkMethod.java:47)
(68 more lines...)
Collapse Failed WranglerTest testWranglerSpark History

Failing on the develop branch.

Ambari - HDP 2.6 10 mins
java.lang.RuntimeException: java.util.concurrent.TimeoutException: CDAP Services are not available. Retried for 600 seconds.
	at com.google.common.base.Throwables.propagate(Throwables.java:160)
	at co.cask.cdap.test.IntegrationTestBase.checkSystemServices(IntegrationTestBase.java:206)
	at co.cask.cdap.test.IntegrationTestBase.setUp(IntegrationTestBase.java:101)
	at sun.reflect.GeneratedMethodAccessor1.invoke(Unknown Source)
	at sun.reflect.DelegatingMethodAccessorImpl.invoke(DelegatingMethodAccessorImpl.java:43)
	at java.lang.reflect.Method.invoke(Method.java:498)
	at org.junit.runners.model.FrameworkMethod$1.runReflectiveCall(FrameworkMethod.java:47)
(68 more lines...)
Collapse Failed PermissionTest test History

Failing on the develop branch.

Ambari - HDP 2.6 10 mins
java.lang.RuntimeException: java.util.concurrent.TimeoutException: CDAP Services are not available. Retried for 600 seconds.
	at com.google.common.base.Throwables.propagate(Throwables.java:160)
	at co.cask.cdap.test.IntegrationTestBase.checkSystemServices(IntegrationTestBase.java:206)
	at co.cask.cdap.test.IntegrationTestBase.setUp(IntegrationTestBase.java:101)
	at sun.reflect.GeneratedMethodAccessor1.invoke(Unknown Source)
	at sun.reflect.DelegatingMethodAccessorImpl.invoke(DelegatingMethodAccessorImpl.java:43)
	at java.lang.reflect.Method.invoke(Method.java:498)
	at org.junit.runners.model.FrameworkMethod$1.runReflectiveCall(FrameworkMethod.java:47)
(68 more lines...)
Collapse Failed ReadlessIncrementTest testReadlessIncrementsInMapReduce History

Failing on the develop branch.

Ambari - HDP 2.6 10 mins
java.lang.RuntimeException: java.util.concurrent.TimeoutException: CDAP Services are not available. Retried for 600 seconds.
	at com.google.common.base.Throwables.propagate(Throwables.java:160)
	at co.cask.cdap.test.IntegrationTestBase.checkSystemServices(IntegrationTestBase.java:206)
	at co.cask.cdap.test.IntegrationTestBase.setUp(IntegrationTestBase.java:101)
	at sun.reflect.GeneratedMethodAccessor1.invoke(Unknown Source)
	at sun.reflect.DelegatingMethodAccessorImpl.invoke(DelegatingMethodAccessorImpl.java:43)
	at java.lang.reflect.Method.invoke(Method.java:498)
	at org.junit.runners.model.FrameworkMethod$1.runReflectiveCall(FrameworkMethod.java:47)
(68 more lines...)
Collapse Failed HangingWorkerTest testRestart History

Failing on the develop branch.

Ambari - HDP 2.6 10 mins
java.lang.RuntimeException: java.util.concurrent.TimeoutException: CDAP Services are not available. Retried for 600 seconds.
	at com.google.common.base.Throwables.propagate(Throwables.java:160)
	at co.cask.cdap.test.IntegrationTestBase.checkSystemServices(IntegrationTestBase.java:206)
	at co.cask.cdap.test.IntegrationTestBase.setUp(IntegrationTestBase.java:101)
	at sun.reflect.GeneratedMethodAccessor1.invoke(Unknown Source)
	at sun.reflect.DelegatingMethodAccessorImpl.invoke(DelegatingMethodAccessorImpl.java:43)
	at java.lang.reflect.Method.invoke(Method.java:498)
	at org.junit.runners.model.FrameworkMethod$1.runReflectiveCall(FrameworkMethod.java:47)
(68 more lines...)
Collapse Failed ServiceWorkerTest test History

Failing on the develop branch.

Ambari - HDP 2.6 10 mins
java.lang.RuntimeException: java.util.concurrent.TimeoutException: CDAP Services are not available. Retried for 600 seconds.
	at com.google.common.base.Throwables.propagate(Throwables.java:160)
	at co.cask.cdap.test.IntegrationTestBase.checkSystemServices(IntegrationTestBase.java:206)
	at co.cask.cdap.test.IntegrationTestBase.setUp(IntegrationTestBase.java:101)
	at sun.reflect.GeneratedMethodAccessor1.invoke(Unknown Source)
	at sun.reflect.DelegatingMethodAccessorImpl.invoke(DelegatingMethodAccessorImpl.java:43)
	at java.lang.reflect.Method.invoke(Method.java:498)
	at org.junit.runners.model.FrameworkMethod$1.runReflectiveCall(FrameworkMethod.java:47)
(68 more lines...)
Collapse Failed ApplicationTest test History

Failing on the develop branch.

Ambari - HDP 2.6 10 mins
java.lang.RuntimeException: java.util.concurrent.TimeoutException: CDAP Services are not available. Retried for 600 seconds.
	at com.google.common.base.Throwables.propagate(Throwables.java:160)
	at co.cask.cdap.test.IntegrationTestBase.checkSystemServices(IntegrationTestBase.java:206)
	at co.cask.cdap.test.IntegrationTestBase.setUp(IntegrationTestBase.java:101)
	at sun.reflect.NativeMethodAccessorImpl.invoke0(Native Method)
	at sun.reflect.NativeMethodAccessorImpl.invoke(NativeMethodAccessorImpl.java:62)
	at sun.reflect.DelegatingMethodAccessorImpl.invoke(DelegatingMethodAccessorImpl.java:43)
	at java.lang.reflect.Method.invoke(Method.java:498)
(70 more lines...)
Collapse Failed ApplicationVersionTest testRouteConfig History
Ambari - HDP 2.6 10 mins
java.lang.RuntimeException: java.util.concurrent.TimeoutException: CDAP Services are not available. Retried for 600 seconds.
	at com.google.common.base.Throwables.propagate(Throwables.java:160)
	at co.cask.cdap.test.IntegrationTestBase.checkSystemServices(IntegrationTestBase.java:206)
	at co.cask.cdap.test.IntegrationTestBase.setUp(IntegrationTestBase.java:101)
	at sun.reflect.NativeMethodAccessorImpl.invoke0(Native Method)
	at sun.reflect.NativeMethodAccessorImpl.invoke(NativeMethodAccessorImpl.java:62)
	at sun.reflect.DelegatingMethodAccessorImpl.invoke(DelegatingMethodAccessorImpl.java:43)
	at java.lang.reflect.Method.invoke(Method.java:498)
(70 more lines...)
Collapse Failed ApplicationVersionTest testAppVersionsCreationUpdateDeletion History

Failing on the develop branch.

Ambari - HDP 2.6 10 mins
java.lang.RuntimeException: java.util.concurrent.TimeoutException: CDAP Services are not available. Retried for 600 seconds.
	at com.google.common.base.Throwables.propagate(Throwables.java:160)
	at co.cask.cdap.test.IntegrationTestBase.checkSystemServices(IntegrationTestBase.java:206)
	at co.cask.cdap.test.IntegrationTestBase.setUp(IntegrationTestBase.java:101)
	at sun.reflect.NativeMethodAccessorImpl.invoke0(Native Method)
	at sun.reflect.NativeMethodAccessorImpl.invoke(NativeMethodAccessorImpl.java:62)
	at sun.reflect.DelegatingMethodAccessorImpl.invoke(DelegatingMethodAccessorImpl.java:43)
	at java.lang.reflect.Method.invoke(Method.java:498)
(70 more lines...)
Collapse Failed DatasetTest test History

Failing on the develop branch.

Ambari - HDP 2.6 10 mins
java.lang.RuntimeException: java.util.concurrent.TimeoutException: CDAP Services are not available. Retried for 600 seconds.
	at com.google.common.base.Throwables.propagate(Throwables.java:160)
	at co.cask.cdap.test.IntegrationTestBase.checkSystemServices(IntegrationTestBase.java:206)
	at co.cask.cdap.test.IntegrationTestBase.setUp(IntegrationTestBase.java:101)
	at sun.reflect.NativeMethodAccessorImpl.invoke0(Native Method)
	at sun.reflect.NativeMethodAccessorImpl.invoke(NativeMethodAccessorImpl.java:62)
	at sun.reflect.DelegatingMethodAccessorImpl.invoke(DelegatingMethodAccessorImpl.java:43)
	at java.lang.reflect.Method.invoke(Method.java:498)
(70 more lines...)
Collapse Failed NamespaceTest testNamespaces History

Failing on the develop branch.

Ambari - HDP 2.6 10 mins
java.lang.RuntimeException: java.util.concurrent.TimeoutException: CDAP Services are not available. Retried for 600 seconds.
	at com.google.common.base.Throwables.propagate(Throwables.java:160)
	at co.cask.cdap.test.IntegrationTestBase.checkSystemServices(IntegrationTestBase.java:206)
	at co.cask.cdap.test.IntegrationTestBase.setUp(IntegrationTestBase.java:101)
	at sun.reflect.GeneratedMethodAccessor1.invoke(Unknown Source)
	at sun.reflect.DelegatingMethodAccessorImpl.invoke(DelegatingMethodAccessorImpl.java:43)
	at java.lang.reflect.Method.invoke(Method.java:498)
	at org.junit.runners.model.FrameworkMethod$1.runReflectiveCall(FrameworkMethod.java:47)
(68 more lines...)
Collapse Failed NamespacedStreamTest testNamespacedStreams History

Failing on the develop branch.

Ambari - HDP 2.6 10 mins
java.lang.RuntimeException: java.util.concurrent.TimeoutException: CDAP Services are not available. Retried for 600 seconds.
	at com.google.common.base.Throwables.propagate(Throwables.java:160)
	at co.cask.cdap.test.IntegrationTestBase.checkSystemServices(IntegrationTestBase.java:206)
	at co.cask.cdap.test.IntegrationTestBase.setUp(IntegrationTestBase.java:101)
	at sun.reflect.GeneratedMethodAccessor1.invoke(Unknown Source)
	at sun.reflect.DelegatingMethodAccessorImpl.invoke(DelegatingMethodAccessorImpl.java:43)
	at java.lang.reflect.Method.invoke(Method.java:498)
	at org.junit.runners.model.FrameworkMethod$1.runReflectiveCall(FrameworkMethod.java:47)
(68 more lines...)
Collapse Failed StreamTest testNonexistentStreams History

Failing on the develop branch.

Ambari - HDP 2.6 10 mins
java.lang.RuntimeException: java.util.concurrent.TimeoutException: CDAP Services are not available. Retried for 600 seconds.
	at com.google.common.base.Throwables.propagate(Throwables.java:160)
	at co.cask.cdap.test.IntegrationTestBase.checkSystemServices(IntegrationTestBase.java:206)
	at co.cask.cdap.test.IntegrationTestBase.setUp(IntegrationTestBase.java:101)
	at sun.reflect.GeneratedMethodAccessor1.invoke(Unknown Source)
	at sun.reflect.DelegatingMethodAccessorImpl.invoke(DelegatingMethodAccessorImpl.java:43)
	at java.lang.reflect.Method.invoke(Method.java:498)
	at org.junit.runners.model.FrameworkMethod$1.runReflectiveCall(FrameworkMethod.java:47)
(68 more lines...)
Collapse Failed StreamTest testStreams History

Failing on the develop branch.

Ambari - HDP 2.6 10 mins
java.lang.RuntimeException: java.util.concurrent.TimeoutException: CDAP Services are not available. Retried for 600 seconds.
	at com.google.common.base.Throwables.propagate(Throwables.java:160)
	at co.cask.cdap.test.IntegrationTestBase.checkSystemServices(IntegrationTestBase.java:206)
	at co.cask.cdap.test.IntegrationTestBase.setUp(IntegrationTestBase.java:101)
	at sun.reflect.GeneratedMethodAccessor1.invoke(Unknown Source)
	at sun.reflect.DelegatingMethodAccessorImpl.invoke(DelegatingMethodAccessorImpl.java:43)
	at java.lang.reflect.Method.invoke(Method.java:498)
	at org.junit.runners.model.FrameworkMethod$1.runReflectiveCall(FrameworkMethod.java:47)
(68 more lines...)
Collapse Failed ExploreTest test History

Failing on the develop branch.

Ambari - HDP 2.6 10 mins
java.lang.RuntimeException: java.util.concurrent.TimeoutException: CDAP Services are not available. Retried for 600 seconds.
	at com.google.common.base.Throwables.propagate(Throwables.java:160)
	at co.cask.cdap.test.IntegrationTestBase.checkSystemServices(IntegrationTestBase.java:206)
	at co.cask.cdap.test.IntegrationTestBase.setUp(IntegrationTestBase.java:101)
	at sun.reflect.GeneratedMethodAccessor1.invoke(Unknown Source)
	at sun.reflect.DelegatingMethodAccessorImpl.invoke(DelegatingMethodAccessorImpl.java:43)
	at java.lang.reflect.Method.invoke(Method.java:498)
	at org.junit.runners.model.FrameworkMethod$1.runReflectiveCall(FrameworkMethod.java:47)
(68 more lines...)
Collapse Failed ExploreTest testSubqueryInWhereClause History

Failing on the develop branch.

Ambari - HDP 2.6 10 mins
java.lang.RuntimeException: java.util.concurrent.TimeoutException: CDAP Services are not available. Retried for 600 seconds.
	at com.google.common.base.Throwables.propagate(Throwables.java:160)
	at co.cask.cdap.test.IntegrationTestBase.checkSystemServices(IntegrationTestBase.java:206)
	at co.cask.cdap.test.IntegrationTestBase.setUp(IntegrationTestBase.java:101)
	at sun.reflect.GeneratedMethodAccessor1.invoke(Unknown Source)
	at sun.reflect.DelegatingMethodAccessorImpl.invoke(DelegatingMethodAccessorImpl.java:43)
	at java.lang.reflect.Method.invoke(Method.java:498)
	at org.junit.runners.model.FrameworkMethod$1.runReflectiveCall(FrameworkMethod.java:47)
(68 more lines...)
Collapse Failed FileSetTest test History

Failing on the develop branch.

Ambari - HDP 2.6 10 mins
java.lang.RuntimeException: java.util.concurrent.TimeoutException: CDAP Services are not available. Retried for 600 seconds.
	at com.google.common.base.Throwables.propagate(Throwables.java:160)
	at co.cask.cdap.test.IntegrationTestBase.checkSystemServices(IntegrationTestBase.java:206)
	at co.cask.cdap.test.IntegrationTestBase.setUp(IntegrationTestBase.java:101)
	at sun.reflect.GeneratedMethodAccessor1.invoke(Unknown Source)
	at sun.reflect.DelegatingMethodAccessorImpl.invoke(DelegatingMethodAccessorImpl.java:43)
	at java.lang.reflect.Method.invoke(Method.java:498)
	at org.junit.runners.model.FrameworkMethod$1.runReflectiveCall(FrameworkMethod.java:47)
(68 more lines...)
Collapse Failed PartitionCorrectorTest test History

Failing on the develop branch.

Ambari - HDP 2.6 10 mins
java.lang.RuntimeException: java.util.concurrent.TimeoutException: CDAP Services are not available. Retried for 600 seconds.
	at com.google.common.base.Throwables.propagate(Throwables.java:160)
	at co.cask.cdap.test.IntegrationTestBase.checkSystemServices(IntegrationTestBase.java:206)
	at co.cask.cdap.test.IntegrationTestBase.setUp(IntegrationTestBase.java:101)
	at sun.reflect.GeneratedMethodAccessor1.invoke(Unknown Source)
	at sun.reflect.DelegatingMethodAccessorImpl.invoke(DelegatingMethodAccessorImpl.java:43)
	at java.lang.reflect.Method.invoke(Method.java:498)
	at org.junit.runners.model.FrameworkMethod$1.runReflectiveCall(FrameworkMethod.java:47)
(68 more lines...)
Collapse Failed PartitionedFileSetUpdateTest test History

Failing on the develop branch.

Ambari - HDP 2.6 10 mins
java.lang.RuntimeException: java.util.concurrent.TimeoutException: CDAP Services are not available. Retried for 600 seconds.
	at com.google.common.base.Throwables.propagate(Throwables.java:160)
	at co.cask.cdap.test.IntegrationTestBase.checkSystemServices(IntegrationTestBase.java:206)
	at co.cask.cdap.test.IntegrationTestBase.setUp(IntegrationTestBase.java:101)
	at sun.reflect.GeneratedMethodAccessor1.invoke(Unknown Source)
	at sun.reflect.DelegatingMethodAccessorImpl.invoke(DelegatingMethodAccessorImpl.java:43)
	at java.lang.reflect.Method.invoke(Method.java:498)
	at org.junit.runners.model.FrameworkMethod$1.runReflectiveCall(FrameworkMethod.java:47)
(68 more lines...)
Collapse Failed PurchaseMetadataTest testSearchUsingSystemMetadata History

Failing on the develop branch.

Ambari - HDP 2.6 10 mins
java.lang.RuntimeException: java.util.concurrent.TimeoutException: CDAP Services are not available. Retried for 600 seconds.
	at com.google.common.base.Throwables.propagate(Throwables.java:160)
	at co.cask.cdap.test.IntegrationTestBase.checkSystemServices(IntegrationTestBase.java:206)
	at co.cask.cdap.test.IntegrationTestBase.setUp(IntegrationTestBase.java:101)
	at sun.reflect.GeneratedMethodAccessor1.invoke(Unknown Source)
	at sun.reflect.DelegatingMethodAccessorImpl.invoke(DelegatingMethodAccessorImpl.java:43)
	at java.lang.reflect.Method.invoke(Method.java:498)
	at org.junit.runners.model.FrameworkMethod$1.runReflectiveCall(FrameworkMethod.java:47)
(68 more lines...)
Collapse Failed PurchaseAudiTest test History

Failing on the develop branch.

Ambari - HDP 2.6 10 mins
java.lang.RuntimeException: java.util.concurrent.TimeoutException: CDAP Services are not available. Retried for 600 seconds.
	at com.google.common.base.Throwables.propagate(Throwables.java:160)
	at co.cask.cdap.test.IntegrationTestBase.checkSystemServices(IntegrationTestBase.java:206)
	at co.cask.cdap.test.IntegrationTestBase.setUp(IntegrationTestBase.java:101)
	at sun.reflect.GeneratedMethodAccessor1.invoke(Unknown Source)
	at sun.reflect.DelegatingMethodAccessorImpl.invoke(DelegatingMethodAccessorImpl.java:43)
	at java.lang.reflect.Method.invoke(Method.java:498)
	at org.junit.runners.model.FrameworkMethod$1.runReflectiveCall(FrameworkMethod.java:47)
(68 more lines...)
Collapse Failed StreamSchedulerTest test History
Ambari - HDP 2.6 10 mins
java.lang.RuntimeException: java.util.concurrent.TimeoutException: CDAP Services are not available. Retried for 600 seconds.
	at com.google.common.base.Throwables.propagate(Throwables.java:160)
	at co.cask.cdap.test.IntegrationTestBase.checkSystemServices(IntegrationTestBase.java:206)
	at co.cask.cdap.test.IntegrationTestBase.setUp(IntegrationTestBase.java:101)
	at sun.reflect.GeneratedMethodAccessor1.invoke(Unknown Source)
	at sun.reflect.DelegatingMethodAccessorImpl.invoke(DelegatingMethodAccessorImpl.java:43)
	at java.lang.reflect.Method.invoke(Method.java:498)
	at org.junit.runners.model.FrameworkMethod$1.runReflectiveCall(FrameworkMethod.java:47)
(68 more lines...)
Collapse Failed SparkPageRankAppTest test History
Ambari - HDP 2.6 10 mins
java.lang.RuntimeException: java.util.concurrent.TimeoutException: CDAP Services are not available. Retried for 600 seconds.
	at com.google.common.base.Throwables.propagate(Throwables.java:160)
	at co.cask.cdap.test.IntegrationTestBase.checkSystemServices(IntegrationTestBase.java:206)
	at co.cask.cdap.test.IntegrationTestBase.setUp(IntegrationTestBase.java:101)
	at sun.reflect.GeneratedMethodAccessor1.invoke(Unknown Source)
	at sun.reflect.DelegatingMethodAccessorImpl.invoke(DelegatingMethodAccessorImpl.java:43)
	at java.lang.reflect.Method.invoke(Method.java:498)
	at org.junit.runners.model.FrameworkMethod$1.runReflectiveCall(FrameworkMethod.java:47)
(68 more lines...)
Existing test failures 1
Status Test Failing since View job Duration
java.lang.RuntimeException: java.util.concurrent.TimeoutException: CDAP Services are not available. Retried for 600 seconds.
	at com.google.common.base.Throwables.propagate(Throwables.java:160)
	at co.cask.cdap.test.IntegrationTestBase.checkSystemServices(IntegrationTestBase.java:206)
	at co.cask.cdap.test.IntegrationTestBase.setUp(IntegrationTestBase.java:101)
	at sun.reflect.GeneratedMethodAccessor1.invoke(Unknown Source)
	at sun.reflect.DelegatingMethodAccessorImpl.invoke(DelegatingMethodAccessorImpl.java:43)
	at java.lang.reflect.Method.invoke(Method.java:498)
	at org.junit.runners.model.FrameworkMethod$1.runReflectiveCall(FrameworkMethod.java:47)
(68 more lines...)