Build #38

Build: #38 failed Scheduled

Stages & jobs

  1. Variables

  2. Spinup and Test

Build result summary

Details

Completed
Duration
257 minutes
Labels
None
Revisions
CDAP Integration Tests
4916a5d854c04e668aa7428dd0aeb0457b68aeff 4916a5d854c04e668aa7428dd0aeb0457b68aeff
Coopr-internal
543830e7d187d5dce1a0330c0e599f532bedc089 543830e7d187d5dce1a0330c0e599f532bedc089
Total tests
64
Failing since
#34 (Scheduled – )
Fixed in
#47 (Scheduled)

Responsible

This build has been failing since #34
No one has taken responsibility

Configuration changes

Plan configuration has changed since the last successful build. See the plan audit log for more details.

Tests

New test failures 1
Status Test View job Duration
Collapse Failed ExcelInputReaderTest testExcelReader History

Failing on the develop branch.

Ambari - HDP 2.6 2 mins
java.util.concurrent.ExecutionException: java.lang.RuntimeException: java.io.IOException: 500: canCommit() is called for transaction 1515124189520000000 that is not in progress
	at co.cask.cdap.client.util.RESTClient.execute(RESTClient.java:132)
	at co.cask.cdap.client.util.RESTClient.execute(RESTClient.java:74)
	at co.cask.cdap.client.ProgramClient.getProgramRuns(ProgramClient.java:871)
	at co.cask.cdap.test.remote.RemoteApplicationManager.getHistory(RemoteApplicationManager.java:170)
	at co.cask.cdap.test.AbstractProgramManager.getHistory(AbstractProgramManager.java:144)
	at co.cask.cdap.test.AbstractProgramManager$1.call(AbstractProgramManager.java:93)
	at co.cask.cdap.test.AbstractProgramManager$1.call(AbstractProgramManager.java:90)
(6 more lines...)
Existing test failures 1
Status Test Failing since View job Duration
java.lang.AssertionError: All traffic should be routed to service v1 but service v2 is also reached.
	at org.junit.Assert.fail(Assert.java:88)
	at co.cask.cdap.apps.ApplicationVersionTest.testRouteConfig(ApplicationVersionTest.java:214)