Build #87

Build: #87 failed

Job: Ambari - HDP 2.6 failed

Stages & jobs

  1. Variables

  2. Spinup and Test

Build log

The build generated 32,988 lines of output.The output is too long and has been truncated to the last 1,000 lines. Download or view full build log

07-Dec-2018 07:19:42         at org.junit.internal.runners.statements.RunBefores.evaluate(RunBefores.java:24)
07-Dec-2018 07:19:42         at org.junit.internal.runners.statements.RunAfters.evaluate(RunAfters.java:27)
07-Dec-2018 07:19:42         at org.junit.runners.ParentRunner.runLeaf(ParentRunner.java:325)
07-Dec-2018 07:19:42         at org.junit.runners.BlockJUnit4ClassRunner.runChild(BlockJUnit4ClassRunner.java:78)
07-Dec-2018 07:19:42         at org.junit.runners.BlockJUnit4ClassRunner.runChild(BlockJUnit4ClassRunner.java:57)
07-Dec-2018 07:19:42         at org.junit.runners.ParentRunner$3.run(ParentRunner.java:290)
07-Dec-2018 07:19:42         at org.junit.runners.ParentRunner$1.schedule(ParentRunner.java:71)
07-Dec-2018 07:19:42         at org.junit.runners.ParentRunner.runChildren(ParentRunner.java:288)
07-Dec-2018 07:19:42         at org.junit.runners.ParentRunner.access$000(ParentRunner.java:58)
07-Dec-2018 07:19:42         at org.junit.runners.ParentRunner$2.evaluate(ParentRunner.java:268)
07-Dec-2018 07:19:42         at org.junit.rules.ExternalResource$1.evaluate(ExternalResource.java:48)
07-Dec-2018 07:19:42         at org.junit.rules.RunRules.evaluate(RunRules.java:20)
07-Dec-2018 07:19:42         at org.junit.runners.ParentRunner.run(ParentRunner.java:363)
07-Dec-2018 07:19:42         at org.junit.runners.Suite.runChild(Suite.java:128)
07-Dec-2018 07:19:42         at org.junit.runners.Suite.runChild(Suite.java:27)
07-Dec-2018 07:19:42         at org.junit.runners.ParentRunner$3.run(ParentRunner.java:290)
07-Dec-2018 07:19:42         at org.junit.runners.ParentRunner$1.schedule(ParentRunner.java:71)
07-Dec-2018 07:19:42         at org.junit.runners.ParentRunner.runChildren(ParentRunner.java:288)
07-Dec-2018 07:19:42         at org.junit.runners.ParentRunner.access$000(ParentRunner.java:58)
07-Dec-2018 07:19:42         at org.junit.runners.ParentRunner$2.evaluate(ParentRunner.java:268)
07-Dec-2018 07:19:42         at org.junit.runners.ParentRunner.run(ParentRunner.java:363)
07-Dec-2018 07:19:42         at org.apache.maven.surefire.junit4.JUnit4Provider.execute(JUnit4Provider.java:283)
07-Dec-2018 07:19:42         at org.apache.maven.surefire.junit4.JUnit4Provider.executeWithRerun(JUnit4Provider.java:173)
07-Dec-2018 07:19:42         at org.apache.maven.surefire.junit4.JUnit4Provider.executeTestSet(JUnit4Provider.java:153)
07-Dec-2018 07:19:42         at org.apache.maven.surefire.junit4.JUnit4Provider.invoke(JUnit4Provider.java:128)
07-Dec-2018 07:19:42         at org.apache.maven.surefire.booter.ForkedBooter.invokeProviderInSameClassLoader(ForkedBooter.java:203)
07-Dec-2018 07:19:42         at org.apache.maven.surefire.booter.ForkedBooter.runSuitesInProcess(ForkedBooter.java:155)
07-Dec-2018 07:19:42         at org.apache.maven.surefire.booter.ForkedBooter.main(ForkedBooter.java:103)
07-Dec-2018 07:19:42
07-Dec-2018 07:19:42 testFlowletTimeouts(co.cask.cdap.apps.transaction.TransactionTimeoutTest)  Time elapsed: 608.276 sec  <<< ERROR!
07-Dec-2018 07:19:42 java.lang.RuntimeException: java.util.concurrent.TimeoutException: CDAP Services are not available. Retried for 600 seconds.
07-Dec-2018 07:19:42         at com.google.common.base.Throwables.propagate(Throwables.java:240)
07-Dec-2018 07:19:42         at co.cask.cdap.test.IntegrationTestBase.checkSystemServices(IntegrationTestBase.java:204)
07-Dec-2018 07:19:42         at co.cask.cdap.test.IntegrationTestBase.setUp(IntegrationTestBase.java:99)
07-Dec-2018 07:19:42         at sun.reflect.GeneratedMethodAccessor1.invoke(Unknown Source)
07-Dec-2018 07:19:42         at sun.reflect.DelegatingMethodAccessorImpl.invoke(DelegatingMethodAccessorImpl.java:43)
07-Dec-2018 07:19:42         at java.lang.reflect.Method.invoke(Method.java:498)
07-Dec-2018 07:19:42         at org.junit.runners.model.FrameworkMethod$1.runReflectiveCall(FrameworkMethod.java:50)
07-Dec-2018 07:19:42         at org.junit.internal.runners.model.ReflectiveCallable.run(ReflectiveCallable.java:12)
07-Dec-2018 07:19:42         at org.junit.runners.model.FrameworkMethod.invokeExplosively(FrameworkMethod.java:47)
07-Dec-2018 07:19:42         at org.junit.internal.runners.statements.RunBefores.evaluate(RunBefores.java:24)
07-Dec-2018 07:19:42         at org.junit.internal.runners.statements.RunAfters.evaluate(RunAfters.java:27)
07-Dec-2018 07:19:42         at org.junit.runners.ParentRunner.runLeaf(ParentRunner.java:325)
07-Dec-2018 07:19:42         at org.junit.runners.BlockJUnit4ClassRunner.runChild(BlockJUnit4ClassRunner.java:78)
07-Dec-2018 07:19:42         at org.junit.runners.BlockJUnit4ClassRunner.runChild(BlockJUnit4ClassRunner.java:57)
07-Dec-2018 07:19:42         at org.junit.runners.ParentRunner$3.run(ParentRunner.java:290)
07-Dec-2018 07:19:42         at org.junit.runners.ParentRunner$1.schedule(ParentRunner.java:71)
07-Dec-2018 07:19:42         at org.junit.runners.ParentRunner.runChildren(ParentRunner.java:288)
07-Dec-2018 07:19:42         at org.junit.runners.ParentRunner.access$000(ParentRunner.java:58)
07-Dec-2018 07:19:42         at org.junit.runners.ParentRunner$2.evaluate(ParentRunner.java:268)
07-Dec-2018 07:19:42         at org.junit.rules.ExternalResource$1.evaluate(ExternalResource.java:48)
07-Dec-2018 07:19:42         at org.junit.rules.RunRules.evaluate(RunRules.java:20)
07-Dec-2018 07:19:42         at org.junit.runners.ParentRunner.run(ParentRunner.java:363)
07-Dec-2018 07:19:42         at org.junit.runners.Suite.runChild(Suite.java:128)
07-Dec-2018 07:19:42         at org.junit.runners.Suite.runChild(Suite.java:27)
07-Dec-2018 07:19:42         at org.junit.runners.ParentRunner$3.run(ParentRunner.java:290)
07-Dec-2018 07:19:42         at org.junit.runners.ParentRunner$1.schedule(ParentRunner.java:71)
07-Dec-2018 07:19:42         at org.junit.runners.ParentRunner.runChildren(ParentRunner.java:288)
07-Dec-2018 07:19:42         at org.junit.runners.ParentRunner.access$000(ParentRunner.java:58)
07-Dec-2018 07:19:42         at org.junit.runners.ParentRunner$2.evaluate(ParentRunner.java:268)
07-Dec-2018 07:19:42         at org.junit.runners.ParentRunner.run(ParentRunner.java:363)
07-Dec-2018 07:19:42         at org.apache.maven.surefire.junit4.JUnit4Provider.execute(JUnit4Provider.java:283)
07-Dec-2018 07:19:42         at org.apache.maven.surefire.junit4.JUnit4Provider.executeWithRerun(JUnit4Provider.java:173)
07-Dec-2018 07:19:42         at org.apache.maven.surefire.junit4.JUnit4Provider.executeTestSet(JUnit4Provider.java:153)
07-Dec-2018 07:19:42         at org.apache.maven.surefire.junit4.JUnit4Provider.invoke(JUnit4Provider.java:128)
07-Dec-2018 07:19:42         at org.apache.maven.surefire.booter.ForkedBooter.invokeProviderInSameClassLoader(ForkedBooter.java:203)
07-Dec-2018 07:19:42         at org.apache.maven.surefire.booter.ForkedBooter.runSuitesInProcess(ForkedBooter.java:155)
07-Dec-2018 07:19:42         at org.apache.maven.surefire.booter.ForkedBooter.main(ForkedBooter.java:103)
07-Dec-2018 07:19:42 Caused by: java.util.concurrent.TimeoutException: CDAP Services are not available. Retried for 600 seconds.
07-Dec-2018 07:19:42         at co.cask.cdap.test.IntegrationTestBase.checkServicesWithRetry(IntegrationTestBase.java:267)
07-Dec-2018 07:19:42         at co.cask.cdap.test.IntegrationTestBase.checkSystemServices(IntegrationTestBase.java:192)
07-Dec-2018 07:19:42         at co.cask.cdap.test.IntegrationTestBase.setUp(IntegrationTestBase.java:99)
07-Dec-2018 07:19:42         at sun.reflect.GeneratedMethodAccessor1.invoke(Unknown Source)
07-Dec-2018 07:19:42         at sun.reflect.DelegatingMethodAccessorImpl.invoke(DelegatingMethodAccessorImpl.java:43)
07-Dec-2018 07:19:42         at java.lang.reflect.Method.invoke(Method.java:498)
07-Dec-2018 07:19:42         at org.junit.runners.model.FrameworkMethod$1.runReflectiveCall(FrameworkMethod.java:50)
07-Dec-2018 07:19:42         at org.junit.internal.runners.model.ReflectiveCallable.run(ReflectiveCallable.java:12)
07-Dec-2018 07:19:42         at org.junit.runners.model.FrameworkMethod.invokeExplosively(FrameworkMethod.java:47)
07-Dec-2018 07:19:42         at org.junit.internal.runners.statements.RunBefores.evaluate(RunBefores.java:24)
07-Dec-2018 07:19:42         at org.junit.internal.runners.statements.RunAfters.evaluate(RunAfters.java:27)
07-Dec-2018 07:19:42         at org.junit.runners.ParentRunner.runLeaf(ParentRunner.java:325)
07-Dec-2018 07:19:42         at org.junit.runners.BlockJUnit4ClassRunner.runChild(BlockJUnit4ClassRunner.java:78)
07-Dec-2018 07:19:42         at org.junit.runners.BlockJUnit4ClassRunner.runChild(BlockJUnit4ClassRunner.java:57)
07-Dec-2018 07:19:42         at org.junit.runners.ParentRunner$3.run(ParentRunner.java:290)
07-Dec-2018 07:19:42         at org.junit.runners.ParentRunner$1.schedule(ParentRunner.java:71)
07-Dec-2018 07:19:42         at org.junit.runners.ParentRunner.runChildren(ParentRunner.java:288)
07-Dec-2018 07:19:42         at org.junit.runners.ParentRunner.access$000(ParentRunner.java:58)
07-Dec-2018 07:19:42         at org.junit.runners.ParentRunner$2.evaluate(ParentRunner.java:268)
07-Dec-2018 07:19:42         at org.junit.rules.ExternalResource$1.evaluate(ExternalResource.java:48)
07-Dec-2018 07:19:42         at org.junit.rules.RunRules.evaluate(RunRules.java:20)
07-Dec-2018 07:19:42         at org.junit.runners.ParentRunner.run(ParentRunner.java:363)
07-Dec-2018 07:19:42         at org.junit.runners.Suite.runChild(Suite.java:128)
07-Dec-2018 07:19:42         at org.junit.runners.Suite.runChild(Suite.java:27)
07-Dec-2018 07:19:42         at org.junit.runners.ParentRunner$3.run(ParentRunner.java:290)
07-Dec-2018 07:19:42         at org.junit.runners.ParentRunner$1.schedule(ParentRunner.java:71)
07-Dec-2018 07:19:42         at org.junit.runners.ParentRunner.runChildren(ParentRunner.java:288)
07-Dec-2018 07:19:42         at org.junit.runners.ParentRunner.access$000(ParentRunner.java:58)
07-Dec-2018 07:19:42         at org.junit.runners.ParentRunner$2.evaluate(ParentRunner.java:268)
07-Dec-2018 07:19:42         at org.junit.runners.ParentRunner.run(ParentRunner.java:363)
07-Dec-2018 07:19:42         at org.apache.maven.surefire.junit4.JUnit4Provider.execute(JUnit4Provider.java:283)
07-Dec-2018 07:19:42         at org.apache.maven.surefire.junit4.JUnit4Provider.executeWithRerun(JUnit4Provider.java:173)
07-Dec-2018 07:19:42         at org.apache.maven.surefire.junit4.JUnit4Provider.executeTestSet(JUnit4Provider.java:153)
07-Dec-2018 07:19:42         at org.apache.maven.surefire.junit4.JUnit4Provider.invoke(JUnit4Provider.java:128)
07-Dec-2018 07:19:42         at org.apache.maven.surefire.booter.ForkedBooter.invokeProviderInSameClassLoader(ForkedBooter.java:203)
07-Dec-2018 07:19:42         at org.apache.maven.surefire.booter.ForkedBooter.runSuitesInProcess(ForkedBooter.java:155)
07-Dec-2018 07:19:42         at org.apache.maven.surefire.booter.ForkedBooter.main(ForkedBooter.java:103)
07-Dec-2018 07:19:42
07-Dec-2018 07:19:42 test(co.cask.cdap.app.etl.batch.ValueMapperTest)  Time elapsed: 608.319 sec  <<< ERROR!
07-Dec-2018 07:19:42 java.lang.RuntimeException: java.util.concurrent.TimeoutException: CDAP Services are not available. Retried for 600 seconds.
07-Dec-2018 07:19:42         at com.google.common.base.Throwables.propagate(Throwables.java:240)
07-Dec-2018 07:19:42         at co.cask.cdap.test.IntegrationTestBase.checkSystemServices(IntegrationTestBase.java:204)
07-Dec-2018 07:19:42         at co.cask.cdap.test.IntegrationTestBase.setUp(IntegrationTestBase.java:99)
07-Dec-2018 07:19:42         at sun.reflect.GeneratedMethodAccessor1.invoke(Unknown Source)
07-Dec-2018 07:19:42         at sun.reflect.DelegatingMethodAccessorImpl.invoke(DelegatingMethodAccessorImpl.java:43)
07-Dec-2018 07:19:42         at java.lang.reflect.Method.invoke(Method.java:498)
07-Dec-2018 07:19:42         at org.junit.runners.model.FrameworkMethod$1.runReflectiveCall(FrameworkMethod.java:50)
07-Dec-2018 07:19:42         at org.junit.internal.runners.model.ReflectiveCallable.run(ReflectiveCallable.java:12)
07-Dec-2018 07:19:42         at org.junit.runners.model.FrameworkMethod.invokeExplosively(FrameworkMethod.java:47)
07-Dec-2018 07:19:42         at org.junit.internal.runners.statements.RunBefores.evaluate(RunBefores.java:24)
07-Dec-2018 07:19:42         at org.junit.internal.runners.statements.RunAfters.evaluate(RunAfters.java:27)
07-Dec-2018 07:19:42         at org.junit.runners.ParentRunner.runLeaf(ParentRunner.java:325)
07-Dec-2018 07:19:42         at org.junit.runners.BlockJUnit4ClassRunner.runChild(BlockJUnit4ClassRunner.java:78)
07-Dec-2018 07:19:42         at org.junit.runners.BlockJUnit4ClassRunner.runChild(BlockJUnit4ClassRunner.java:57)
07-Dec-2018 07:19:42         at org.junit.runners.ParentRunner$3.run(ParentRunner.java:290)
07-Dec-2018 07:19:42         at org.junit.runners.ParentRunner$1.schedule(ParentRunner.java:71)
07-Dec-2018 07:19:42         at org.junit.runners.ParentRunner.runChildren(ParentRunner.java:288)
07-Dec-2018 07:19:42         at org.junit.runners.ParentRunner.access$000(ParentRunner.java:58)
07-Dec-2018 07:19:42         at org.junit.runners.ParentRunner$2.evaluate(ParentRunner.java:268)
07-Dec-2018 07:19:42         at org.junit.rules.ExternalResource$1.evaluate(ExternalResource.java:48)
07-Dec-2018 07:19:42         at org.junit.rules.RunRules.evaluate(RunRules.java:20)
07-Dec-2018 07:19:42         at org.junit.runners.ParentRunner.run(ParentRunner.java:363)
07-Dec-2018 07:19:42         at org.junit.runners.Suite.runChild(Suite.java:128)
07-Dec-2018 07:19:42         at org.junit.runners.Suite.runChild(Suite.java:27)
07-Dec-2018 07:19:42         at org.junit.runners.ParentRunner$3.run(ParentRunner.java:290)
07-Dec-2018 07:19:42         at org.junit.runners.ParentRunner$1.schedule(ParentRunner.java:71)
07-Dec-2018 07:19:42         at org.junit.runners.ParentRunner.runChildren(ParentRunner.java:288)
07-Dec-2018 07:19:42         at org.junit.runners.ParentRunner.access$000(ParentRunner.java:58)
07-Dec-2018 07:19:42         at org.junit.runners.ParentRunner$2.evaluate(ParentRunner.java:268)
07-Dec-2018 07:19:42         at org.junit.runners.ParentRunner.run(ParentRunner.java:363)
07-Dec-2018 07:19:42         at org.apache.maven.surefire.junit4.JUnit4Provider.execute(JUnit4Provider.java:283)
07-Dec-2018 07:19:42         at org.apache.maven.surefire.junit4.JUnit4Provider.executeWithRerun(JUnit4Provider.java:173)
07-Dec-2018 07:19:42         at org.apache.maven.surefire.junit4.JUnit4Provider.executeTestSet(JUnit4Provider.java:153)
07-Dec-2018 07:19:42         at org.apache.maven.surefire.junit4.JUnit4Provider.invoke(JUnit4Provider.java:128)
07-Dec-2018 07:19:42         at org.apache.maven.surefire.booter.ForkedBooter.invokeProviderInSameClassLoader(ForkedBooter.java:203)
07-Dec-2018 07:19:42         at org.apache.maven.surefire.booter.ForkedBooter.runSuitesInProcess(ForkedBooter.java:155)
07-Dec-2018 07:19:42         at org.apache.maven.surefire.booter.ForkedBooter.main(ForkedBooter.java:103)
07-Dec-2018 07:19:42 Caused by: java.util.concurrent.TimeoutException: CDAP Services are not available. Retried for 600 seconds.
07-Dec-2018 07:19:42         at co.cask.cdap.test.IntegrationTestBase.checkServicesWithRetry(IntegrationTestBase.java:267)
07-Dec-2018 07:19:42         at co.cask.cdap.test.IntegrationTestBase.checkSystemServices(IntegrationTestBase.java:192)
07-Dec-2018 07:19:42         at co.cask.cdap.test.IntegrationTestBase.setUp(IntegrationTestBase.java:99)
07-Dec-2018 07:19:42         at sun.reflect.GeneratedMethodAccessor1.invoke(Unknown Source)
07-Dec-2018 07:19:42         at sun.reflect.DelegatingMethodAccessorImpl.invoke(DelegatingMethodAccessorImpl.java:43)
07-Dec-2018 07:19:42         at java.lang.reflect.Method.invoke(Method.java:498)
07-Dec-2018 07:19:42         at org.junit.runners.model.FrameworkMethod$1.runReflectiveCall(FrameworkMethod.java:50)
07-Dec-2018 07:19:42         at org.junit.internal.runners.model.ReflectiveCallable.run(ReflectiveCallable.java:12)
07-Dec-2018 07:19:42         at org.junit.runners.model.FrameworkMethod.invokeExplosively(FrameworkMethod.java:47)
07-Dec-2018 07:19:42         at org.junit.internal.runners.statements.RunBefores.evaluate(RunBefores.java:24)
07-Dec-2018 07:19:42         at org.junit.internal.runners.statements.RunAfters.evaluate(RunAfters.java:27)
07-Dec-2018 07:19:42         at org.junit.runners.ParentRunner.runLeaf(ParentRunner.java:325)
07-Dec-2018 07:19:42         at org.junit.runners.BlockJUnit4ClassRunner.runChild(BlockJUnit4ClassRunner.java:78)
07-Dec-2018 07:19:42         at org.junit.runners.BlockJUnit4ClassRunner.runChild(BlockJUnit4ClassRunner.java:57)
07-Dec-2018 07:19:42         at org.junit.runners.ParentRunner$3.run(ParentRunner.java:290)
07-Dec-2018 07:19:42         at org.junit.runners.ParentRunner$1.schedule(ParentRunner.java:71)
07-Dec-2018 07:19:42         at org.junit.runners.ParentRunner.runChildren(ParentRunner.java:288)
07-Dec-2018 07:19:42         at org.junit.runners.ParentRunner.access$000(ParentRunner.java:58)
07-Dec-2018 07:19:42         at org.junit.runners.ParentRunner$2.evaluate(ParentRunner.java:268)
07-Dec-2018 07:19:42         at org.junit.rules.ExternalResource$1.evaluate(ExternalResource.java:48)
07-Dec-2018 07:19:42         at org.junit.rules.RunRules.evaluate(RunRules.java:20)
07-Dec-2018 07:19:42         at org.junit.runners.ParentRunner.run(ParentRunner.java:363)
07-Dec-2018 07:19:42         at org.junit.runners.Suite.runChild(Suite.java:128)
07-Dec-2018 07:19:42         at org.junit.runners.Suite.runChild(Suite.java:27)
07-Dec-2018 07:19:42         at org.junit.runners.ParentRunner$3.run(ParentRunner.java:290)
07-Dec-2018 07:19:42         at org.junit.runners.ParentRunner$1.schedule(ParentRunner.java:71)
07-Dec-2018 07:19:42         at org.junit.runners.ParentRunner.runChildren(ParentRunner.java:288)
07-Dec-2018 07:19:42         at org.junit.runners.ParentRunner.access$000(ParentRunner.java:58)
07-Dec-2018 07:19:42         at org.junit.runners.ParentRunner$2.evaluate(ParentRunner.java:268)
07-Dec-2018 07:19:42         at org.junit.runners.ParentRunner.run(ParentRunner.java:363)
07-Dec-2018 07:19:42         at org.apache.maven.surefire.junit4.JUnit4Provider.execute(JUnit4Provider.java:283)
07-Dec-2018 07:19:42         at org.apache.maven.surefire.junit4.JUnit4Provider.executeWithRerun(JUnit4Provider.java:173)
07-Dec-2018 07:19:42         at org.apache.maven.surefire.junit4.JUnit4Provider.executeTestSet(JUnit4Provider.java:153)
07-Dec-2018 07:19:42         at org.apache.maven.surefire.junit4.JUnit4Provider.invoke(JUnit4Provider.java:128)
07-Dec-2018 07:19:42         at org.apache.maven.surefire.booter.ForkedBooter.invokeProviderInSameClassLoader(ForkedBooter.java:203)
07-Dec-2018 07:19:42         at org.apache.maven.surefire.booter.ForkedBooter.runSuitesInProcess(ForkedBooter.java:155)
07-Dec-2018 07:19:42         at org.apache.maven.surefire.booter.ForkedBooter.main(ForkedBooter.java:103)
07-Dec-2018 07:19:42
07-Dec-2018 07:19:42 test(co.cask.cdap.apps.wordcount.WordCountTest)  Time elapsed: 608.32 sec  <<< ERROR!
07-Dec-2018 07:19:42 java.lang.RuntimeException: java.util.concurrent.TimeoutException: CDAP Services are not available. Retried for 600 seconds.
07-Dec-2018 07:19:42         at com.google.common.base.Throwables.propagate(Throwables.java:240)
07-Dec-2018 07:19:42         at co.cask.cdap.test.IntegrationTestBase.checkSystemServices(IntegrationTestBase.java:204)
07-Dec-2018 07:19:42         at co.cask.cdap.test.IntegrationTestBase.setUp(IntegrationTestBase.java:99)
07-Dec-2018 07:19:42         at sun.reflect.GeneratedMethodAccessor1.invoke(Unknown Source)
07-Dec-2018 07:19:42         at sun.reflect.DelegatingMethodAccessorImpl.invoke(DelegatingMethodAccessorImpl.java:43)
07-Dec-2018 07:19:42         at java.lang.reflect.Method.invoke(Method.java:498)
07-Dec-2018 07:19:42         at org.junit.runners.model.FrameworkMethod$1.runReflectiveCall(FrameworkMethod.java:50)
07-Dec-2018 07:19:42         at org.junit.internal.runners.model.ReflectiveCallable.run(ReflectiveCallable.java:12)
07-Dec-2018 07:19:42         at org.junit.runners.model.FrameworkMethod.invokeExplosively(FrameworkMethod.java:47)
07-Dec-2018 07:19:42         at org.junit.internal.runners.statements.RunBefores.evaluate(RunBefores.java:24)
07-Dec-2018 07:19:42         at org.junit.internal.runners.statements.RunAfters.evaluate(RunAfters.java:27)
07-Dec-2018 07:19:42         at org.junit.runners.ParentRunner.runLeaf(ParentRunner.java:325)
07-Dec-2018 07:19:42         at org.junit.runners.BlockJUnit4ClassRunner.runChild(BlockJUnit4ClassRunner.java:78)
07-Dec-2018 07:19:42         at org.junit.runners.BlockJUnit4ClassRunner.runChild(BlockJUnit4ClassRunner.java:57)
07-Dec-2018 07:19:42         at org.junit.runners.ParentRunner$3.run(ParentRunner.java:290)
07-Dec-2018 07:19:42         at org.junit.runners.ParentRunner$1.schedule(ParentRunner.java:71)
07-Dec-2018 07:19:42         at org.junit.runners.ParentRunner.runChildren(ParentRunner.java:288)
07-Dec-2018 07:19:42         at org.junit.runners.ParentRunner.access$000(ParentRunner.java:58)
07-Dec-2018 07:19:42         at org.junit.runners.ParentRunner$2.evaluate(ParentRunner.java:268)
07-Dec-2018 07:19:42         at org.junit.rules.ExternalResource$1.evaluate(ExternalResource.java:48)
07-Dec-2018 07:19:42         at org.junit.rules.RunRules.evaluate(RunRules.java:20)
07-Dec-2018 07:19:42         at org.junit.runners.ParentRunner.run(ParentRunner.java:363)
07-Dec-2018 07:19:42         at org.junit.runners.Suite.runChild(Suite.java:128)
07-Dec-2018 07:19:42         at org.junit.runners.Suite.runChild(Suite.java:27)
07-Dec-2018 07:19:42         at org.junit.runners.ParentRunner$3.run(ParentRunner.java:290)
07-Dec-2018 07:19:42         at org.junit.runners.ParentRunner$1.schedule(ParentRunner.java:71)
07-Dec-2018 07:19:42         at org.junit.runners.ParentRunner.runChildren(ParentRunner.java:288)
07-Dec-2018 07:19:42         at org.junit.runners.ParentRunner.access$000(ParentRunner.java:58)
07-Dec-2018 07:19:42         at org.junit.runners.ParentRunner$2.evaluate(ParentRunner.java:268)
07-Dec-2018 07:19:42         at org.junit.runners.ParentRunner.run(ParentRunner.java:363)
07-Dec-2018 07:19:42         at org.apache.maven.surefire.junit4.JUnit4Provider.execute(JUnit4Provider.java:283)
07-Dec-2018 07:19:42         at org.apache.maven.surefire.junit4.JUnit4Provider.executeWithRerun(JUnit4Provider.java:173)
07-Dec-2018 07:19:42         at org.apache.maven.surefire.junit4.JUnit4Provider.executeTestSet(JUnit4Provider.java:153)
07-Dec-2018 07:19:42         at org.apache.maven.surefire.junit4.JUnit4Provider.invoke(JUnit4Provider.java:128)
07-Dec-2018 07:19:42         at org.apache.maven.surefire.booter.ForkedBooter.invokeProviderInSameClassLoader(ForkedBooter.java:203)
07-Dec-2018 07:19:42         at org.apache.maven.surefire.booter.ForkedBooter.runSuitesInProcess(ForkedBooter.java:155)
07-Dec-2018 07:19:42         at org.apache.maven.surefire.booter.ForkedBooter.main(ForkedBooter.java:103)
07-Dec-2018 07:19:42 Caused by: java.util.concurrent.TimeoutException: CDAP Services are not available. Retried for 600 seconds.
07-Dec-2018 07:19:42         at co.cask.cdap.test.IntegrationTestBase.checkServicesWithRetry(IntegrationTestBase.java:267)
07-Dec-2018 07:19:42         at co.cask.cdap.test.IntegrationTestBase.checkSystemServices(IntegrationTestBase.java:192)
07-Dec-2018 07:19:42         at co.cask.cdap.test.IntegrationTestBase.setUp(IntegrationTestBase.java:99)
07-Dec-2018 07:19:42         at sun.reflect.GeneratedMethodAccessor1.invoke(Unknown Source)
07-Dec-2018 07:19:42         at sun.reflect.DelegatingMethodAccessorImpl.invoke(DelegatingMethodAccessorImpl.java:43)
07-Dec-2018 07:19:42         at java.lang.reflect.Method.invoke(Method.java:498)
07-Dec-2018 07:19:42         at org.junit.runners.model.FrameworkMethod$1.runReflectiveCall(FrameworkMethod.java:50)
07-Dec-2018 07:19:42         at org.junit.internal.runners.model.ReflectiveCallable.run(ReflectiveCallable.java:12)
07-Dec-2018 07:19:42         at org.junit.runners.model.FrameworkMethod.invokeExplosively(FrameworkMethod.java:47)
07-Dec-2018 07:19:42         at org.junit.internal.runners.statements.RunBefores.evaluate(RunBefores.java:24)
07-Dec-2018 07:19:42         at org.junit.internal.runners.statements.RunAfters.evaluate(RunAfters.java:27)
07-Dec-2018 07:19:42         at org.junit.runners.ParentRunner.runLeaf(ParentRunner.java:325)
07-Dec-2018 07:19:42         at org.junit.runners.BlockJUnit4ClassRunner.runChild(BlockJUnit4ClassRunner.java:78)
07-Dec-2018 07:19:42         at org.junit.runners.BlockJUnit4ClassRunner.runChild(BlockJUnit4ClassRunner.java:57)
07-Dec-2018 07:19:42         at org.junit.runners.ParentRunner$3.run(ParentRunner.java:290)
07-Dec-2018 07:19:42         at org.junit.runners.ParentRunner$1.schedule(ParentRunner.java:71)
07-Dec-2018 07:19:42         at org.junit.runners.ParentRunner.runChildren(ParentRunner.java:288)
07-Dec-2018 07:19:42         at org.junit.runners.ParentRunner.access$000(ParentRunner.java:58)
07-Dec-2018 07:19:42         at org.junit.runners.ParentRunner$2.evaluate(ParentRunner.java:268)
07-Dec-2018 07:19:42         at org.junit.rules.ExternalResource$1.evaluate(ExternalResource.java:48)
07-Dec-2018 07:19:42         at org.junit.rules.RunRules.evaluate(RunRules.java:20)
07-Dec-2018 07:19:42         at org.junit.runners.ParentRunner.run(ParentRunner.java:363)
07-Dec-2018 07:19:42         at org.junit.runners.Suite.runChild(Suite.java:128)
07-Dec-2018 07:19:42         at org.junit.runners.Suite.runChild(Suite.java:27)
07-Dec-2018 07:19:42         at org.junit.runners.ParentRunner$3.run(ParentRunner.java:290)
07-Dec-2018 07:19:42         at org.junit.runners.ParentRunner$1.schedule(ParentRunner.java:71)
07-Dec-2018 07:19:42         at org.junit.runners.ParentRunner.runChildren(ParentRunner.java:288)
07-Dec-2018 07:19:42         at org.junit.runners.ParentRunner.access$000(ParentRunner.java:58)
07-Dec-2018 07:19:42         at org.junit.runners.ParentRunner$2.evaluate(ParentRunner.java:268)
07-Dec-2018 07:19:42         at org.junit.runners.ParentRunner.run(ParentRunner.java:363)
07-Dec-2018 07:19:42         at org.apache.maven.surefire.junit4.JUnit4Provider.execute(JUnit4Provider.java:283)
07-Dec-2018 07:19:42         at org.apache.maven.surefire.junit4.JUnit4Provider.executeWithRerun(JUnit4Provider.java:173)
07-Dec-2018 07:19:42         at org.apache.maven.surefire.junit4.JUnit4Provider.executeTestSet(JUnit4Provider.java:153)
07-Dec-2018 07:19:42         at org.apache.maven.surefire.junit4.JUnit4Provider.invoke(JUnit4Provider.java:128)
07-Dec-2018 07:19:42         at org.apache.maven.surefire.booter.ForkedBooter.invokeProviderInSameClassLoader(ForkedBooter.java:203)
07-Dec-2018 07:19:42         at org.apache.maven.surefire.booter.ForkedBooter.runSuitesInProcess(ForkedBooter.java:155)
07-Dec-2018 07:19:42         at org.apache.maven.surefire.booter.ForkedBooter.main(ForkedBooter.java:103)
07-Dec-2018 07:19:42
07-Dec-2018 07:19:42 test(co.cask.cdap.app.etl.wrangler.WranglerServiceTest)  Time elapsed: 608.254 sec  <<< ERROR!
07-Dec-2018 07:19:42 java.lang.RuntimeException: java.util.concurrent.TimeoutException: CDAP Services are not available. Retried for 600 seconds.
07-Dec-2018 07:19:42         at com.google.common.base.Throwables.propagate(Throwables.java:240)
07-Dec-2018 07:19:42         at co.cask.cdap.test.IntegrationTestBase.checkSystemServices(IntegrationTestBase.java:204)
07-Dec-2018 07:19:42         at co.cask.cdap.test.IntegrationTestBase.setUp(IntegrationTestBase.java:99)
07-Dec-2018 07:19:42         at sun.reflect.GeneratedMethodAccessor1.invoke(Unknown Source)
07-Dec-2018 07:19:42         at sun.reflect.DelegatingMethodAccessorImpl.invoke(DelegatingMethodAccessorImpl.java:43)
07-Dec-2018 07:19:42         at java.lang.reflect.Method.invoke(Method.java:498)
07-Dec-2018 07:19:42         at org.junit.runners.model.FrameworkMethod$1.runReflectiveCall(FrameworkMethod.java:50)
07-Dec-2018 07:19:42         at org.junit.internal.runners.model.ReflectiveCallable.run(ReflectiveCallable.java:12)
07-Dec-2018 07:19:42         at org.junit.runners.model.FrameworkMethod.invokeExplosively(FrameworkMethod.java:47)
07-Dec-2018 07:19:42         at org.junit.internal.runners.statements.RunBefores.evaluate(RunBefores.java:24)
07-Dec-2018 07:19:42         at org.junit.internal.runners.statements.RunAfters.evaluate(RunAfters.java:27)
07-Dec-2018 07:19:42         at org.junit.runners.ParentRunner.runLeaf(ParentRunner.java:325)
07-Dec-2018 07:19:42         at org.junit.runners.BlockJUnit4ClassRunner.runChild(BlockJUnit4ClassRunner.java:78)
07-Dec-2018 07:19:42         at org.junit.runners.BlockJUnit4ClassRunner.runChild(BlockJUnit4ClassRunner.java:57)
07-Dec-2018 07:19:42         at org.junit.runners.ParentRunner$3.run(ParentRunner.java:290)
07-Dec-2018 07:19:42         at org.junit.runners.ParentRunner$1.schedule(ParentRunner.java:71)
07-Dec-2018 07:19:42         at org.junit.runners.ParentRunner.runChildren(ParentRunner.java:288)
07-Dec-2018 07:19:42         at org.junit.runners.ParentRunner.access$000(ParentRunner.java:58)
07-Dec-2018 07:19:42         at org.junit.runners.ParentRunner$2.evaluate(ParentRunner.java:268)
07-Dec-2018 07:19:42         at org.junit.rules.ExternalResource$1.evaluate(ExternalResource.java:48)
07-Dec-2018 07:19:42         at org.junit.rules.RunRules.evaluate(RunRules.java:20)
07-Dec-2018 07:19:42         at org.junit.runners.ParentRunner.run(ParentRunner.java:363)
07-Dec-2018 07:19:42         at org.junit.runners.Suite.runChild(Suite.java:128)
07-Dec-2018 07:19:42         at org.junit.runners.Suite.runChild(Suite.java:27)
07-Dec-2018 07:19:42         at org.junit.runners.ParentRunner$3.run(ParentRunner.java:290)
07-Dec-2018 07:19:42         at org.junit.runners.ParentRunner$1.schedule(ParentRunner.java:71)
07-Dec-2018 07:19:42         at org.junit.runners.ParentRunner.runChildren(ParentRunner.java:288)
07-Dec-2018 07:19:42         at org.junit.runners.ParentRunner.access$000(ParentRunner.java:58)
07-Dec-2018 07:19:42         at org.junit.runners.ParentRunner$2.evaluate(ParentRunner.java:268)
07-Dec-2018 07:19:42         at org.junit.runners.ParentRunner.run(ParentRunner.java:363)
07-Dec-2018 07:19:42         at org.apache.maven.surefire.junit4.JUnit4Provider.execute(JUnit4Provider.java:283)
07-Dec-2018 07:19:42         at org.apache.maven.surefire.junit4.JUnit4Provider.executeWithRerun(JUnit4Provider.java:173)
07-Dec-2018 07:19:42         at org.apache.maven.surefire.junit4.JUnit4Provider.executeTestSet(JUnit4Provider.java:153)
07-Dec-2018 07:19:42         at org.apache.maven.surefire.junit4.JUnit4Provider.invoke(JUnit4Provider.java:128)
07-Dec-2018 07:19:42         at org.apache.maven.surefire.booter.ForkedBooter.invokeProviderInSameClassLoader(ForkedBooter.java:203)
07-Dec-2018 07:19:42         at org.apache.maven.surefire.booter.ForkedBooter.runSuitesInProcess(ForkedBooter.java:155)
07-Dec-2018 07:19:42         at org.apache.maven.surefire.booter.ForkedBooter.main(ForkedBooter.java:103)
07-Dec-2018 07:19:42 Caused by: java.util.concurrent.TimeoutException: CDAP Services are not available. Retried for 600 seconds.
07-Dec-2018 07:19:42         at co.cask.cdap.test.IntegrationTestBase.checkServicesWithRetry(IntegrationTestBase.java:267)
07-Dec-2018 07:19:42         at co.cask.cdap.test.IntegrationTestBase.checkSystemServices(IntegrationTestBase.java:192)
07-Dec-2018 07:19:42         at co.cask.cdap.test.IntegrationTestBase.setUp(IntegrationTestBase.java:99)
07-Dec-2018 07:19:42         at sun.reflect.GeneratedMethodAccessor1.invoke(Unknown Source)
07-Dec-2018 07:19:42         at sun.reflect.DelegatingMethodAccessorImpl.invoke(DelegatingMethodAccessorImpl.java:43)
07-Dec-2018 07:19:42         at java.lang.reflect.Method.invoke(Method.java:498)
07-Dec-2018 07:19:42         at org.junit.runners.model.FrameworkMethod$1.runReflectiveCall(FrameworkMethod.java:50)
07-Dec-2018 07:19:42         at org.junit.internal.runners.model.ReflectiveCallable.run(ReflectiveCallable.java:12)
07-Dec-2018 07:19:42         at org.junit.runners.model.FrameworkMethod.invokeExplosively(FrameworkMethod.java:47)
07-Dec-2018 07:19:42         at org.junit.internal.runners.statements.RunBefores.evaluate(RunBefores.java:24)
07-Dec-2018 07:19:42         at org.junit.internal.runners.statements.RunAfters.evaluate(RunAfters.java:27)
07-Dec-2018 07:19:42         at org.junit.runners.ParentRunner.runLeaf(ParentRunner.java:325)
07-Dec-2018 07:19:42         at org.junit.runners.BlockJUnit4ClassRunner.runChild(BlockJUnit4ClassRunner.java:78)
07-Dec-2018 07:19:42         at org.junit.runners.BlockJUnit4ClassRunner.runChild(BlockJUnit4ClassRunner.java:57)
07-Dec-2018 07:19:42         at org.junit.runners.ParentRunner$3.run(ParentRunner.java:290)
07-Dec-2018 07:19:42         at org.junit.runners.ParentRunner$1.schedule(ParentRunner.java:71)
07-Dec-2018 07:19:42         at org.junit.runners.ParentRunner.runChildren(ParentRunner.java:288)
07-Dec-2018 07:19:42         at org.junit.runners.ParentRunner.access$000(ParentRunner.java:58)
07-Dec-2018 07:19:42         at org.junit.runners.ParentRunner$2.evaluate(ParentRunner.java:268)
07-Dec-2018 07:19:42         at org.junit.rules.ExternalResource$1.evaluate(ExternalResource.java:48)
07-Dec-2018 07:19:42         at org.junit.rules.RunRules.evaluate(RunRules.java:20)
07-Dec-2018 07:19:42         at org.junit.runners.ParentRunner.run(ParentRunner.java:363)
07-Dec-2018 07:19:42         at org.junit.runners.Suite.runChild(Suite.java:128)
07-Dec-2018 07:19:42         at org.junit.runners.Suite.runChild(Suite.java:27)
07-Dec-2018 07:19:42         at org.junit.runners.ParentRunner$3.run(ParentRunner.java:290)
07-Dec-2018 07:19:42         at org.junit.runners.ParentRunner$1.schedule(ParentRunner.java:71)
07-Dec-2018 07:19:42         at org.junit.runners.ParentRunner.runChildren(ParentRunner.java:288)
07-Dec-2018 07:19:42         at org.junit.runners.ParentRunner.access$000(ParentRunner.java:58)
07-Dec-2018 07:19:42         at org.junit.runners.ParentRunner$2.evaluate(ParentRunner.java:268)
07-Dec-2018 07:19:42         at org.junit.runners.ParentRunner.run(ParentRunner.java:363)
07-Dec-2018 07:19:42         at org.apache.maven.surefire.junit4.JUnit4Provider.execute(JUnit4Provider.java:283)
07-Dec-2018 07:19:42         at org.apache.maven.surefire.junit4.JUnit4Provider.executeWithRerun(JUnit4Provider.java:173)
07-Dec-2018 07:19:42         at org.apache.maven.surefire.junit4.JUnit4Provider.executeTestSet(JUnit4Provider.java:153)
07-Dec-2018 07:19:42         at org.apache.maven.surefire.junit4.JUnit4Provider.invoke(JUnit4Provider.java:128)
07-Dec-2018 07:19:42         at org.apache.maven.surefire.booter.ForkedBooter.invokeProviderInSameClassLoader(ForkedBooter.java:203)
07-Dec-2018 07:19:42         at org.apache.maven.surefire.booter.ForkedBooter.runSuitesInProcess(ForkedBooter.java:155)
07-Dec-2018 07:19:42         at org.apache.maven.surefire.booter.ForkedBooter.main(ForkedBooter.java:103)
07-Dec-2018 07:19:42
07-Dec-2018 07:19:42 testWranglerMR(co.cask.cdap.app.etl.wrangler.WranglerTest)  Time elapsed: 608.204 sec  <<< ERROR!
07-Dec-2018 07:19:42 java.lang.RuntimeException: java.util.concurrent.TimeoutException: CDAP Services are not available. Retried for 600 seconds.
07-Dec-2018 07:19:42         at com.google.common.base.Throwables.propagate(Throwables.java:240)
07-Dec-2018 07:19:42         at co.cask.cdap.test.IntegrationTestBase.checkSystemServices(IntegrationTestBase.java:204)
07-Dec-2018 07:19:42         at co.cask.cdap.test.IntegrationTestBase.setUp(IntegrationTestBase.java:99)
07-Dec-2018 07:19:42         at sun.reflect.GeneratedMethodAccessor1.invoke(Unknown Source)
07-Dec-2018 07:19:42         at sun.reflect.DelegatingMethodAccessorImpl.invoke(DelegatingMethodAccessorImpl.java:43)
07-Dec-2018 07:19:42         at java.lang.reflect.Method.invoke(Method.java:498)
07-Dec-2018 07:19:42         at org.junit.runners.model.FrameworkMethod$1.runReflectiveCall(FrameworkMethod.java:50)
07-Dec-2018 07:19:42         at org.junit.internal.runners.model.ReflectiveCallable.run(ReflectiveCallable.java:12)
07-Dec-2018 07:19:42         at org.junit.runners.model.FrameworkMethod.invokeExplosively(FrameworkMethod.java:47)
07-Dec-2018 07:19:42         at org.junit.internal.runners.statements.RunBefores.evaluate(RunBefores.java:24)
07-Dec-2018 07:19:42         at org.junit.internal.runners.statements.RunAfters.evaluate(RunAfters.java:27)
07-Dec-2018 07:19:42         at org.junit.runners.ParentRunner.runLeaf(ParentRunner.java:325)
07-Dec-2018 07:19:42         at org.junit.runners.BlockJUnit4ClassRunner.runChild(BlockJUnit4ClassRunner.java:78)
07-Dec-2018 07:19:42         at org.junit.runners.BlockJUnit4ClassRunner.runChild(BlockJUnit4ClassRunner.java:57)
07-Dec-2018 07:19:42         at org.junit.runners.ParentRunner$3.run(ParentRunner.java:290)
07-Dec-2018 07:19:42         at org.junit.runners.ParentRunner$1.schedule(ParentRunner.java:71)
07-Dec-2018 07:19:42         at org.junit.runners.ParentRunner.runChildren(ParentRunner.java:288)
07-Dec-2018 07:19:42         at org.junit.runners.ParentRunner.access$000(ParentRunner.java:58)
07-Dec-2018 07:19:42         at org.junit.runners.ParentRunner$2.evaluate(ParentRunner.java:268)
07-Dec-2018 07:19:42         at org.junit.rules.ExternalResource$1.evaluate(ExternalResource.java:48)
07-Dec-2018 07:19:42         at org.junit.rules.RunRules.evaluate(RunRules.java:20)
07-Dec-2018 07:19:42         at org.junit.runners.ParentRunner.run(ParentRunner.java:363)
07-Dec-2018 07:19:42         at org.junit.runners.Suite.runChild(Suite.java:128)
07-Dec-2018 07:19:42         at org.junit.runners.Suite.runChild(Suite.java:27)
07-Dec-2018 07:19:42         at org.junit.runners.ParentRunner$3.run(ParentRunner.java:290)
07-Dec-2018 07:19:42         at org.junit.runners.ParentRunner$1.schedule(ParentRunner.java:71)
07-Dec-2018 07:19:42         at org.junit.runners.ParentRunner.runChildren(ParentRunner.java:288)
07-Dec-2018 07:19:42         at org.junit.runners.ParentRunner.access$000(ParentRunner.java:58)
07-Dec-2018 07:19:42         at org.junit.runners.ParentRunner$2.evaluate(ParentRunner.java:268)
07-Dec-2018 07:19:42         at org.junit.runners.ParentRunner.run(ParentRunner.java:363)
07-Dec-2018 07:19:42         at org.apache.maven.surefire.junit4.JUnit4Provider.execute(JUnit4Provider.java:283)
07-Dec-2018 07:19:42         at org.apache.maven.surefire.junit4.JUnit4Provider.executeWithRerun(JUnit4Provider.java:173)
07-Dec-2018 07:19:42         at org.apache.maven.surefire.junit4.JUnit4Provider.executeTestSet(JUnit4Provider.java:153)
07-Dec-2018 07:19:42         at org.apache.maven.surefire.junit4.JUnit4Provider.invoke(JUnit4Provider.java:128)
07-Dec-2018 07:19:42         at org.apache.maven.surefire.booter.ForkedBooter.invokeProviderInSameClassLoader(ForkedBooter.java:203)
07-Dec-2018 07:19:42         at org.apache.maven.surefire.booter.ForkedBooter.runSuitesInProcess(ForkedBooter.java:155)
07-Dec-2018 07:19:42         at org.apache.maven.surefire.booter.ForkedBooter.main(ForkedBooter.java:103)
07-Dec-2018 07:19:42 Caused by: java.util.concurrent.TimeoutException: CDAP Services are not available. Retried for 600 seconds.
07-Dec-2018 07:19:42         at co.cask.cdap.test.IntegrationTestBase.checkServicesWithRetry(IntegrationTestBase.java:267)
07-Dec-2018 07:19:42         at co.cask.cdap.test.IntegrationTestBase.checkSystemServices(IntegrationTestBase.java:192)
07-Dec-2018 07:19:42         at co.cask.cdap.test.IntegrationTestBase.setUp(IntegrationTestBase.java:99)
07-Dec-2018 07:19:42         at sun.reflect.GeneratedMethodAccessor1.invoke(Unknown Source)
07-Dec-2018 07:19:42         at sun.reflect.DelegatingMethodAccessorImpl.invoke(DelegatingMethodAccessorImpl.java:43)
07-Dec-2018 07:19:42         at java.lang.reflect.Method.invoke(Method.java:498)
07-Dec-2018 07:19:42         at org.junit.runners.model.FrameworkMethod$1.runReflectiveCall(FrameworkMethod.java:50)
07-Dec-2018 07:19:42         at org.junit.internal.runners.model.ReflectiveCallable.run(ReflectiveCallable.java:12)
07-Dec-2018 07:19:42         at org.junit.runners.model.FrameworkMethod.invokeExplosively(FrameworkMethod.java:47)
07-Dec-2018 07:19:42         at org.junit.internal.runners.statements.RunBefores.evaluate(RunBefores.java:24)
07-Dec-2018 07:19:42         at org.junit.internal.runners.statements.RunAfters.evaluate(RunAfters.java:27)
07-Dec-2018 07:19:42         at org.junit.runners.ParentRunner.runLeaf(ParentRunner.java:325)
07-Dec-2018 07:19:42         at org.junit.runners.BlockJUnit4ClassRunner.runChild(BlockJUnit4ClassRunner.java:78)
07-Dec-2018 07:19:42         at org.junit.runners.BlockJUnit4ClassRunner.runChild(BlockJUnit4ClassRunner.java:57)
07-Dec-2018 07:19:42         at org.junit.runners.ParentRunner$3.run(ParentRunner.java:290)
07-Dec-2018 07:19:42         at org.junit.runners.ParentRunner$1.schedule(ParentRunner.java:71)
07-Dec-2018 07:19:42         at org.junit.runners.ParentRunner.runChildren(ParentRunner.java:288)
07-Dec-2018 07:19:42         at org.junit.runners.ParentRunner.access$000(ParentRunner.java:58)
07-Dec-2018 07:19:42         at org.junit.runners.ParentRunner$2.evaluate(ParentRunner.java:268)
07-Dec-2018 07:19:42         at org.junit.rules.ExternalResource$1.evaluate(ExternalResource.java:48)
07-Dec-2018 07:19:42         at org.junit.rules.RunRules.evaluate(RunRules.java:20)
07-Dec-2018 07:19:42         at org.junit.runners.ParentRunner.run(ParentRunner.java:363)
07-Dec-2018 07:19:42         at org.junit.runners.Suite.runChild(Suite.java:128)
07-Dec-2018 07:19:42         at org.junit.runners.Suite.runChild(Suite.java:27)
07-Dec-2018 07:19:42         at org.junit.runners.ParentRunner$3.run(ParentRunner.java:290)
07-Dec-2018 07:19:42         at org.junit.runners.ParentRunner$1.schedule(ParentRunner.java:71)
07-Dec-2018 07:19:42         at org.junit.runners.ParentRunner.runChildren(ParentRunner.java:288)
07-Dec-2018 07:19:42         at org.junit.runners.ParentRunner.access$000(ParentRunner.java:58)
07-Dec-2018 07:19:42         at org.junit.runners.ParentRunner$2.evaluate(ParentRunner.java:268)
07-Dec-2018 07:19:42         at org.junit.runners.ParentRunner.run(ParentRunner.java:363)
07-Dec-2018 07:19:42         at org.apache.maven.surefire.junit4.JUnit4Provider.execute(JUnit4Provider.java:283)
07-Dec-2018 07:19:42         at org.apache.maven.surefire.junit4.JUnit4Provider.executeWithRerun(JUnit4Provider.java:173)
07-Dec-2018 07:19:42         at org.apache.maven.surefire.junit4.JUnit4Provider.executeTestSet(JUnit4Provider.java:153)
07-Dec-2018 07:19:42         at org.apache.maven.surefire.junit4.JUnit4Provider.invoke(JUnit4Provider.java:128)
07-Dec-2018 07:19:42         at org.apache.maven.surefire.booter.ForkedBooter.invokeProviderInSameClassLoader(ForkedBooter.java:203)
07-Dec-2018 07:19:42         at org.apache.maven.surefire.booter.ForkedBooter.runSuitesInProcess(ForkedBooter.java:155)
07-Dec-2018 07:19:42         at org.apache.maven.surefire.booter.ForkedBooter.main(ForkedBooter.java:103)
07-Dec-2018 07:19:42
07-Dec-2018 07:19:42 testWranglerSpark(co.cask.cdap.app.etl.wrangler.WranglerTest)  Time elapsed: 608.295 sec  <<< ERROR!
07-Dec-2018 07:19:42 java.lang.RuntimeException: java.util.concurrent.TimeoutException: CDAP Services are not available. Retried for 600 seconds.
07-Dec-2018 07:19:42         at com.google.common.base.Throwables.propagate(Throwables.java:240)
07-Dec-2018 07:19:42         at co.cask.cdap.test.IntegrationTestBase.checkSystemServices(IntegrationTestBase.java:204)
07-Dec-2018 07:19:42         at co.cask.cdap.test.IntegrationTestBase.setUp(IntegrationTestBase.java:99)
07-Dec-2018 07:19:42         at sun.reflect.GeneratedMethodAccessor1.invoke(Unknown Source)
07-Dec-2018 07:19:42         at sun.reflect.DelegatingMethodAccessorImpl.invoke(DelegatingMethodAccessorImpl.java:43)
07-Dec-2018 07:19:42         at java.lang.reflect.Method.invoke(Method.java:498)
07-Dec-2018 07:19:42         at org.junit.runners.model.FrameworkMethod$1.runReflectiveCall(FrameworkMethod.java:50)
07-Dec-2018 07:19:42         at org.junit.internal.runners.model.ReflectiveCallable.run(ReflectiveCallable.java:12)
07-Dec-2018 07:19:42         at org.junit.runners.model.FrameworkMethod.invokeExplosively(FrameworkMethod.java:47)
07-Dec-2018 07:19:42         at org.junit.internal.runners.statements.RunBefores.evaluate(RunBefores.java:24)
07-Dec-2018 07:19:42         at org.junit.internal.runners.statements.RunAfters.evaluate(RunAfters.java:27)
07-Dec-2018 07:19:42         at org.junit.runners.ParentRunner.runLeaf(ParentRunner.java:325)
07-Dec-2018 07:19:42         at org.junit.runners.BlockJUnit4ClassRunner.runChild(BlockJUnit4ClassRunner.java:78)
07-Dec-2018 07:19:42         at org.junit.runners.BlockJUnit4ClassRunner.runChild(BlockJUnit4ClassRunner.java:57)
07-Dec-2018 07:19:42         at org.junit.runners.ParentRunner$3.run(ParentRunner.java:290)
07-Dec-2018 07:19:42         at org.junit.runners.ParentRunner$1.schedule(ParentRunner.java:71)
07-Dec-2018 07:19:42         at org.junit.runners.ParentRunner.runChildren(ParentRunner.java:288)
07-Dec-2018 07:19:42         at org.junit.runners.ParentRunner.access$000(ParentRunner.java:58)
07-Dec-2018 07:19:42         at org.junit.runners.ParentRunner$2.evaluate(ParentRunner.java:268)
07-Dec-2018 07:19:42         at org.junit.rules.ExternalResource$1.evaluate(ExternalResource.java:48)
07-Dec-2018 07:19:42         at org.junit.rules.RunRules.evaluate(RunRules.java:20)
07-Dec-2018 07:19:42         at org.junit.runners.ParentRunner.run(ParentRunner.java:363)
07-Dec-2018 07:19:42         at org.junit.runners.Suite.runChild(Suite.java:128)
07-Dec-2018 07:19:42         at org.junit.runners.Suite.runChild(Suite.java:27)
07-Dec-2018 07:19:42         at org.junit.runners.ParentRunner$3.run(ParentRunner.java:290)
07-Dec-2018 07:19:42         at org.junit.runners.ParentRunner$1.schedule(ParentRunner.java:71)
07-Dec-2018 07:19:42         at org.junit.runners.ParentRunner.runChildren(ParentRunner.java:288)
07-Dec-2018 07:19:42         at org.junit.runners.ParentRunner.access$000(ParentRunner.java:58)
07-Dec-2018 07:19:42         at org.junit.runners.ParentRunner$2.evaluate(ParentRunner.java:268)
07-Dec-2018 07:19:42         at org.junit.runners.ParentRunner.run(ParentRunner.java:363)
07-Dec-2018 07:19:42         at org.apache.maven.surefire.junit4.JUnit4Provider.execute(JUnit4Provider.java:283)
07-Dec-2018 07:19:42         at org.apache.maven.surefire.junit4.JUnit4Provider.executeWithRerun(JUnit4Provider.java:173)
07-Dec-2018 07:19:42         at org.apache.maven.surefire.junit4.JUnit4Provider.executeTestSet(JUnit4Provider.java:153)
07-Dec-2018 07:19:42         at org.apache.maven.surefire.junit4.JUnit4Provider.invoke(JUnit4Provider.java:128)
07-Dec-2018 07:19:42         at org.apache.maven.surefire.booter.ForkedBooter.invokeProviderInSameClassLoader(ForkedBooter.java:203)
07-Dec-2018 07:19:42         at org.apache.maven.surefire.booter.ForkedBooter.runSuitesInProcess(ForkedBooter.java:155)
07-Dec-2018 07:19:42         at org.apache.maven.surefire.booter.ForkedBooter.main(ForkedBooter.java:103)
07-Dec-2018 07:19:42 Caused by: java.util.concurrent.TimeoutException: CDAP Services are not available. Retried for 600 seconds.
07-Dec-2018 07:19:42         at co.cask.cdap.test.IntegrationTestBase.checkServicesWithRetry(IntegrationTestBase.java:267)
07-Dec-2018 07:19:42         at co.cask.cdap.test.IntegrationTestBase.checkSystemServices(IntegrationTestBase.java:192)
07-Dec-2018 07:19:42         at co.cask.cdap.test.IntegrationTestBase.setUp(IntegrationTestBase.java:99)
07-Dec-2018 07:19:42         at sun.reflect.GeneratedMethodAccessor1.invoke(Unknown Source)
07-Dec-2018 07:19:42         at sun.reflect.DelegatingMethodAccessorImpl.invoke(DelegatingMethodAccessorImpl.java:43)
07-Dec-2018 07:19:42         at java.lang.reflect.Method.invoke(Method.java:498)
07-Dec-2018 07:19:42         at org.junit.runners.model.FrameworkMethod$1.runReflectiveCall(FrameworkMethod.java:50)
07-Dec-2018 07:19:42         at org.junit.internal.runners.model.ReflectiveCallable.run(ReflectiveCallable.java:12)
07-Dec-2018 07:19:42         at org.junit.runners.model.FrameworkMethod.invokeExplosively(FrameworkMethod.java:47)
07-Dec-2018 07:19:42         at org.junit.internal.runners.statements.RunBefores.evaluate(RunBefores.java:24)
07-Dec-2018 07:19:42         at org.junit.internal.runners.statements.RunAfters.evaluate(RunAfters.java:27)
07-Dec-2018 07:19:42         at org.junit.runners.ParentRunner.runLeaf(ParentRunner.java:325)
07-Dec-2018 07:19:42         at org.junit.runners.BlockJUnit4ClassRunner.runChild(BlockJUnit4ClassRunner.java:78)
07-Dec-2018 07:19:42         at org.junit.runners.BlockJUnit4ClassRunner.runChild(BlockJUnit4ClassRunner.java:57)
07-Dec-2018 07:19:42         at org.junit.runners.ParentRunner$3.run(ParentRunner.java:290)
07-Dec-2018 07:19:42         at org.junit.runners.ParentRunner$1.schedule(ParentRunner.java:71)
07-Dec-2018 07:19:42         at org.junit.runners.ParentRunner.runChildren(ParentRunner.java:288)
07-Dec-2018 07:19:42         at org.junit.runners.ParentRunner.access$000(ParentRunner.java:58)
07-Dec-2018 07:19:42         at org.junit.runners.ParentRunner$2.evaluate(ParentRunner.java:268)
07-Dec-2018 07:19:42         at org.junit.rules.ExternalResource$1.evaluate(ExternalResource.java:48)
07-Dec-2018 07:19:42         at org.junit.rules.RunRules.evaluate(RunRules.java:20)
07-Dec-2018 07:19:42         at org.junit.runners.ParentRunner.run(ParentRunner.java:363)
07-Dec-2018 07:19:42         at org.junit.runners.Suite.runChild(Suite.java:128)
07-Dec-2018 07:19:42         at org.junit.runners.Suite.runChild(Suite.java:27)
07-Dec-2018 07:19:42         at org.junit.runners.ParentRunner$3.run(ParentRunner.java:290)
07-Dec-2018 07:19:42         at org.junit.runners.ParentRunner$1.schedule(ParentRunner.java:71)
07-Dec-2018 07:19:42         at org.junit.runners.ParentRunner.runChildren(ParentRunner.java:288)
07-Dec-2018 07:19:42         at org.junit.runners.ParentRunner.access$000(ParentRunner.java:58)
07-Dec-2018 07:19:42         at org.junit.runners.ParentRunner$2.evaluate(ParentRunner.java:268)
07-Dec-2018 07:19:42         at org.junit.runners.ParentRunner.run(ParentRunner.java:363)
07-Dec-2018 07:19:42         at org.apache.maven.surefire.junit4.JUnit4Provider.execute(JUnit4Provider.java:283)
07-Dec-2018 07:19:42         at org.apache.maven.surefire.junit4.JUnit4Provider.executeWithRerun(JUnit4Provider.java:173)
07-Dec-2018 07:19:42         at org.apache.maven.surefire.junit4.JUnit4Provider.executeTestSet(JUnit4Provider.java:153)
07-Dec-2018 07:19:42         at org.apache.maven.surefire.junit4.JUnit4Provider.invoke(JUnit4Provider.java:128)
07-Dec-2018 07:19:42         at org.apache.maven.surefire.booter.ForkedBooter.invokeProviderInSameClassLoader(ForkedBooter.java:203)
07-Dec-2018 07:19:42         at org.apache.maven.surefire.booter.ForkedBooter.runSuitesInProcess(ForkedBooter.java:155)
07-Dec-2018 07:19:42         at org.apache.maven.surefire.booter.ForkedBooter.main(ForkedBooter.java:103)
07-Dec-2018 07:19:42
07-Dec-2018 07:19:42 testPreProcessingNotRequired(co.cask.cdap.app.etl.batch.XMLReaderTest)  Time elapsed: 608.227 sec  <<< ERROR!
07-Dec-2018 07:19:42 java.lang.RuntimeException: java.util.concurrent.TimeoutException: CDAP Services are not available. Retried for 600 seconds.
07-Dec-2018 07:19:42         at com.google.common.base.Throwables.propagate(Throwables.java:240)
07-Dec-2018 07:19:42         at co.cask.cdap.test.IntegrationTestBase.checkSystemServices(IntegrationTestBase.java:204)
07-Dec-2018 07:19:42         at co.cask.cdap.test.IntegrationTestBase.setUp(IntegrationTestBase.java:99)
07-Dec-2018 07:19:42         at sun.reflect.GeneratedMethodAccessor1.invoke(Unknown Source)
07-Dec-2018 07:19:42         at sun.reflect.DelegatingMethodAccessorImpl.invoke(DelegatingMethodAccessorImpl.java:43)
07-Dec-2018 07:19:42         at java.lang.reflect.Method.invoke(Method.java:498)
07-Dec-2018 07:19:42         at org.junit.runners.model.FrameworkMethod$1.runReflectiveCall(FrameworkMethod.java:50)
07-Dec-2018 07:19:42         at org.junit.internal.runners.model.ReflectiveCallable.run(ReflectiveCallable.java:12)
07-Dec-2018 07:19:42         at org.junit.runners.model.FrameworkMethod.invokeExplosively(FrameworkMethod.java:47)
07-Dec-2018 07:19:42         at org.junit.internal.runners.statements.RunBefores.evaluate(RunBefores.java:24)
07-Dec-2018 07:19:42         at org.junit.internal.runners.statements.RunAfters.evaluate(RunAfters.java:27)
07-Dec-2018 07:19:42         at org.junit.runners.ParentRunner.runLeaf(ParentRunner.java:325)
07-Dec-2018 07:19:42         at org.junit.runners.BlockJUnit4ClassRunner.runChild(BlockJUnit4ClassRunner.java:78)
07-Dec-2018 07:19:42         at org.junit.runners.BlockJUnit4ClassRunner.runChild(BlockJUnit4ClassRunner.java:57)
07-Dec-2018 07:19:42         at org.junit.runners.ParentRunner$3.run(ParentRunner.java:290)
07-Dec-2018 07:19:42         at org.junit.runners.ParentRunner$1.schedule(ParentRunner.java:71)
07-Dec-2018 07:19:42         at org.junit.runners.ParentRunner.runChildren(ParentRunner.java:288)
07-Dec-2018 07:19:42         at org.junit.runners.ParentRunner.access$000(ParentRunner.java:58)
07-Dec-2018 07:19:42         at org.junit.runners.ParentRunner$2.evaluate(ParentRunner.java:268)
07-Dec-2018 07:19:42         at org.junit.rules.ExternalResource$1.evaluate(ExternalResource.java:48)
07-Dec-2018 07:19:42         at org.junit.rules.RunRules.evaluate(RunRules.java:20)
07-Dec-2018 07:19:42         at org.junit.runners.ParentRunner.run(ParentRunner.java:363)
07-Dec-2018 07:19:42         at org.junit.runners.Suite.runChild(Suite.java:128)
07-Dec-2018 07:19:42         at org.junit.runners.Suite.runChild(Suite.java:27)
07-Dec-2018 07:19:42         at org.junit.runners.ParentRunner$3.run(ParentRunner.java:290)
07-Dec-2018 07:19:42         at org.junit.runners.ParentRunner$1.schedule(ParentRunner.java:71)
07-Dec-2018 07:19:42         at org.junit.runners.ParentRunner.runChildren(ParentRunner.java:288)
07-Dec-2018 07:19:42         at org.junit.runners.ParentRunner.access$000(ParentRunner.java:58)
07-Dec-2018 07:19:42         at org.junit.runners.ParentRunner$2.evaluate(ParentRunner.java:268)
07-Dec-2018 07:19:42         at org.junit.runners.ParentRunner.run(ParentRunner.java:363)
07-Dec-2018 07:19:42         at org.apache.maven.surefire.junit4.JUnit4Provider.execute(JUnit4Provider.java:283)
07-Dec-2018 07:19:42         at org.apache.maven.surefire.junit4.JUnit4Provider.executeWithRerun(JUnit4Provider.java:173)
07-Dec-2018 07:19:42         at org.apache.maven.surefire.junit4.JUnit4Provider.executeTestSet(JUnit4Provider.java:153)
07-Dec-2018 07:19:42         at org.apache.maven.surefire.junit4.JUnit4Provider.invoke(JUnit4Provider.java:128)
07-Dec-2018 07:19:42         at org.apache.maven.surefire.booter.ForkedBooter.invokeProviderInSameClassLoader(ForkedBooter.java:203)
07-Dec-2018 07:19:42         at org.apache.maven.surefire.booter.ForkedBooter.runSuitesInProcess(ForkedBooter.java:155)
07-Dec-2018 07:19:42         at org.apache.maven.surefire.booter.ForkedBooter.main(ForkedBooter.java:103)
07-Dec-2018 07:19:42 Caused by: java.util.concurrent.TimeoutException: CDAP Services are not available. Retried for 600 seconds.
07-Dec-2018 07:19:42         at co.cask.cdap.test.IntegrationTestBase.checkServicesWithRetry(IntegrationTestBase.java:267)
07-Dec-2018 07:19:42         at co.cask.cdap.test.IntegrationTestBase.checkSystemServices(IntegrationTestBase.java:192)
07-Dec-2018 07:19:42         at co.cask.cdap.test.IntegrationTestBase.setUp(IntegrationTestBase.java:99)
07-Dec-2018 07:19:42         at sun.reflect.GeneratedMethodAccessor1.invoke(Unknown Source)
07-Dec-2018 07:19:42         at sun.reflect.DelegatingMethodAccessorImpl.invoke(DelegatingMethodAccessorImpl.java:43)
07-Dec-2018 07:19:42         at java.lang.reflect.Method.invoke(Method.java:498)
07-Dec-2018 07:19:42         at org.junit.runners.model.FrameworkMethod$1.runReflectiveCall(FrameworkMethod.java:50)
07-Dec-2018 07:19:42         at org.junit.internal.runners.model.ReflectiveCallable.run(ReflectiveCallable.java:12)
07-Dec-2018 07:19:42         at org.junit.runners.model.FrameworkMethod.invokeExplosively(FrameworkMethod.java:47)
07-Dec-2018 07:19:42         at org.junit.internal.runners.statements.RunBefores.evaluate(RunBefores.java:24)
07-Dec-2018 07:19:42         at org.junit.internal.runners.statements.RunAfters.evaluate(RunAfters.java:27)
07-Dec-2018 07:19:42         at org.junit.runners.ParentRunner.runLeaf(ParentRunner.java:325)
07-Dec-2018 07:19:42         at org.junit.runners.BlockJUnit4ClassRunner.runChild(BlockJUnit4ClassRunner.java:78)
07-Dec-2018 07:19:42         at org.junit.runners.BlockJUnit4ClassRunner.runChild(BlockJUnit4ClassRunner.java:57)
07-Dec-2018 07:19:42         at org.junit.runners.ParentRunner$3.run(ParentRunner.java:290)
07-Dec-2018 07:19:42         at org.junit.runners.ParentRunner$1.schedule(ParentRunner.java:71)
07-Dec-2018 07:19:42         at org.junit.runners.ParentRunner.runChildren(ParentRunner.java:288)
07-Dec-2018 07:19:42         at org.junit.runners.ParentRunner.access$000(ParentRunner.java:58)
07-Dec-2018 07:19:42         at org.junit.runners.ParentRunner$2.evaluate(ParentRunner.java:268)
07-Dec-2018 07:19:42         at org.junit.rules.ExternalResource$1.evaluate(ExternalResource.java:48)
07-Dec-2018 07:19:42         at org.junit.rules.RunRules.evaluate(RunRules.java:20)
07-Dec-2018 07:19:42         at org.junit.runners.ParentRunner.run(ParentRunner.java:363)
07-Dec-2018 07:19:42         at org.junit.runners.Suite.runChild(Suite.java:128)
07-Dec-2018 07:19:42         at org.junit.runners.Suite.runChild(Suite.java:27)
07-Dec-2018 07:19:42         at org.junit.runners.ParentRunner$3.run(ParentRunner.java:290)
07-Dec-2018 07:19:42         at org.junit.runners.ParentRunner$1.schedule(ParentRunner.java:71)
07-Dec-2018 07:19:42         at org.junit.runners.ParentRunner.runChildren(ParentRunner.java:288)
07-Dec-2018 07:19:42         at org.junit.runners.ParentRunner.access$000(ParentRunner.java:58)
07-Dec-2018 07:19:42         at org.junit.runners.ParentRunner$2.evaluate(ParentRunner.java:268)
07-Dec-2018 07:19:42         at org.junit.runners.ParentRunner.run(ParentRunner.java:363)
07-Dec-2018 07:19:42         at org.apache.maven.surefire.junit4.JUnit4Provider.execute(JUnit4Provider.java:283)
07-Dec-2018 07:19:42         at org.apache.maven.surefire.junit4.JUnit4Provider.executeWithRerun(JUnit4Provider.java:173)
07-Dec-2018 07:19:42         at org.apache.maven.surefire.junit4.JUnit4Provider.executeTestSet(JUnit4Provider.java:153)
07-Dec-2018 07:19:42         at org.apache.maven.surefire.junit4.JUnit4Provider.invoke(JUnit4Provider.java:128)
07-Dec-2018 07:19:42         at org.apache.maven.surefire.booter.ForkedBooter.invokeProviderInSameClassLoader(ForkedBooter.java:203)
07-Dec-2018 07:19:42         at org.apache.maven.surefire.booter.ForkedBooter.runSuitesInProcess(ForkedBooter.java:155)
07-Dec-2018 07:19:42         at org.apache.maven.surefire.booter.ForkedBooter.main(ForkedBooter.java:103)
07-Dec-2018 07:19:42
07-Dec-2018 07:19:42 testInvalidPatternWithDeleteAction(co.cask.cdap.app.etl.batch.XMLReaderTest)  Time elapsed: 608.293 sec  <<< ERROR!
07-Dec-2018 07:19:42 java.lang.RuntimeException: java.util.concurrent.TimeoutException: CDAP Services are not available. Retried for 600 seconds.
07-Dec-2018 07:19:42         at com.google.common.base.Throwables.propagate(Throwables.java:240)
07-Dec-2018 07:19:42         at co.cask.cdap.test.IntegrationTestBase.checkSystemServices(IntegrationTestBase.java:204)
07-Dec-2018 07:19:42         at co.cask.cdap.test.IntegrationTestBase.setUp(IntegrationTestBase.java:99)
07-Dec-2018 07:19:42         at sun.reflect.GeneratedMethodAccessor1.invoke(Unknown Source)
07-Dec-2018 07:19:42         at sun.reflect.DelegatingMethodAccessorImpl.invoke(DelegatingMethodAccessorImpl.java:43)
07-Dec-2018 07:19:42         at java.lang.reflect.Method.invoke(Method.java:498)
07-Dec-2018 07:19:42         at org.junit.runners.model.FrameworkMethod$1.runReflectiveCall(FrameworkMethod.java:50)
07-Dec-2018 07:19:42         at org.junit.internal.runners.model.ReflectiveCallable.run(ReflectiveCallable.java:12)
07-Dec-2018 07:19:42         at org.junit.runners.model.FrameworkMethod.invokeExplosively(FrameworkMethod.java:47)
07-Dec-2018 07:19:42         at org.junit.internal.runners.statements.RunBefores.evaluate(RunBefores.java:24)
07-Dec-2018 07:19:42         at org.junit.internal.runners.statements.RunAfters.evaluate(RunAfters.java:27)
07-Dec-2018 07:19:42         at org.junit.runners.ParentRunner.runLeaf(ParentRunner.java:325)
07-Dec-2018 07:19:42         at org.junit.runners.BlockJUnit4ClassRunner.runChild(BlockJUnit4ClassRunner.java:78)
07-Dec-2018 07:19:42         at org.junit.runners.BlockJUnit4ClassRunner.runChild(BlockJUnit4ClassRunner.java:57)
07-Dec-2018 07:19:42         at org.junit.runners.ParentRunner$3.run(ParentRunner.java:290)
07-Dec-2018 07:19:42         at org.junit.runners.ParentRunner$1.schedule(ParentRunner.java:71)
07-Dec-2018 07:19:42         at org.junit.runners.ParentRunner.runChildren(ParentRunner.java:288)
07-Dec-2018 07:19:42         at org.junit.runners.ParentRunner.access$000(ParentRunner.java:58)
07-Dec-2018 07:19:42         at org.junit.runners.ParentRunner$2.evaluate(ParentRunner.java:268)
07-Dec-2018 07:19:42         at org.junit.rules.ExternalResource$1.evaluate(ExternalResource.java:48)
07-Dec-2018 07:19:42         at org.junit.rules.RunRules.evaluate(RunRules.java:20)
07-Dec-2018 07:19:42         at org.junit.runners.ParentRunner.run(ParentRunner.java:363)
07-Dec-2018 07:19:42         at org.junit.runners.Suite.runChild(Suite.java:128)
07-Dec-2018 07:19:42         at org.junit.runners.Suite.runChild(Suite.java:27)
07-Dec-2018 07:19:42         at org.junit.runners.ParentRunner$3.run(ParentRunner.java:290)
07-Dec-2018 07:19:42         at org.junit.runners.ParentRunner$1.schedule(ParentRunner.java:71)
07-Dec-2018 07:19:42         at org.junit.runners.ParentRunner.runChildren(ParentRunner.java:288)
07-Dec-2018 07:19:42         at org.junit.runners.ParentRunner.access$000(ParentRunner.java:58)
07-Dec-2018 07:19:42         at org.junit.runners.ParentRunner$2.evaluate(ParentRunner.java:268)
07-Dec-2018 07:19:42         at org.junit.runners.ParentRunner.run(ParentRunner.java:363)
07-Dec-2018 07:19:42         at org.apache.maven.surefire.junit4.JUnit4Provider.execute(JUnit4Provider.java:283)
07-Dec-2018 07:19:42         at org.apache.maven.surefire.junit4.JUnit4Provider.executeWithRerun(JUnit4Provider.java:173)
07-Dec-2018 07:19:42         at org.apache.maven.surefire.junit4.JUnit4Provider.executeTestSet(JUnit4Provider.java:153)
07-Dec-2018 07:19:42         at org.apache.maven.surefire.junit4.JUnit4Provider.invoke(JUnit4Provider.java:128)
07-Dec-2018 07:19:42         at org.apache.maven.surefire.booter.ForkedBooter.invokeProviderInSameClassLoader(ForkedBooter.java:203)
07-Dec-2018 07:19:42         at org.apache.maven.surefire.booter.ForkedBooter.runSuitesInProcess(ForkedBooter.java:155)
07-Dec-2018 07:19:42         at org.apache.maven.surefire.booter.ForkedBooter.main(ForkedBooter.java:103)
07-Dec-2018 07:19:42 Caused by: java.util.concurrent.TimeoutException: CDAP Services are not available. Retried for 600 seconds.
07-Dec-2018 07:19:42         at co.cask.cdap.test.IntegrationTestBase.checkServicesWithRetry(IntegrationTestBase.java:267)
07-Dec-2018 07:19:42         at co.cask.cdap.test.IntegrationTestBase.checkSystemServices(IntegrationTestBase.java:192)
07-Dec-2018 07:19:42         at co.cask.cdap.test.IntegrationTestBase.setUp(IntegrationTestBase.java:99)
07-Dec-2018 07:19:42         at sun.reflect.GeneratedMethodAccessor1.invoke(Unknown Source)
07-Dec-2018 07:19:42         at sun.reflect.DelegatingMethodAccessorImpl.invoke(DelegatingMethodAccessorImpl.java:43)
07-Dec-2018 07:19:42         at java.lang.reflect.Method.invoke(Method.java:498)
07-Dec-2018 07:19:42         at org.junit.runners.model.FrameworkMethod$1.runReflectiveCall(FrameworkMethod.java:50)
07-Dec-2018 07:19:42         at org.junit.internal.runners.model.ReflectiveCallable.run(ReflectiveCallable.java:12)
07-Dec-2018 07:19:42         at org.junit.runners.model.FrameworkMethod.invokeExplosively(FrameworkMethod.java:47)
07-Dec-2018 07:19:42         at org.junit.internal.runners.statements.RunBefores.evaluate(RunBefores.java:24)
07-Dec-2018 07:19:42         at org.junit.internal.runners.statements.RunAfters.evaluate(RunAfters.java:27)
07-Dec-2018 07:19:42         at org.junit.runners.ParentRunner.runLeaf(ParentRunner.java:325)
07-Dec-2018 07:19:42         at org.junit.runners.BlockJUnit4ClassRunner.runChild(BlockJUnit4ClassRunner.java:78)
07-Dec-2018 07:19:42         at org.junit.runners.BlockJUnit4ClassRunner.runChild(BlockJUnit4ClassRunner.java:57)
07-Dec-2018 07:19:42         at org.junit.runners.ParentRunner$3.run(ParentRunner.java:290)
07-Dec-2018 07:19:42         at org.junit.runners.ParentRunner$1.schedule(ParentRunner.java:71)
07-Dec-2018 07:19:42         at org.junit.runners.ParentRunner.runChildren(ParentRunner.java:288)
07-Dec-2018 07:19:42         at org.junit.runners.ParentRunner.access$000(ParentRunner.java:58)
07-Dec-2018 07:19:42         at org.junit.runners.ParentRunner$2.evaluate(ParentRunner.java:268)
07-Dec-2018 07:19:42         at org.junit.rules.ExternalResource$1.evaluate(ExternalResource.java:48)
07-Dec-2018 07:19:42         at org.junit.rules.RunRules.evaluate(RunRules.java:20)
07-Dec-2018 07:19:42         at org.junit.runners.ParentRunner.run(ParentRunner.java:363)
07-Dec-2018 07:19:42         at org.junit.runners.Suite.runChild(Suite.java:128)
07-Dec-2018 07:19:42         at org.junit.runners.Suite.runChild(Suite.java:27)
07-Dec-2018 07:19:42         at org.junit.runners.ParentRunner$3.run(ParentRunner.java:290)
07-Dec-2018 07:19:42         at org.junit.runners.ParentRunner$1.schedule(ParentRunner.java:71)
07-Dec-2018 07:19:42         at org.junit.runners.ParentRunner.runChildren(ParentRunner.java:288)
07-Dec-2018 07:19:42         at org.junit.runners.ParentRunner.access$000(ParentRunner.java:58)
07-Dec-2018 07:19:42         at org.junit.runners.ParentRunner$2.evaluate(ParentRunner.java:268)
07-Dec-2018 07:19:42         at org.junit.runners.ParentRunner.run(ParentRunner.java:363)
07-Dec-2018 07:19:42         at org.apache.maven.surefire.junit4.JUnit4Provider.execute(JUnit4Provider.java:283)
07-Dec-2018 07:19:42         at org.apache.maven.surefire.junit4.JUnit4Provider.executeWithRerun(JUnit4Provider.java:173)
07-Dec-2018 07:19:42         at org.apache.maven.surefire.junit4.JUnit4Provider.executeTestSet(JUnit4Provider.java:153)
07-Dec-2018 07:19:42         at org.apache.maven.surefire.junit4.JUnit4Provider.invoke(JUnit4Provider.java:128)
07-Dec-2018 07:19:42         at org.apache.maven.surefire.booter.ForkedBooter.invokeProviderInSameClassLoader(ForkedBooter.java:203)
07-Dec-2018 07:19:42         at org.apache.maven.surefire.booter.ForkedBooter.runSuitesInProcess(ForkedBooter.java:155)
07-Dec-2018 07:19:42         at org.apache.maven.surefire.booter.ForkedBooter.main(ForkedBooter.java:103)
07-Dec-2018 07:19:42
07-Dec-2018 07:19:42 testPatternWithDeleteAction(co.cask.cdap.app.etl.batch.XMLReaderTest)  Time elapsed: 608.226 sec  <<< ERROR!
07-Dec-2018 07:19:42 java.lang.RuntimeException: java.util.concurrent.TimeoutException: CDAP Services are not available. Retried for 600 seconds.
07-Dec-2018 07:19:42         at com.google.common.base.Throwables.propagate(Throwables.java:240)
07-Dec-2018 07:19:42         at co.cask.cdap.test.IntegrationTestBase.checkSystemServices(IntegrationTestBase.java:204)
07-Dec-2018 07:19:42         at co.cask.cdap.test.IntegrationTestBase.setUp(IntegrationTestBase.java:99)
07-Dec-2018 07:19:42         at sun.reflect.GeneratedMethodAccessor1.invoke(Unknown Source)
07-Dec-2018 07:19:42         at sun.reflect.DelegatingMethodAccessorImpl.invoke(DelegatingMethodAccessorImpl.java:43)
07-Dec-2018 07:19:42         at java.lang.reflect.Method.invoke(Method.java:498)
07-Dec-2018 07:19:42         at org.junit.runners.model.FrameworkMethod$1.runReflectiveCall(FrameworkMethod.java:50)
07-Dec-2018 07:19:42         at org.junit.internal.runners.model.ReflectiveCallable.run(ReflectiveCallable.java:12)
07-Dec-2018 07:19:42         at org.junit.runners.model.FrameworkMethod.invokeExplosively(FrameworkMethod.java:47)
07-Dec-2018 07:19:42         at org.junit.internal.runners.statements.RunBefores.evaluate(RunBefores.java:24)
07-Dec-2018 07:19:42         at org.junit.internal.runners.statements.RunAfters.evaluate(RunAfters.java:27)
07-Dec-2018 07:19:42         at org.junit.runners.ParentRunner.runLeaf(ParentRunner.java:325)
07-Dec-2018 07:19:42         at org.junit.runners.BlockJUnit4ClassRunner.runChild(BlockJUnit4ClassRunner.java:78)
07-Dec-2018 07:19:42         at org.junit.runners.BlockJUnit4ClassRunner.runChild(BlockJUnit4ClassRunner.java:57)
07-Dec-2018 07:19:42         at org.junit.runners.ParentRunner$3.run(ParentRunner.java:290)
07-Dec-2018 07:19:42         at org.junit.runners.ParentRunner$1.schedule(ParentRunner.java:71)
07-Dec-2018 07:19:42         at org.junit.runners.ParentRunner.runChildren(ParentRunner.java:288)
07-Dec-2018 07:19:42         at org.junit.runners.ParentRunner.access$000(ParentRunner.java:58)
07-Dec-2018 07:19:42         at org.junit.runners.ParentRunner$2.evaluate(ParentRunner.java:268)
07-Dec-2018 07:19:42         at org.junit.rules.ExternalResource$1.evaluate(ExternalResource.java:48)
07-Dec-2018 07:19:42         at org.junit.rules.RunRules.evaluate(RunRules.java:20)
07-Dec-2018 07:19:42         at org.junit.runners.ParentRunner.run(ParentRunner.java:363)
07-Dec-2018 07:19:42         at org.junit.runners.Suite.runChild(Suite.java:128)
07-Dec-2018 07:19:42         at org.junit.runners.Suite.runChild(Suite.java:27)
07-Dec-2018 07:19:42         at org.junit.runners.ParentRunner$3.run(ParentRunner.java:290)
07-Dec-2018 07:19:42         at org.junit.runners.ParentRunner$1.schedule(ParentRunner.java:71)
07-Dec-2018 07:19:42         at org.junit.runners.ParentRunner.runChildren(ParentRunner.java:288)
07-Dec-2018 07:19:42         at org.junit.runners.ParentRunner.access$000(ParentRunner.java:58)
07-Dec-2018 07:19:42         at org.junit.runners.ParentRunner$2.evaluate(ParentRunner.java:268)
07-Dec-2018 07:19:42         at org.junit.runners.ParentRunner.run(ParentRunner.java:363)
07-Dec-2018 07:19:42         at org.apache.maven.surefire.junit4.JUnit4Provider.execute(JUnit4Provider.java:283)
07-Dec-2018 07:19:42         at org.apache.maven.surefire.junit4.JUnit4Provider.executeWithRerun(JUnit4Provider.java:173)
07-Dec-2018 07:19:42         at org.apache.maven.surefire.junit4.JUnit4Provider.executeTestSet(JUnit4Provider.java:153)
07-Dec-2018 07:19:42         at org.apache.maven.surefire.junit4.JUnit4Provider.invoke(JUnit4Provider.java:128)
07-Dec-2018 07:19:42         at org.apache.maven.surefire.booter.ForkedBooter.invokeProviderInSameClassLoader(ForkedBooter.java:203)
07-Dec-2018 07:19:42         at org.apache.maven.surefire.booter.ForkedBooter.runSuitesInProcess(ForkedBooter.java:155)
07-Dec-2018 07:19:42         at org.apache.maven.surefire.booter.ForkedBooter.main(ForkedBooter.java:103)
07-Dec-2018 07:19:42 Caused by: java.util.concurrent.TimeoutException: CDAP Services are not available. Retried for 600 seconds.
07-Dec-2018 07:19:42         at co.cask.cdap.test.IntegrationTestBase.checkServicesWithRetry(IntegrationTestBase.java:267)
07-Dec-2018 07:19:42         at co.cask.cdap.test.IntegrationTestBase.checkSystemServices(IntegrationTestBase.java:192)
07-Dec-2018 07:19:42         at co.cask.cdap.test.IntegrationTestBase.setUp(IntegrationTestBase.java:99)
07-Dec-2018 07:19:42         at sun.reflect.GeneratedMethodAccessor1.invoke(Unknown Source)
07-Dec-2018 07:19:42         at sun.reflect.DelegatingMethodAccessorImpl.invoke(DelegatingMethodAccessorImpl.java:43)
07-Dec-2018 07:19:42         at java.lang.reflect.Method.invoke(Method.java:498)
07-Dec-2018 07:19:42         at org.junit.runners.model.FrameworkMethod$1.runReflectiveCall(FrameworkMethod.java:50)
07-Dec-2018 07:19:42         at org.junit.internal.runners.model.ReflectiveCallable.run(ReflectiveCallable.java:12)
07-Dec-2018 07:19:42         at org.junit.runners.model.FrameworkMethod.invokeExplosively(FrameworkMethod.java:47)
07-Dec-2018 07:19:42         at org.junit.internal.runners.statements.RunBefores.evaluate(RunBefores.java:24)
07-Dec-2018 07:19:42         at org.junit.internal.runners.statements.RunAfters.evaluate(RunAfters.java:27)
07-Dec-2018 07:19:42         at org.junit.runners.ParentRunner.runLeaf(ParentRunner.java:325)
07-Dec-2018 07:19:42         at org.junit.runners.BlockJUnit4ClassRunner.runChild(BlockJUnit4ClassRunner.java:78)
07-Dec-2018 07:19:42         at org.junit.runners.BlockJUnit4ClassRunner.runChild(BlockJUnit4ClassRunner.java:57)
07-Dec-2018 07:19:42         at org.junit.runners.ParentRunner$3.run(ParentRunner.java:290)
07-Dec-2018 07:19:42         at org.junit.runners.ParentRunner$1.schedule(ParentRunner.java:71)
07-Dec-2018 07:19:42         at org.junit.runners.ParentRunner.runChildren(ParentRunner.java:288)
07-Dec-2018 07:19:42         at org.junit.runners.ParentRunner.access$000(ParentRunner.java:58)
07-Dec-2018 07:19:42         at org.junit.runners.ParentRunner$2.evaluate(ParentRunner.java:268)
07-Dec-2018 07:19:42         at org.junit.rules.ExternalResource$1.evaluate(ExternalResource.java:48)
07-Dec-2018 07:19:42         at org.junit.rules.RunRules.evaluate(RunRules.java:20)
07-Dec-2018 07:19:42         at org.junit.runners.ParentRunner.run(ParentRunner.java:363)
07-Dec-2018 07:19:42         at org.junit.runners.Suite.runChild(Suite.java:128)
07-Dec-2018 07:19:42         at org.junit.runners.Suite.runChild(Suite.java:27)
07-Dec-2018 07:19:42         at org.junit.runners.ParentRunner$3.run(ParentRunner.java:290)
07-Dec-2018 07:19:42         at org.junit.runners.ParentRunner$1.schedule(ParentRunner.java:71)
07-Dec-2018 07:19:42         at org.junit.runners.ParentRunner.runChildren(ParentRunner.java:288)
07-Dec-2018 07:19:42         at org.junit.runners.ParentRunner.access$000(ParentRunner.java:58)
07-Dec-2018 07:19:42         at org.junit.runners.ParentRunner$2.evaluate(ParentRunner.java:268)
07-Dec-2018 07:19:42         at org.junit.runners.ParentRunner.run(ParentRunner.java:363)
07-Dec-2018 07:19:42         at org.apache.maven.surefire.junit4.JUnit4Provider.execute(JUnit4Provider.java:283)
07-Dec-2018 07:19:42         at org.apache.maven.surefire.junit4.JUnit4Provider.executeWithRerun(JUnit4Provider.java:173)
07-Dec-2018 07:19:42         at org.apache.maven.surefire.junit4.JUnit4Provider.executeTestSet(JUnit4Provider.java:153)
07-Dec-2018 07:19:42         at org.apache.maven.surefire.junit4.JUnit4Provider.invoke(JUnit4Provider.java:128)
07-Dec-2018 07:19:42         at org.apache.maven.surefire.booter.ForkedBooter.invokeProviderInSameClassLoader(ForkedBooter.java:203)
07-Dec-2018 07:19:42         at org.apache.maven.surefire.booter.ForkedBooter.runSuitesInProcess(ForkedBooter.java:155)
07-Dec-2018 07:19:42         at org.apache.maven.surefire.booter.ForkedBooter.main(ForkedBooter.java:103)
07-Dec-2018 07:19:42
07-Dec-2018 07:19:42 testPreProcessingRequired(co.cask.cdap.app.etl.batch.XMLReaderTest)  Time elapsed: 632.692 sec  <<< ERROR!
07-Dec-2018 07:19:42 java.lang.RuntimeException: java.util.concurrent.TimeoutException: CDAP Services are not available. Retried for 600 seconds.
07-Dec-2018 07:19:42         at com.google.common.base.Throwables.propagate(Throwables.java:240)
07-Dec-2018 07:19:42         at co.cask.cdap.test.IntegrationTestBase.checkSystemServices(IntegrationTestBase.java:204)
07-Dec-2018 07:19:42         at co.cask.cdap.test.IntegrationTestBase.setUp(IntegrationTestBase.java:99)
07-Dec-2018 07:19:42         at sun.reflect.GeneratedMethodAccessor1.invoke(Unknown Source)
07-Dec-2018 07:19:42         at sun.reflect.DelegatingMethodAccessorImpl.invoke(DelegatingMethodAccessorImpl.java:43)
07-Dec-2018 07:19:42         at java.lang.reflect.Method.invoke(Method.java:498)
07-Dec-2018 07:19:42         at org.junit.runners.model.FrameworkMethod$1.runReflectiveCall(FrameworkMethod.java:50)
07-Dec-2018 07:19:42         at org.junit.internal.runners.model.ReflectiveCallable.run(ReflectiveCallable.java:12)
07-Dec-2018 07:19:42         at org.junit.runners.model.FrameworkMethod.invokeExplosively(FrameworkMethod.java:47)
07-Dec-2018 07:19:42         at org.junit.internal.runners.statements.RunBefores.evaluate(RunBefores.java:24)
07-Dec-2018 07:19:42         at org.junit.internal.runners.statements.RunAfters.evaluate(RunAfters.java:27)
07-Dec-2018 07:19:42         at org.junit.runners.ParentRunner.runLeaf(ParentRunner.java:325)
07-Dec-2018 07:19:42         at org.junit.runners.BlockJUnit4ClassRunner.runChild(BlockJUnit4ClassRunner.java:78)
07-Dec-2018 07:19:42         at org.junit.runners.BlockJUnit4ClassRunner.runChild(BlockJUnit4ClassRunner.java:57)
07-Dec-2018 07:19:42         at org.junit.runners.ParentRunner$3.run(ParentRunner.java:290)
07-Dec-2018 07:19:42         at org.junit.runners.ParentRunner$1.schedule(ParentRunner.java:71)
07-Dec-2018 07:19:42         at org.junit.runners.ParentRunner.runChildren(ParentRunner.java:288)
07-Dec-2018 07:19:42         at org.junit.runners.ParentRunner.access$000(ParentRunner.java:58)
07-Dec-2018 07:19:42         at org.junit.runners.ParentRunner$2.evaluate(ParentRunner.java:268)
07-Dec-2018 07:19:42         at org.junit.rules.ExternalResource$1.evaluate(ExternalResource.java:48)
07-Dec-2018 07:19:42         at org.junit.rules.RunRules.evaluate(RunRules.java:20)
07-Dec-2018 07:19:42         at org.junit.runners.ParentRunner.run(ParentRunner.java:363)
07-Dec-2018 07:19:42         at org.junit.runners.Suite.runChild(Suite.java:128)
07-Dec-2018 07:19:42         at org.junit.runners.Suite.runChild(Suite.java:27)
07-Dec-2018 07:19:42         at org.junit.runners.ParentRunner$3.run(ParentRunner.java:290)
07-Dec-2018 07:19:42         at org.junit.runners.ParentRunner$1.schedule(ParentRunner.java:71)
07-Dec-2018 07:19:42         at org.junit.runners.ParentRunner.runChildren(ParentRunner.java:288)
07-Dec-2018 07:19:42         at org.junit.runners.ParentRunner.access$000(ParentRunner.java:58)
07-Dec-2018 07:19:42         at org.junit.runners.ParentRunner$2.evaluate(ParentRunner.java:268)
07-Dec-2018 07:19:42         at org.junit.runners.ParentRunner.run(ParentRunner.java:363)
07-Dec-2018 07:19:42         at org.apache.maven.surefire.junit4.JUnit4Provider.execute(JUnit4Provider.java:283)
07-Dec-2018 07:19:42         at org.apache.maven.surefire.junit4.JUnit4Provider.executeWithRerun(JUnit4Provider.java:173)
07-Dec-2018 07:19:42         at org.apache.maven.surefire.junit4.JUnit4Provider.executeTestSet(JUnit4Provider.java:153)
07-Dec-2018 07:19:42         at org.apache.maven.surefire.junit4.JUnit4Provider.invoke(JUnit4Provider.java:128)
07-Dec-2018 07:19:42         at org.apache.maven.surefire.booter.ForkedBooter.invokeProviderInSameClassLoader(ForkedBooter.java:203)
07-Dec-2018 07:19:42         at org.apache.maven.surefire.booter.ForkedBooter.runSuitesInProcess(ForkedBooter.java:155)
07-Dec-2018 07:19:42         at org.apache.maven.surefire.booter.ForkedBooter.main(ForkedBooter.java:103)
07-Dec-2018 07:19:42 Caused by: java.util.concurrent.TimeoutException: CDAP Services are not available. Retried for 600 seconds.
07-Dec-2018 07:19:42         at co.cask.cdap.test.IntegrationTestBase.checkServicesWithRetry(IntegrationTestBase.java:267)
07-Dec-2018 07:19:42         at co.cask.cdap.test.IntegrationTestBase.checkSystemServices(IntegrationTestBase.java:192)
07-Dec-2018 07:19:42         at co.cask.cdap.test.IntegrationTestBase.setUp(IntegrationTestBase.java:99)
07-Dec-2018 07:19:42         at sun.reflect.GeneratedMethodAccessor1.invoke(Unknown Source)
07-Dec-2018 07:19:42         at sun.reflect.DelegatingMethodAccessorImpl.invoke(DelegatingMethodAccessorImpl.java:43)
07-Dec-2018 07:19:42         at java.lang.reflect.Method.invoke(Method.java:498)
07-Dec-2018 07:19:42         at org.junit.runners.model.FrameworkMethod$1.runReflectiveCall(FrameworkMethod.java:50)
07-Dec-2018 07:19:42         at org.junit.internal.runners.model.ReflectiveCallable.run(ReflectiveCallable.java:12)
07-Dec-2018 07:19:42         at org.junit.runners.model.FrameworkMethod.invokeExplosively(FrameworkMethod.java:47)
07-Dec-2018 07:19:42         at org.junit.internal.runners.statements.RunBefores.evaluate(RunBefores.java:24)
07-Dec-2018 07:19:42         at org.junit.internal.runners.statements.RunAfters.evaluate(RunAfters.java:27)
07-Dec-2018 07:19:42         at org.junit.runners.ParentRunner.runLeaf(ParentRunner.java:325)
07-Dec-2018 07:19:42         at org.junit.runners.BlockJUnit4ClassRunner.runChild(BlockJUnit4ClassRunner.java:78)
07-Dec-2018 07:19:42         at org.junit.runners.BlockJUnit4ClassRunner.runChild(BlockJUnit4ClassRunner.java:57)
07-Dec-2018 07:19:42         at org.junit.runners.ParentRunner$3.run(ParentRunner.java:290)
07-Dec-2018 07:19:42         at org.junit.runners.ParentRunner$1.schedule(ParentRunner.java:71)
07-Dec-2018 07:19:42         at org.junit.runners.ParentRunner.runChildren(ParentRunner.java:288)
07-Dec-2018 07:19:42         at org.junit.runners.ParentRunner.access$000(ParentRunner.java:58)
07-Dec-2018 07:19:42         at org.junit.runners.ParentRunner$2.evaluate(ParentRunner.java:268)
07-Dec-2018 07:19:42         at org.junit.rules.ExternalResource$1.evaluate(ExternalResource.java:48)
07-Dec-2018 07:19:42         at org.junit.rules.RunRules.evaluate(RunRules.java:20)
07-Dec-2018 07:19:42         at org.junit.runners.ParentRunner.run(ParentRunner.java:363)
07-Dec-2018 07:19:42         at org.junit.runners.Suite.runChild(Suite.java:128)
07-Dec-2018 07:19:42         at org.junit.runners.Suite.runChild(Suite.java:27)
07-Dec-2018 07:19:42         at org.junit.runners.ParentRunner$3.run(ParentRunner.java:290)
07-Dec-2018 07:19:42         at org.junit.runners.ParentRunner$1.schedule(ParentRunner.java:71)
07-Dec-2018 07:19:42         at org.junit.runners.ParentRunner.runChildren(ParentRunner.java:288)
07-Dec-2018 07:19:42         at org.junit.runners.ParentRunner.access$000(ParentRunner.java:58)
07-Dec-2018 07:19:42         at org.junit.runners.ParentRunner$2.evaluate(ParentRunner.java:268)
07-Dec-2018 07:19:42         at org.junit.runners.ParentRunner.run(ParentRunner.java:363)
07-Dec-2018 07:19:42         at org.apache.maven.surefire.junit4.JUnit4Provider.execute(JUnit4Provider.java:283)
07-Dec-2018 07:19:42         at org.apache.maven.surefire.junit4.JUnit4Provider.executeWithRerun(JUnit4Provider.java:173)
07-Dec-2018 07:19:42         at org.apache.maven.surefire.junit4.JUnit4Provider.executeTestSet(JUnit4Provider.java:153)
07-Dec-2018 07:19:42         at org.apache.maven.surefire.junit4.JUnit4Provider.invoke(JUnit4Provider.java:128)
07-Dec-2018 07:19:42         at org.apache.maven.surefire.booter.ForkedBooter.invokeProviderInSameClassLoader(ForkedBooter.java:203)
07-Dec-2018 07:19:42         at org.apache.maven.surefire.booter.ForkedBooter.runSuitesInProcess(ForkedBooter.java:155)
07-Dec-2018 07:19:42         at org.apache.maven.surefire.booter.ForkedBooter.main(ForkedBooter.java:103)
07-Dec-2018 07:19:42
07-Dec-2018 07:19:42 testInvalidNodePathWithMoveAction(co.cask.cdap.app.etl.batch.XMLReaderTest)  Time elapsed: 640.012 sec  <<< ERROR!
07-Dec-2018 07:19:42 java.lang.RuntimeException: java.util.concurrent.TimeoutException: CDAP Services are not available. Retried for 600 seconds.
07-Dec-2018 07:19:42         at com.google.common.base.Throwables.propagate(Throwables.java:240)
07-Dec-2018 07:19:42         at co.cask.cdap.test.IntegrationTestBase.checkSystemServices(IntegrationTestBase.java:204)
07-Dec-2018 07:19:42         at co.cask.cdap.test.IntegrationTestBase.setUp(IntegrationTestBase.java:99)
07-Dec-2018 07:19:42         at sun.reflect.GeneratedMethodAccessor1.invoke(Unknown Source)
07-Dec-2018 07:19:42         at sun.reflect.DelegatingMethodAccessorImpl.invoke(DelegatingMethodAccessorImpl.java:43)
07-Dec-2018 07:19:42         at java.lang.reflect.Method.invoke(Method.java:498)
07-Dec-2018 07:19:42         at org.junit.runners.model.FrameworkMethod$1.runReflectiveCall(FrameworkMethod.java:50)
07-Dec-2018 07:19:42         at org.junit.internal.runners.model.ReflectiveCallable.run(ReflectiveCallable.java:12)
07-Dec-2018 07:19:42         at org.junit.runners.model.FrameworkMethod.invokeExplosively(FrameworkMethod.java:47)
07-Dec-2018 07:19:42         at org.junit.internal.runners.statements.RunBefores.evaluate(RunBefores.java:24)
07-Dec-2018 07:19:42         at org.junit.internal.runners.statements.RunAfters.evaluate(RunAfters.java:27)
07-Dec-2018 07:19:42         at org.junit.runners.ParentRunner.runLeaf(ParentRunner.java:325)
07-Dec-2018 07:19:42         at org.junit.runners.BlockJUnit4ClassRunner.runChild(BlockJUnit4ClassRunner.java:78)
07-Dec-2018 07:19:42         at org.junit.runners.BlockJUnit4ClassRunner.runChild(BlockJUnit4ClassRunner.java:57)
07-Dec-2018 07:19:42         at org.junit.runners.ParentRunner$3.run(ParentRunner.java:290)
07-Dec-2018 07:19:42         at org.junit.runners.ParentRunner$1.schedule(ParentRunner.java:71)
07-Dec-2018 07:19:42         at org.junit.runners.ParentRunner.runChildren(ParentRunner.java:288)
07-Dec-2018 07:19:42         at org.junit.runners.ParentRunner.access$000(ParentRunner.java:58)
07-Dec-2018 07:19:42         at org.junit.runners.ParentRunner$2.evaluate(ParentRunner.java:268)
07-Dec-2018 07:19:42         at org.junit.rules.ExternalResource$1.evaluate(ExternalResource.java:48)
07-Dec-2018 07:19:42         at org.junit.rules.RunRules.evaluate(RunRules.java:20)
07-Dec-2018 07:19:42         at org.junit.runners.ParentRunner.run(ParentRunner.java:363)
07-Dec-2018 07:19:42         at org.junit.runners.Suite.runChild(Suite.java:128)
07-Dec-2018 07:19:42         at org.junit.runners.Suite.runChild(Suite.java:27)
07-Dec-2018 07:19:42         at org.junit.runners.ParentRunner$3.run(ParentRunner.java:290)
07-Dec-2018 07:19:42         at org.junit.runners.ParentRunner$1.schedule(ParentRunner.java:71)
07-Dec-2018 07:19:42         at org.junit.runners.ParentRunner.runChildren(ParentRunner.java:288)
07-Dec-2018 07:19:42         at org.junit.runners.ParentRunner.access$000(ParentRunner.java:58)
07-Dec-2018 07:19:42         at org.junit.runners.ParentRunner$2.evaluate(ParentRunner.java:268)
07-Dec-2018 07:19:42         at org.junit.runners.ParentRunner.run(ParentRunner.java:363)
07-Dec-2018 07:19:42         at org.apache.maven.surefire.junit4.JUnit4Provider.execute(JUnit4Provider.java:283)
07-Dec-2018 07:19:42         at org.apache.maven.surefire.junit4.JUnit4Provider.executeWithRerun(JUnit4Provider.java:173)
07-Dec-2018 07:19:42         at org.apache.maven.surefire.junit4.JUnit4Provider.executeTestSet(JUnit4Provider.java:153)
07-Dec-2018 07:19:42         at org.apache.maven.surefire.junit4.JUnit4Provider.invoke(JUnit4Provider.java:128)
07-Dec-2018 07:19:42         at org.apache.maven.surefire.booter.ForkedBooter.invokeProviderInSameClassLoader(ForkedBooter.java:203)
07-Dec-2018 07:19:42         at org.apache.maven.surefire.booter.ForkedBooter.runSuitesInProcess(ForkedBooter.java:155)
07-Dec-2018 07:19:42         at org.apache.maven.surefire.booter.ForkedBooter.main(ForkedBooter.java:103)
07-Dec-2018 07:19:42 Caused by: java.util.concurrent.TimeoutException: CDAP Services are not available. Retried for 600 seconds.
07-Dec-2018 07:19:42         at co.cask.cdap.test.IntegrationTestBase.checkServicesWithRetry(IntegrationTestBase.java:267)
07-Dec-2018 07:19:42         at co.cask.cdap.test.IntegrationTestBase.checkSystemServices(IntegrationTestBase.java:192)
07-Dec-2018 07:19:42         at co.cask.cdap.test.IntegrationTestBase.setUp(IntegrationTestBase.java:99)
07-Dec-2018 07:19:42         at sun.reflect.GeneratedMethodAccessor1.invoke(Unknown Source)
07-Dec-2018 07:19:42         at sun.reflect.DelegatingMethodAccessorImpl.invoke(DelegatingMethodAccessorImpl.java:43)
07-Dec-2018 07:19:42         at java.lang.reflect.Method.invoke(Method.java:498)
07-Dec-2018 07:19:42         at org.junit.runners.model.FrameworkMethod$1.runReflectiveCall(FrameworkMethod.java:50)
07-Dec-2018 07:19:42         at org.junit.internal.runners.model.ReflectiveCallable.run(ReflectiveCallable.java:12)
07-Dec-2018 07:19:42         at org.junit.runners.model.FrameworkMethod.invokeExplosively(FrameworkMethod.java:47)
07-Dec-2018 07:19:42         at org.junit.internal.runners.statements.RunBefores.evaluate(RunBefores.java:24)
07-Dec-2018 07:19:42         at org.junit.internal.runners.statements.RunAfters.evaluate(RunAfters.java:27)
07-Dec-2018 07:19:42         at org.junit.runners.ParentRunner.runLeaf(ParentRunner.java:325)
07-Dec-2018 07:19:42         at org.junit.runners.BlockJUnit4ClassRunner.runChild(BlockJUnit4ClassRunner.java:78)
07-Dec-2018 07:19:42         at org.junit.runners.BlockJUnit4ClassRunner.runChild(BlockJUnit4ClassRunner.java:57)
07-Dec-2018 07:19:42         at org.junit.runners.ParentRunner$3.run(ParentRunner.java:290)
07-Dec-2018 07:19:42         at org.junit.runners.ParentRunner$1.schedule(ParentRunner.java:71)
07-Dec-2018 07:19:42         at org.junit.runners.ParentRunner.runChildren(ParentRunner.java:288)
07-Dec-2018 07:19:42         at org.junit.runners.ParentRunner.access$000(ParentRunner.java:58)
07-Dec-2018 07:19:42         at org.junit.runners.ParentRunner$2.evaluate(ParentRunner.java:268)
07-Dec-2018 07:19:42         at org.junit.rules.ExternalResource$1.evaluate(ExternalResource.java:48)
07-Dec-2018 07:19:42         at org.junit.rules.RunRules.evaluate(RunRules.java:20)
07-Dec-2018 07:19:42         at org.junit.runners.ParentRunner.run(ParentRunner.java:363)
07-Dec-2018 07:19:42         at org.junit.runners.Suite.runChild(Suite.java:128)
07-Dec-2018 07:19:42         at org.junit.runners.Suite.runChild(Suite.java:27)
07-Dec-2018 07:19:42         at org.junit.runners.ParentRunner$3.run(ParentRunner.java:290)
07-Dec-2018 07:19:42         at org.junit.runners.ParentRunner$1.schedule(ParentRunner.java:71)
07-Dec-2018 07:19:42         at org.junit.runners.ParentRunner.runChildren(ParentRunner.java:288)
07-Dec-2018 07:19:42         at org.junit.runners.ParentRunner.access$000(ParentRunner.java:58)
07-Dec-2018 07:19:42         at org.junit.runners.ParentRunner$2.evaluate(ParentRunner.java:268)
07-Dec-2018 07:19:42         at org.junit.runners.ParentRunner.run(ParentRunner.java:363)
07-Dec-2018 07:19:42         at org.apache.maven.surefire.junit4.JUnit4Provider.execute(JUnit4Provider.java:283)
07-Dec-2018 07:19:42         at org.apache.maven.surefire.junit4.JUnit4Provider.executeWithRerun(JUnit4Provider.java:173)
07-Dec-2018 07:19:42         at org.apache.maven.surefire.junit4.JUnit4Provider.executeTestSet(JUnit4Provider.java:153)
07-Dec-2018 07:19:42         at org.apache.maven.surefire.junit4.JUnit4Provider.invoke(JUnit4Provider.java:128)
07-Dec-2018 07:19:42         at org.apache.maven.surefire.booter.ForkedBooter.invokeProviderInSameClassLoader(ForkedBooter.java:203)
07-Dec-2018 07:19:42         at org.apache.maven.surefire.booter.ForkedBooter.runSuitesInProcess(ForkedBooter.java:155)
07-Dec-2018 07:19:42         at org.apache.maven.surefire.booter.ForkedBooter.main(ForkedBooter.java:103)
07-Dec-2018 07:19:42
07-Dec-2018 07:19:42
07-Dec-2018 07:19:42 Results :
07-Dec-2018 07:19:42
07-Dec-2018 07:19:42 Tests in error:
07-Dec-2018 07:19:42   KVTableWithProjectionTest>IntegrationTestBase.setUp:99->IntegrationTestBase.checkSystemServices:204 » Runtime
07-Dec-2018 07:19:42   StreamTPFSWithProjectionTest>IntegrationTestBase.setUp:99->IntegrationTestBase.checkSystemServices:204 » Runtime
07-Dec-2018 07:19:42   BatchAggregatorTest>IntegrationTestBase.setUp:99->IntegrationTestBase.checkSystemServices:204 » Runtime
07-Dec-2018 07:19:42   BatchCubeSinkTest>IntegrationTestBase.setUp:99->IntegrationTestBase.checkSystemServices:204 » Runtime
07-Dec-2018 07:19:42   BatchJoinerTest>IntegrationTestBase.setUp:99->IntegrationTestBase.checkSystemServices:204 » Runtime
07-Dec-2018 07:19:42   BatchJoinerTest>IntegrationTestBase.setUp:99->IntegrationTestBase.checkSystemServices:204 » Runtime
07-Dec-2018 07:19:42   ETLMapReduceTest>IntegrationTestBase.setUp:99->IntegrationTestBase.checkSystemServices:204 » Runtime
07-Dec-2018 07:19:42   ETLMapReduceTest>IntegrationTestBase.setUp:99->IntegrationTestBase.checkSystemServices:204 » Runtime
07-Dec-2018 07:19:42   ETLMapReduceTest>IntegrationTestBase.setUp:99->IntegrationTestBase.checkSystemServices:204 » Runtime
07-Dec-2018 07:19:42   ETLMapReduceTest>IntegrationTestBase.setUp:99->IntegrationTestBase.checkSystemServices:204 » Runtime
07-Dec-2018 07:19:42   ETLMapReduceTest>IntegrationTestBase.setUp:99->IntegrationTestBase.checkSystemServices:204 » Runtime
07-Dec-2018 07:19:42   ExcelInputReaderTest>IntegrationTestBase.setUp:99->IntegrationTestBase.checkSystemServices:204 » Runtime
07-Dec-2018 07:19:42   ExcelInputReaderTest>IntegrationTestBase.setUp:99->IntegrationTestBase.checkSystemServices:204 » Runtime
07-Dec-2018 07:19:42   HivePluginTest>IntegrationTestBase.setUp:99->IntegrationTestBase.checkSystemServices:204 » Runtime
07-Dec-2018 07:19:42   NormalizeTest>IntegrationTestBase.setUp:99->IntegrationTestBase.checkSystemServices:204 » Runtime
07-Dec-2018 07:19:42   NormalizeTest>IntegrationTestBase.setUp:99->IntegrationTestBase.checkSystemServices:204 » Runtime
07-Dec-2018 07:19:42   RowDenormalizerTest>IntegrationTestBase.setUp:99->IntegrationTestBase.checkSystemServices:204 » Runtime
07-Dec-2018 07:19:42   TPFSSinkSourceTest>IntegrationTestBase.setUp:99->IntegrationTestBase.checkSystemServices:204 » Runtime
07-Dec-2018 07:19:42   TPFSSinkSourceTest>IntegrationTestBase.setUp:99->IntegrationTestBase.checkSystemServices:204 » Runtime
07-Dec-2018 07:19:42   ValueMapperTest>IntegrationTestBase.setUp:99->IntegrationTestBase.checkSystemServices:204 » Runtime
07-Dec-2018 07:19:42   XMLReaderTest>IntegrationTestBase.setUp:99->IntegrationTestBase.checkSystemServices:204 » Runtime
07-Dec-2018 07:19:42   XMLReaderTest>IntegrationTestBase.setUp:99->IntegrationTestBase.checkSystemServices:204 » Runtime
07-Dec-2018 07:19:42   XMLReaderTest>IntegrationTestBase.setUp:99->IntegrationTestBase.checkSystemServices:204 » Runtime
07-Dec-2018 07:19:42   XMLReaderTest>IntegrationTestBase.setUp:99->IntegrationTestBase.checkSystemServices:204 » Runtime
07-Dec-2018 07:19:42   XMLReaderTest>IntegrationTestBase.setUp:99->IntegrationTestBase.checkSystemServices:204 » Runtime
07-Dec-2018 07:19:42   DataStreamsTest>IntegrationTestBase.setUp:99->IntegrationTestBase.checkSystemServices:204 » Runtime
07-Dec-2018 07:19:42   WranglerServiceTest>IntegrationTestBase.setUp:99->IntegrationTestBase.checkSystemServices:204 » Runtime
07-Dec-2018 07:19:42   WranglerTest>IntegrationTestBase.setUp:99->IntegrationTestBase.checkSystemServices:204 » Runtime
07-Dec-2018 07:19:42   WranglerTest>IntegrationTestBase.setUp:99->IntegrationTestBase.checkSystemServices:204 » Runtime
07-Dec-2018 07:19:42   PermissionTest>IntegrationTestBase.setUp:99->IntegrationTestBase.checkSystemServices:204 » Runtime
07-Dec-2018 07:19:42   ReadlessIncrementTest>IntegrationTestBase.setUp:99->IntegrationTestBase.checkSystemServices:204 » Runtime
07-Dec-2018 07:19:42   HangingWorkerTest>IntegrationTestBase.setUp:99->IntegrationTestBase.checkSystemServices:204 » Runtime
07-Dec-2018 07:19:42   ServiceWorkerTest>IntegrationTestBase.setUp:99->IntegrationTestBase.checkSystemServices:204 » Runtime
07-Dec-2018 07:19:42   ApplicationTest>IntegrationTestBase.setUp:99->IntegrationTestBase.checkSystemServices:204 » Runtime
07-Dec-2018 07:19:42   ApplicationVersionTest>IntegrationTestBase.setUp:99->IntegrationTestBase.checkSystemServices:204 » Runtime
07-Dec-2018 07:19:42   DatasetTest>IntegrationTestBase.setUp:99->IntegrationTestBase.checkSystemServices:204 » Runtime
07-Dec-2018 07:19:42   NamespaceTest>IntegrationTestBase.setUp:99->IntegrationTestBase.checkSystemServices:204 » Runtime
07-Dec-2018 07:19:42   NamespacedStreamTest>IntegrationTestBase.setUp:99->IntegrationTestBase.checkSystemServices:204 » Runtime
07-Dec-2018 07:19:42   StreamTest>IntegrationTestBase.setUp:99->IntegrationTestBase.checkSystemServices:204 » Runtime
07-Dec-2018 07:19:42   StreamTest>IntegrationTestBase.setUp:99->IntegrationTestBase.checkSystemServices:204 » Runtime
07-Dec-2018 07:19:42   ExploreTest>IntegrationTestBase.setUp:99->IntegrationTestBase.checkSystemServices:204 » Runtime
07-Dec-2018 07:19:42   ExploreTest>IntegrationTestBase.setUp:99->IntegrationTestBase.checkSystemServices:204 » Runtime
07-Dec-2018 07:19:42   FileSetTest>IntegrationTestBase.setUp:99->IntegrationTestBase.checkSystemServices:204 » Runtime
07-Dec-2018 07:19:42   PartitionCorrectorTest>IntegrationTestBase.setUp:99->IntegrationTestBase.checkSystemServices:204 » Runtime
07-Dec-2018 07:19:42   PartitionedFileSetUpdateTest>IntegrationTestBase.setUp:99->IntegrationTestBase.checkSystemServices:204 » Runtime
07-Dec-2018 07:19:42   ProgramMetadataTest>IntegrationTestBase.setUp:99->IntegrationTestBase.checkSystemServices:204 » Runtime
07-Dec-2018 07:19:42   PurchaseMetadataTest>IntegrationTestBase.setUp:99->IntegrationTestBase.checkSystemServices:204 » Runtime
07-Dec-2018 07:19:42   PurchaseMetadataTest>IntegrationTestBase.setUp:99->IntegrationTestBase.checkSystemServices:204 » Runtime
07-Dec-2018 07:19:42   PurchaseAudiTest>IntegrationTestBase.setUp:99->IntegrationTestBase.checkSystemServices:204 » Runtime
07-Dec-2018 07:19:42   TransactionTimeoutTest>IntegrationTestBase.setUp:99->IntegrationTestBase.checkSystemServices:204 » Runtime
07-Dec-2018 07:19:42   WordCountTest>IntegrationTestBase.setUp:99->IntegrationTestBase.checkSystemServices:204 » Runtime
07-Dec-2018 07:19:42   OperationalStatsTest>IntegrationTestBase.setUp:99->IntegrationTestBase.checkSystemServices:204 » Runtime
07-Dec-2018 07:19:42   RemoteCubeTest>IntegrationTestBase.setUp:99->IntegrationTestBase.checkSystemServices:204 » Runtime
07-Dec-2018 07:19:42   RemoteKeyValueTest>IntegrationTestBase.setUp:99->IntegrationTestBase.checkSystemServices:204 » Runtime
07-Dec-2018 07:19:42   RemoteTableTest>IntegrationTestBase.setUp:99->IntegrationTestBase.checkSystemServices:204 » Runtime
07-Dec-2018 07:19:42
07-Dec-2018 07:19:42 Tests run: 55, Failures: 0, Errors: 55, Skipped: 0
07-Dec-2018 07:19:42
07-Dec-2018 07:19:43 [INFO] ------------------------------------------------------------------------
07-Dec-2018 07:19:43 [INFO] Reactor Summary:
07-Dec-2018 07:19:43 [INFO]
07-Dec-2018 07:19:43 [INFO] integration-test .................................. SUCCESS [52.311s]
07-Dec-2018 07:19:43 [INFO] integration-test-core ............................. SUCCESS [5.298s]
07-Dec-2018 07:19:43 [INFO] integration-test-remote ........................... FAILURE [9:19:37.797s]
07-Dec-2018 07:19:43 [INFO] integration-test-standalone ....................... SKIPPED
07-Dec-2018 07:19:43 [INFO] upgrade-test ...................................... SKIPPED
07-Dec-2018 07:19:43 [INFO] long-running-test ................................. SKIPPED
07-Dec-2018 07:19:43 [INFO] ------------------------------------------------------------------------
07-Dec-2018 07:19:43 [INFO] BUILD FAILURE
07-Dec-2018 07:19:43 [INFO] ------------------------------------------------------------------------
07-Dec-2018 07:19:43 [INFO] Total time: 9:20:35.850s
07-Dec-2018 07:19:43 [INFO] Finished at: Fri Dec 07 07:19:43 UTC 2018
07-Dec-2018 07:19:43 [INFO] Final Memory: 103M/698M
07-Dec-2018 07:19:43 [INFO] ------------------------------------------------------------------------
07-Dec-2018 07:19:43 [ERROR] Failed to execute goal org.apache.maven.plugins:maven-surefire-plugin:2.18.1:test (default-test) on project integration-test-remote: There are test failures.
07-Dec-2018 07:19:43 [ERROR]
07-Dec-2018 07:19:43 [ERROR] Please refer to /var/bamboo/xml-data/build-dir/IT-ITA-AMBH26/cdap-integration-tests/integration-test-remote/target/surefire-reports for the individual test results.
07-Dec-2018 07:19:43 [ERROR] -> [Help 1]
07-Dec-2018 07:19:43 [ERROR]
07-Dec-2018 07:19:43 [ERROR] To see the full stack trace of the errors, re-run Maven with the -e switch.
07-Dec-2018 07:19:43 [ERROR] Re-run Maven using the -X switch to enable full debug logging.
07-Dec-2018 07:19:43 [ERROR]
07-Dec-2018 07:19:43 [ERROR] For more information about the errors and possible solutions, please read the following articles:
07-Dec-2018 07:19:43 [ERROR] [Help 1] http://cwiki.apache.org/confluence/display/MAVEN/MojoFailureException
07-Dec-2018 07:19:43 [ERROR]
07-Dec-2018 07:19:43 [ERROR] After correcting the problems, you can resume the build with the command
07-Dec-2018 07:19:43 [ERROR]   mvn <goals> -rf :integration-test-remote
07-Dec-2018 07:19:43 Failing task since return code of [/opt/maven/bin/mvn --batch-mode -Djava.io.tmpdir=/tmp/IT-ITA-AMBH26 clean test -U -Dtest=AllTests -Dtest.namespace=itnamb -Dcdap.username=******** -Dcdap.password=******** -DinstanceUri=http://10.210.0.19:11015] was 1 while expected 0
07-Dec-2018 07:19:43 Parsing test results under /var/bamboo/xml-data/build-dir/IT-ITA-AMBH26...
07-Dec-2018 07:19:43 Finished task 'Integration test - cluster' with result: Failed
07-Dec-2018 07:19:43 Running post build plugin 'Docker Container Cleanup'
07-Dec-2018 07:19:43 Running post build plugin 'NCover Results Collector'
07-Dec-2018 07:19:43 Running post build plugin 'Clover Results Collector'
07-Dec-2018 07:19:43 Running post build plugin 'npm Cache Cleanup'
07-Dec-2018 07:19:43 Running post build plugin 'Artifact Copier'
07-Dec-2018 07:19:44 Successfully removed working directory at '/var/bamboo/xml-data/build-dir/IT-ITA-AMBH26'
07-Dec-2018 07:19:44 Finalising the build...
07-Dec-2018 07:19:44 Stopping timer.
07-Dec-2018 07:19:44 Build IT-ITA-AMBH26-87 completed.
07-Dec-2018 07:19:44 Running on server: post build plugin 'NCover Results Collector'
07-Dec-2018 07:19:44 Running on server: post build plugin 'Build Hanging Detection Configuration'
07-Dec-2018 07:19:44 Running on server: post build plugin 'Clover Delta Calculator'
07-Dec-2018 07:19:44 Running on server: post build plugin 'Maven Dependencies Postprocessor'
07-Dec-2018 07:19:44 All post build plugins have finished
07-Dec-2018 07:19:44 Generating build results summary...
07-Dec-2018 07:19:44 Saving build results to disk...
07-Dec-2018 07:19:44 Logging substituted variables...
07-Dec-2018 07:19:44 Indexing build results...
07-Dec-2018 07:19:44 Finished building IT-ITA-AMBH26-87.