Build #80

Build: #80 failed

Job: Ambari - HDP 2.6 failed

Stages & jobs

  1. Variables

  2. Spinup and Test

Job result summary

Completed
Duration
660 minutes
Agent
bamboo-agent06
Revisions
caskdata/cdap-integration-tests
863308647e98ec11e3ab45c42a2d370dbb87904e 863308647e98ec11e3ab45c42a2d370dbb87904e
caskdata/coopr-internal
da918409366d3485ecacffa357da69da29bd6b39 da918409366d3485ecacffa357da69da29bd6b39
Total tests
59
Failing since
#64 (Scheduled – )

Tests

  • 59 tests in total
  • 59 tests failed
  • 58 failures are new
  • 591 minutes taken in total.
New test failures 58
Status Test Duration
Collapse Failed KVTableWithProjectionTest testKVTableWithProjection History
10 mins
java.lang.RuntimeException: java.util.concurrent.TimeoutException: CDAP Services are not available. Retried for 600 seconds.
	at com.google.common.base.Throwables.propagate(Throwables.java:240)
	at co.cask.cdap.test.IntegrationTestBase.checkSystemServices(IntegrationTestBase.java:204)
	at co.cask.cdap.test.IntegrationTestBase.setUp(IntegrationTestBase.java:99)
	at sun.reflect.GeneratedMethodAccessor1.invoke(Unknown Source)
	at sun.reflect.DelegatingMethodAccessorImpl.invoke(DelegatingMethodAccessorImpl.java:43)
	at java.lang.reflect.Method.invoke(Method.java:498)
	at org.junit.runners.model.FrameworkMethod$1.runReflectiveCall(FrameworkMethod.java:47)
(68 more lines...)
Collapse Failed StreamTPFSWithProjectionTest testStreamTPFSWithProjection History
10 mins
java.lang.RuntimeException: java.util.concurrent.TimeoutException: CDAP Services are not available. Retried for 600 seconds.
	at com.google.common.base.Throwables.propagate(Throwables.java:240)
	at co.cask.cdap.test.IntegrationTestBase.checkSystemServices(IntegrationTestBase.java:204)
	at co.cask.cdap.test.IntegrationTestBase.setUp(IntegrationTestBase.java:99)
	at sun.reflect.GeneratedMethodAccessor1.invoke(Unknown Source)
	at sun.reflect.DelegatingMethodAccessorImpl.invoke(DelegatingMethodAccessorImpl.java:43)
	at java.lang.reflect.Method.invoke(Method.java:498)
	at org.junit.runners.model.FrameworkMethod$1.runReflectiveCall(FrameworkMethod.java:47)
(68 more lines...)
Collapse Failed BatchAggregatorTest test History
10 mins
java.lang.RuntimeException: java.util.concurrent.TimeoutException: CDAP Services are not available. Retried for 600 seconds.
	at com.google.common.base.Throwables.propagate(Throwables.java:240)
	at co.cask.cdap.test.IntegrationTestBase.checkSystemServices(IntegrationTestBase.java:204)
	at co.cask.cdap.test.IntegrationTestBase.setUp(IntegrationTestBase.java:99)
	at sun.reflect.NativeMethodAccessorImpl.invoke0(Native Method)
	at sun.reflect.NativeMethodAccessorImpl.invoke(NativeMethodAccessorImpl.java:62)
	at sun.reflect.DelegatingMethodAccessorImpl.invoke(DelegatingMethodAccessorImpl.java:43)
	at java.lang.reflect.Method.invoke(Method.java:498)
(70 more lines...)
Collapse Failed BatchCubeSinkTest test History
10 mins
java.lang.RuntimeException: java.util.concurrent.TimeoutException: CDAP Services are not available. Retried for 600 seconds.
	at com.google.common.base.Throwables.propagate(Throwables.java:240)
	at co.cask.cdap.test.IntegrationTestBase.checkSystemServices(IntegrationTestBase.java:204)
	at co.cask.cdap.test.IntegrationTestBase.setUp(IntegrationTestBase.java:99)
	at sun.reflect.NativeMethodAccessorImpl.invoke0(Native Method)
	at sun.reflect.NativeMethodAccessorImpl.invoke(NativeMethodAccessorImpl.java:62)
	at sun.reflect.DelegatingMethodAccessorImpl.invoke(DelegatingMethodAccessorImpl.java:43)
	at java.lang.reflect.Method.invoke(Method.java:498)
(70 more lines...)
Collapse Failed BatchJoinerTest testJoinerMR History
10 mins
java.lang.RuntimeException: java.util.concurrent.TimeoutException: CDAP Services are not available. Retried for 600 seconds.
	at com.google.common.base.Throwables.propagate(Throwables.java:240)
	at co.cask.cdap.test.IntegrationTestBase.checkSystemServices(IntegrationTestBase.java:204)
	at co.cask.cdap.test.IntegrationTestBase.setUp(IntegrationTestBase.java:99)
	at sun.reflect.NativeMethodAccessorImpl.invoke0(Native Method)
	at sun.reflect.NativeMethodAccessorImpl.invoke(NativeMethodAccessorImpl.java:62)
	at sun.reflect.DelegatingMethodAccessorImpl.invoke(DelegatingMethodAccessorImpl.java:43)
	at java.lang.reflect.Method.invoke(Method.java:498)
(70 more lines...)
Collapse Failed BatchJoinerTest testJoinerSpark History
10 mins
java.lang.RuntimeException: java.util.concurrent.TimeoutException: CDAP Services are not available. Retried for 600 seconds.
	at com.google.common.base.Throwables.propagate(Throwables.java:240)
	at co.cask.cdap.test.IntegrationTestBase.checkSystemServices(IntegrationTestBase.java:204)
	at co.cask.cdap.test.IntegrationTestBase.setUp(IntegrationTestBase.java:99)
	at sun.reflect.NativeMethodAccessorImpl.invoke0(Native Method)
	at sun.reflect.NativeMethodAccessorImpl.invoke(NativeMethodAccessorImpl.java:62)
	at sun.reflect.DelegatingMethodAccessorImpl.invoke(DelegatingMethodAccessorImpl.java:43)
	at java.lang.reflect.Method.invoke(Method.java:498)
(70 more lines...)
Collapse Failed ETLMapReduceTest testDAG History
10 mins
java.lang.RuntimeException: java.util.concurrent.TimeoutException: CDAP Services are not available. Retried for 600 seconds.
	at com.google.common.base.Throwables.propagate(Throwables.java:240)
	at co.cask.cdap.test.IntegrationTestBase.checkSystemServices(IntegrationTestBase.java:204)
	at co.cask.cdap.test.IntegrationTestBase.setUp(IntegrationTestBase.java:99)
	at sun.reflect.NativeMethodAccessorImpl.invoke0(Native Method)
	at sun.reflect.NativeMethodAccessorImpl.invoke(NativeMethodAccessorImpl.java:62)
	at sun.reflect.DelegatingMethodAccessorImpl.invoke(DelegatingMethodAccessorImpl.java:43)
	at java.lang.reflect.Method.invoke(Method.java:498)
(70 more lines...)
Collapse Failed ETLMapReduceTest testDAGInvalidSchema History
10 mins
java.lang.RuntimeException: java.util.concurrent.TimeoutException: CDAP Services are not available. Retried for 600 seconds.
	at com.google.common.base.Throwables.propagate(Throwables.java:240)
	at co.cask.cdap.test.IntegrationTestBase.checkSystemServices(IntegrationTestBase.java:204)
	at co.cask.cdap.test.IntegrationTestBase.setUp(IntegrationTestBase.java:99)
	at sun.reflect.NativeMethodAccessorImpl.invoke0(Native Method)
	at sun.reflect.NativeMethodAccessorImpl.invoke(NativeMethodAccessorImpl.java:62)
	at sun.reflect.DelegatingMethodAccessorImpl.invoke(DelegatingMethodAccessorImpl.java:43)
	at java.lang.reflect.Method.invoke(Method.java:498)
(70 more lines...)
Collapse Failed ETLMapReduceTest testDAGSchemaChanges History
10 mins
java.lang.RuntimeException: java.util.concurrent.TimeoutException: CDAP Services are not available. Retried for 600 seconds.
	at com.google.common.base.Throwables.propagate(Throwables.java:240)
	at co.cask.cdap.test.IntegrationTestBase.checkSystemServices(IntegrationTestBase.java:204)
	at co.cask.cdap.test.IntegrationTestBase.setUp(IntegrationTestBase.java:99)
	at sun.reflect.NativeMethodAccessorImpl.invoke0(Native Method)
	at sun.reflect.NativeMethodAccessorImpl.invoke(NativeMethodAccessorImpl.java:62)
	at sun.reflect.DelegatingMethodAccessorImpl.invoke(DelegatingMethodAccessorImpl.java:43)
	at java.lang.reflect.Method.invoke(Method.java:498)
(70 more lines...)
Collapse Failed ETLMapReduceTest testKVToKV History
10 mins
java.lang.RuntimeException: java.util.concurrent.TimeoutException: CDAP Services are not available. Retried for 600 seconds.
	at com.google.common.base.Throwables.propagate(Throwables.java:240)
	at co.cask.cdap.test.IntegrationTestBase.checkSystemServices(IntegrationTestBase.java:204)
	at co.cask.cdap.test.IntegrationTestBase.setUp(IntegrationTestBase.java:99)
	at sun.reflect.NativeMethodAccessorImpl.invoke0(Native Method)
	at sun.reflect.NativeMethodAccessorImpl.invoke(NativeMethodAccessorImpl.java:62)
	at sun.reflect.DelegatingMethodAccessorImpl.invoke(DelegatingMethodAccessorImpl.java:43)
	at java.lang.reflect.Method.invoke(Method.java:498)
(70 more lines...)
Collapse Failed ETLMapReduceTest testTableToTableWithValidations History
10 mins
java.lang.RuntimeException: java.util.concurrent.TimeoutException: CDAP Services are not available. Retried for 600 seconds.
	at com.google.common.base.Throwables.propagate(Throwables.java:240)
	at co.cask.cdap.test.IntegrationTestBase.checkSystemServices(IntegrationTestBase.java:204)
	at co.cask.cdap.test.IntegrationTestBase.setUp(IntegrationTestBase.java:99)
	at sun.reflect.NativeMethodAccessorImpl.invoke0(Native Method)
	at sun.reflect.NativeMethodAccessorImpl.invoke(NativeMethodAccessorImpl.java:62)
	at sun.reflect.DelegatingMethodAccessorImpl.invoke(DelegatingMethodAccessorImpl.java:43)
	at java.lang.reflect.Method.invoke(Method.java:498)
(70 more lines...)
Collapse Failed ExcelInputReaderTest testExcelReader History
10 mins
java.lang.RuntimeException: java.util.concurrent.TimeoutException: CDAP Services are not available. Retried for 600 seconds.
	at com.google.common.base.Throwables.propagate(Throwables.java:240)
	at co.cask.cdap.test.IntegrationTestBase.checkSystemServices(IntegrationTestBase.java:204)
	at co.cask.cdap.test.IntegrationTestBase.setUp(IntegrationTestBase.java:99)
	at sun.reflect.NativeMethodAccessorImpl.invoke0(Native Method)
	at sun.reflect.NativeMethodAccessorImpl.invoke(NativeMethodAccessorImpl.java:62)
	at sun.reflect.DelegatingMethodAccessorImpl.invoke(DelegatingMethodAccessorImpl.java:43)
	at java.lang.reflect.Method.invoke(Method.java:498)
(70 more lines...)
Collapse Failed ExcelInputReaderTest testExcelReaderReprocessFalse History
10 mins
java.lang.RuntimeException: java.util.concurrent.TimeoutException: CDAP Services are not available. Retried for 600 seconds.
	at com.google.common.base.Throwables.propagate(Throwables.java:240)
	at co.cask.cdap.test.IntegrationTestBase.checkSystemServices(IntegrationTestBase.java:204)
	at co.cask.cdap.test.IntegrationTestBase.setUp(IntegrationTestBase.java:99)
	at sun.reflect.NativeMethodAccessorImpl.invoke0(Native Method)
	at sun.reflect.NativeMethodAccessorImpl.invoke(NativeMethodAccessorImpl.java:62)
	at sun.reflect.DelegatingMethodAccessorImpl.invoke(DelegatingMethodAccessorImpl.java:43)
	at java.lang.reflect.Method.invoke(Method.java:498)
(70 more lines...)
Collapse Failed HivePluginTest testHivePlugins History
10 mins
java.lang.RuntimeException: java.util.concurrent.TimeoutException: CDAP Services are not available. Retried for 600 seconds.
	at com.google.common.base.Throwables.propagate(Throwables.java:240)
	at co.cask.cdap.test.IntegrationTestBase.checkSystemServices(IntegrationTestBase.java:204)
	at co.cask.cdap.test.IntegrationTestBase.setUp(IntegrationTestBase.java:99)
	at sun.reflect.GeneratedMethodAccessor1.invoke(Unknown Source)
	at sun.reflect.DelegatingMethodAccessorImpl.invoke(DelegatingMethodAccessorImpl.java:43)
	at java.lang.reflect.Method.invoke(Method.java:498)
	at org.junit.runners.model.FrameworkMethod$1.runReflectiveCall(FrameworkMethod.java:47)
(68 more lines...)
Collapse Failed NormalizeTest testNormalize History
10 mins
java.lang.RuntimeException: java.util.concurrent.TimeoutException: CDAP Services are not available. Retried for 600 seconds.
	at com.google.common.base.Throwables.propagate(Throwables.java:240)
	at co.cask.cdap.test.IntegrationTestBase.checkSystemServices(IntegrationTestBase.java:204)
	at co.cask.cdap.test.IntegrationTestBase.setUp(IntegrationTestBase.java:99)
	at sun.reflect.GeneratedMethodAccessor1.invoke(Unknown Source)
	at sun.reflect.DelegatingMethodAccessorImpl.invoke(DelegatingMethodAccessorImpl.java:43)
	at java.lang.reflect.Method.invoke(Method.java:498)
	at org.junit.runners.model.FrameworkMethod$1.runReflectiveCall(FrameworkMethod.java:47)
(70 more lines...)
Collapse Failed NormalizeTest testNormalizeWithEmptyAttributeValue History
10 mins
java.lang.RuntimeException: java.util.concurrent.TimeoutException: CDAP Services are not available. Retried for 600 seconds.
	at com.google.common.base.Throwables.propagate(Throwables.java:240)
	at co.cask.cdap.test.IntegrationTestBase.checkSystemServices(IntegrationTestBase.java:204)
	at co.cask.cdap.test.IntegrationTestBase.setUp(IntegrationTestBase.java:99)
	at sun.reflect.GeneratedMethodAccessor1.invoke(Unknown Source)
	at sun.reflect.DelegatingMethodAccessorImpl.invoke(DelegatingMethodAccessorImpl.java:43)
	at java.lang.reflect.Method.invoke(Method.java:498)
	at org.junit.runners.model.FrameworkMethod$1.runReflectiveCall(FrameworkMethod.java:47)
(70 more lines...)
Collapse Failed RowDenormalizerTest test History
10 mins
java.lang.RuntimeException: java.util.concurrent.TimeoutException: CDAP Services are not available. Retried for 600 seconds.
	at com.google.common.base.Throwables.propagate(Throwables.java:240)
	at co.cask.cdap.test.IntegrationTestBase.checkSystemServices(IntegrationTestBase.java:204)
	at co.cask.cdap.test.IntegrationTestBase.setUp(IntegrationTestBase.java:99)
	at sun.reflect.GeneratedMethodAccessor1.invoke(Unknown Source)
	at sun.reflect.DelegatingMethodAccessorImpl.invoke(DelegatingMethodAccessorImpl.java:43)
	at java.lang.reflect.Method.invoke(Method.java:498)
	at org.junit.runners.model.FrameworkMethod$1.runReflectiveCall(FrameworkMethod.java:47)
(68 more lines...)
Collapse Failed TPFSSinkSourceTest testMR History
10 mins
java.lang.RuntimeException: java.util.concurrent.TimeoutException: CDAP Services are not available. Retried for 600 seconds.
	at com.google.common.base.Throwables.propagate(Throwables.java:240)
	at co.cask.cdap.test.IntegrationTestBase.checkSystemServices(IntegrationTestBase.java:204)
	at co.cask.cdap.test.IntegrationTestBase.setUp(IntegrationTestBase.java:99)
	at sun.reflect.GeneratedMethodAccessor1.invoke(Unknown Source)
	at sun.reflect.DelegatingMethodAccessorImpl.invoke(DelegatingMethodAccessorImpl.java:43)
	at java.lang.reflect.Method.invoke(Method.java:498)
	at org.junit.runners.model.FrameworkMethod$1.runReflectiveCall(FrameworkMethod.java:47)
(68 more lines...)
Collapse Failed TPFSSinkSourceTest testSpark History
10 mins
java.lang.RuntimeException: java.util.concurrent.TimeoutException: CDAP Services are not available. Retried for 600 seconds.
	at com.google.common.base.Throwables.propagate(Throwables.java:240)
	at co.cask.cdap.test.IntegrationTestBase.checkSystemServices(IntegrationTestBase.java:204)
	at co.cask.cdap.test.IntegrationTestBase.setUp(IntegrationTestBase.java:99)
	at sun.reflect.GeneratedMethodAccessor1.invoke(Unknown Source)
	at sun.reflect.DelegatingMethodAccessorImpl.invoke(DelegatingMethodAccessorImpl.java:43)
	at java.lang.reflect.Method.invoke(Method.java:498)
	at org.junit.runners.model.FrameworkMethod$1.runReflectiveCall(FrameworkMethod.java:47)
(68 more lines...)
Collapse Failed ValueMapperTest test History
10 mins
java.lang.RuntimeException: java.util.concurrent.TimeoutException: CDAP Services are not available. Retried for 600 seconds.
	at com.google.common.base.Throwables.propagate(Throwables.java:240)
	at co.cask.cdap.test.IntegrationTestBase.checkSystemServices(IntegrationTestBase.java:204)
	at co.cask.cdap.test.IntegrationTestBase.setUp(IntegrationTestBase.java:99)
	at sun.reflect.GeneratedMethodAccessor1.invoke(Unknown Source)
	at sun.reflect.DelegatingMethodAccessorImpl.invoke(DelegatingMethodAccessorImpl.java:43)
	at java.lang.reflect.Method.invoke(Method.java:498)
	at org.junit.runners.model.FrameworkMethod$1.runReflectiveCall(FrameworkMethod.java:47)
(68 more lines...)
Collapse Failed XMLReaderTest testInvalidNodePathWithMoveAction History
10 mins
java.lang.RuntimeException: java.util.concurrent.TimeoutException: CDAP Services are not available. Retried for 600 seconds.
	at com.google.common.base.Throwables.propagate(Throwables.java:240)
	at co.cask.cdap.test.IntegrationTestBase.checkSystemServices(IntegrationTestBase.java:204)
	at co.cask.cdap.test.IntegrationTestBase.setUp(IntegrationTestBase.java:99)
	at sun.reflect.GeneratedMethodAccessor1.invoke(Unknown Source)
	at sun.reflect.DelegatingMethodAccessorImpl.invoke(DelegatingMethodAccessorImpl.java:43)
	at java.lang.reflect.Method.invoke(Method.java:498)
	at org.junit.runners.model.FrameworkMethod$1.runReflectiveCall(FrameworkMethod.java:47)
(68 more lines...)
Collapse Failed XMLReaderTest testInvalidPatternWithDeleteAction History
10 mins
java.lang.RuntimeException: java.util.concurrent.TimeoutException: CDAP Services are not available. Retried for 600 seconds.
	at com.google.common.base.Throwables.propagate(Throwables.java:240)
	at co.cask.cdap.test.IntegrationTestBase.checkSystemServices(IntegrationTestBase.java:204)
	at co.cask.cdap.test.IntegrationTestBase.setUp(IntegrationTestBase.java:99)
	at sun.reflect.GeneratedMethodAccessor1.invoke(Unknown Source)
	at sun.reflect.DelegatingMethodAccessorImpl.invoke(DelegatingMethodAccessorImpl.java:43)
	at java.lang.reflect.Method.invoke(Method.java:498)
	at org.junit.runners.model.FrameworkMethod$1.runReflectiveCall(FrameworkMethod.java:47)
(68 more lines...)
Collapse Failed XMLReaderTest testPatternWithDeleteAction History
10 mins
java.lang.RuntimeException: java.util.concurrent.TimeoutException: CDAP Services are not available. Retried for 600 seconds.
	at com.google.common.base.Throwables.propagate(Throwables.java:240)
	at co.cask.cdap.test.IntegrationTestBase.checkSystemServices(IntegrationTestBase.java:204)
	at co.cask.cdap.test.IntegrationTestBase.setUp(IntegrationTestBase.java:99)
	at sun.reflect.GeneratedMethodAccessor1.invoke(Unknown Source)
	at sun.reflect.DelegatingMethodAccessorImpl.invoke(DelegatingMethodAccessorImpl.java:43)
	at java.lang.reflect.Method.invoke(Method.java:498)
	at org.junit.runners.model.FrameworkMethod$1.runReflectiveCall(FrameworkMethod.java:47)
(68 more lines...)
Collapse Failed XMLReaderTest testPreProcessingNotRequired History
10 mins
java.lang.RuntimeException: java.util.concurrent.TimeoutException: CDAP Services are not available. Retried for 600 seconds.
	at com.google.common.base.Throwables.propagate(Throwables.java:240)
	at co.cask.cdap.test.IntegrationTestBase.checkSystemServices(IntegrationTestBase.java:204)
	at co.cask.cdap.test.IntegrationTestBase.setUp(IntegrationTestBase.java:99)
	at sun.reflect.GeneratedMethodAccessor1.invoke(Unknown Source)
	at sun.reflect.DelegatingMethodAccessorImpl.invoke(DelegatingMethodAccessorImpl.java:43)
	at java.lang.reflect.Method.invoke(Method.java:498)
	at org.junit.runners.model.FrameworkMethod$1.runReflectiveCall(FrameworkMethod.java:47)
(68 more lines...)
Collapse Failed XMLReaderTest testPreProcessingRequired History
10 mins
java.lang.RuntimeException: java.util.concurrent.TimeoutException: CDAP Services are not available. Retried for 600 seconds.
	at com.google.common.base.Throwables.propagate(Throwables.java:240)
	at co.cask.cdap.test.IntegrationTestBase.checkSystemServices(IntegrationTestBase.java:204)
	at co.cask.cdap.test.IntegrationTestBase.setUp(IntegrationTestBase.java:99)
	at sun.reflect.GeneratedMethodAccessor1.invoke(Unknown Source)
	at sun.reflect.DelegatingMethodAccessorImpl.invoke(DelegatingMethodAccessorImpl.java:43)
	at java.lang.reflect.Method.invoke(Method.java:498)
	at org.junit.runners.model.FrameworkMethod$1.runReflectiveCall(FrameworkMethod.java:47)
(68 more lines...)
Collapse Failed DataStreamsTest testDataStreams History
10 mins
java.lang.RuntimeException: java.util.concurrent.TimeoutException: CDAP Services are not available. Retried for 600 seconds.
	at com.google.common.base.Throwables.propagate(Throwables.java:240)
	at co.cask.cdap.test.IntegrationTestBase.checkSystemServices(IntegrationTestBase.java:204)
	at co.cask.cdap.test.IntegrationTestBase.setUp(IntegrationTestBase.java:99)
	at sun.reflect.NativeMethodAccessorImpl.invoke0(Native Method)
	at sun.reflect.NativeMethodAccessorImpl.invoke(NativeMethodAccessorImpl.java:62)
	at sun.reflect.DelegatingMethodAccessorImpl.invoke(DelegatingMethodAccessorImpl.java:43)
	at java.lang.reflect.Method.invoke(Method.java:498)
(70 more lines...)
Collapse Failed WranglerServiceTest test History
10 mins
java.lang.RuntimeException: java.util.concurrent.TimeoutException: CDAP Services are not available. Retried for 600 seconds.
	at com.google.common.base.Throwables.propagate(Throwables.java:240)
	at co.cask.cdap.test.IntegrationTestBase.checkSystemServices(IntegrationTestBase.java:204)
	at co.cask.cdap.test.IntegrationTestBase.setUp(IntegrationTestBase.java:99)
	at sun.reflect.GeneratedMethodAccessor1.invoke(Unknown Source)
	at sun.reflect.DelegatingMethodAccessorImpl.invoke(DelegatingMethodAccessorImpl.java:43)
	at java.lang.reflect.Method.invoke(Method.java:498)
	at org.junit.runners.model.FrameworkMethod$1.runReflectiveCall(FrameworkMethod.java:47)
(68 more lines...)
Collapse Failed WranglerTest testWranglerMR History
10 mins
java.lang.RuntimeException: java.util.concurrent.TimeoutException: CDAP Services are not available. Retried for 600 seconds.
	at com.google.common.base.Throwables.propagate(Throwables.java:240)
	at co.cask.cdap.test.IntegrationTestBase.checkSystemServices(IntegrationTestBase.java:204)
	at co.cask.cdap.test.IntegrationTestBase.setUp(IntegrationTestBase.java:99)
	at sun.reflect.GeneratedMethodAccessor1.invoke(Unknown Source)
	at sun.reflect.DelegatingMethodAccessorImpl.invoke(DelegatingMethodAccessorImpl.java:43)
	at java.lang.reflect.Method.invoke(Method.java:498)
	at org.junit.runners.model.FrameworkMethod$1.runReflectiveCall(FrameworkMethod.java:47)
(68 more lines...)
Collapse Failed WranglerTest testWranglerSpark History
10 mins
java.lang.RuntimeException: java.util.concurrent.TimeoutException: CDAP Services are not available. Retried for 600 seconds.
	at com.google.common.base.Throwables.propagate(Throwables.java:240)
	at co.cask.cdap.test.IntegrationTestBase.checkSystemServices(IntegrationTestBase.java:204)
	at co.cask.cdap.test.IntegrationTestBase.setUp(IntegrationTestBase.java:99)
	at sun.reflect.GeneratedMethodAccessor1.invoke(Unknown Source)
	at sun.reflect.DelegatingMethodAccessorImpl.invoke(DelegatingMethodAccessorImpl.java:43)
	at java.lang.reflect.Method.invoke(Method.java:498)
	at org.junit.runners.model.FrameworkMethod$1.runReflectiveCall(FrameworkMethod.java:47)
(68 more lines...)
Collapse Failed PermissionTest test History
10 mins
java.lang.RuntimeException: java.util.concurrent.TimeoutException: CDAP Services are not available. Retried for 600 seconds.
	at com.google.common.base.Throwables.propagate(Throwables.java:240)
	at co.cask.cdap.test.IntegrationTestBase.checkSystemServices(IntegrationTestBase.java:204)
	at co.cask.cdap.test.IntegrationTestBase.setUp(IntegrationTestBase.java:99)
	at sun.reflect.GeneratedMethodAccessor1.invoke(Unknown Source)
	at sun.reflect.DelegatingMethodAccessorImpl.invoke(DelegatingMethodAccessorImpl.java:43)
	at java.lang.reflect.Method.invoke(Method.java:498)
	at org.junit.runners.model.FrameworkMethod$1.runReflectiveCall(FrameworkMethod.java:47)
(68 more lines...)
Collapse Failed ReadlessIncrementTest testReadlessIncrementsInMapReduce History
10 mins
java.lang.RuntimeException: java.util.concurrent.TimeoutException: CDAP Services are not available. Retried for 600 seconds.
	at com.google.common.base.Throwables.propagate(Throwables.java:240)
	at co.cask.cdap.test.IntegrationTestBase.checkSystemServices(IntegrationTestBase.java:204)
	at co.cask.cdap.test.IntegrationTestBase.setUp(IntegrationTestBase.java:99)
	at sun.reflect.GeneratedMethodAccessor1.invoke(Unknown Source)
	at sun.reflect.DelegatingMethodAccessorImpl.invoke(DelegatingMethodAccessorImpl.java:43)
	at java.lang.reflect.Method.invoke(Method.java:498)
	at org.junit.runners.model.FrameworkMethod$1.runReflectiveCall(FrameworkMethod.java:47)
(68 more lines...)
Collapse Failed HangingWorkerTest testRestart History
10 mins
java.lang.RuntimeException: java.util.concurrent.TimeoutException: CDAP Services are not available. Retried for 600 seconds.
	at com.google.common.base.Throwables.propagate(Throwables.java:240)
	at co.cask.cdap.test.IntegrationTestBase.checkSystemServices(IntegrationTestBase.java:204)
	at co.cask.cdap.test.IntegrationTestBase.setUp(IntegrationTestBase.java:99)
	at sun.reflect.GeneratedMethodAccessor1.invoke(Unknown Source)
	at sun.reflect.DelegatingMethodAccessorImpl.invoke(DelegatingMethodAccessorImpl.java:43)
	at java.lang.reflect.Method.invoke(Method.java:498)
	at org.junit.runners.model.FrameworkMethod$1.runReflectiveCall(FrameworkMethod.java:47)
(68 more lines...)
Collapse Failed ServiceWorkerTest test History
10 mins
java.lang.RuntimeException: java.util.concurrent.TimeoutException: CDAP Services are not available. Retried for 600 seconds.
	at com.google.common.base.Throwables.propagate(Throwables.java:240)
	at co.cask.cdap.test.IntegrationTestBase.checkSystemServices(IntegrationTestBase.java:204)
	at co.cask.cdap.test.IntegrationTestBase.setUp(IntegrationTestBase.java:99)
	at sun.reflect.GeneratedMethodAccessor1.invoke(Unknown Source)
	at sun.reflect.DelegatingMethodAccessorImpl.invoke(DelegatingMethodAccessorImpl.java:43)
	at java.lang.reflect.Method.invoke(Method.java:498)
	at org.junit.runners.model.FrameworkMethod$1.runReflectiveCall(FrameworkMethod.java:47)
(68 more lines...)
Collapse Failed ApplicationTest test History
10 mins
java.lang.RuntimeException: java.util.concurrent.TimeoutException: CDAP Services are not available. Retried for 600 seconds.
	at com.google.common.base.Throwables.propagate(Throwables.java:240)
	at co.cask.cdap.test.IntegrationTestBase.checkSystemServices(IntegrationTestBase.java:204)
	at co.cask.cdap.test.IntegrationTestBase.setUp(IntegrationTestBase.java:99)
	at sun.reflect.NativeMethodAccessorImpl.invoke0(Native Method)
	at sun.reflect.NativeMethodAccessorImpl.invoke(NativeMethodAccessorImpl.java:62)
	at sun.reflect.DelegatingMethodAccessorImpl.invoke(DelegatingMethodAccessorImpl.java:43)
	at java.lang.reflect.Method.invoke(Method.java:498)
(70 more lines...)
Collapse Failed ApplicationVersionTest testAppVersionsCreationUpdateDeletion History
10 mins
java.lang.RuntimeException: java.util.concurrent.TimeoutException: CDAP Services are not available. Retried for 600 seconds.
	at com.google.common.base.Throwables.propagate(Throwables.java:240)
	at co.cask.cdap.test.IntegrationTestBase.checkSystemServices(IntegrationTestBase.java:204)
	at co.cask.cdap.test.IntegrationTestBase.setUp(IntegrationTestBase.java:99)
	at sun.reflect.NativeMethodAccessorImpl.invoke0(Native Method)
	at sun.reflect.NativeMethodAccessorImpl.invoke(NativeMethodAccessorImpl.java:62)
	at sun.reflect.DelegatingMethodAccessorImpl.invoke(DelegatingMethodAccessorImpl.java:43)
	at java.lang.reflect.Method.invoke(Method.java:498)
(70 more lines...)
Collapse Failed DatasetTest test History
10 mins
java.lang.RuntimeException: java.util.concurrent.TimeoutException: CDAP Services are not available. Retried for 600 seconds.
	at com.google.common.base.Throwables.propagate(Throwables.java:240)
	at co.cask.cdap.test.IntegrationTestBase.checkSystemServices(IntegrationTestBase.java:204)
	at co.cask.cdap.test.IntegrationTestBase.setUp(IntegrationTestBase.java:99)
	at sun.reflect.NativeMethodAccessorImpl.invoke0(Native Method)
	at sun.reflect.NativeMethodAccessorImpl.invoke(NativeMethodAccessorImpl.java:62)
	at sun.reflect.DelegatingMethodAccessorImpl.invoke(DelegatingMethodAccessorImpl.java:43)
	at java.lang.reflect.Method.invoke(Method.java:498)
(70 more lines...)
Collapse Failed NamespaceTest testNamespaces History
10 mins
java.lang.RuntimeException: java.util.concurrent.TimeoutException: CDAP Services are not available. Retried for 600 seconds.
	at com.google.common.base.Throwables.propagate(Throwables.java:240)
	at co.cask.cdap.test.IntegrationTestBase.checkSystemServices(IntegrationTestBase.java:204)
	at co.cask.cdap.test.IntegrationTestBase.setUp(IntegrationTestBase.java:99)
	at sun.reflect.GeneratedMethodAccessor1.invoke(Unknown Source)
	at sun.reflect.DelegatingMethodAccessorImpl.invoke(DelegatingMethodAccessorImpl.java:43)
	at java.lang.reflect.Method.invoke(Method.java:498)
	at org.junit.runners.model.FrameworkMethod$1.runReflectiveCall(FrameworkMethod.java:47)
(68 more lines...)
Collapse Failed NamespacedStreamTest testNamespacedStreams History
10 mins
java.lang.RuntimeException: java.util.concurrent.TimeoutException: CDAP Services are not available. Retried for 600 seconds.
	at com.google.common.base.Throwables.propagate(Throwables.java:240)
	at co.cask.cdap.test.IntegrationTestBase.checkSystemServices(IntegrationTestBase.java:204)
	at co.cask.cdap.test.IntegrationTestBase.setUp(IntegrationTestBase.java:99)
	at sun.reflect.GeneratedMethodAccessor1.invoke(Unknown Source)
	at sun.reflect.DelegatingMethodAccessorImpl.invoke(DelegatingMethodAccessorImpl.java:43)
	at java.lang.reflect.Method.invoke(Method.java:498)
	at org.junit.runners.model.FrameworkMethod$1.runReflectiveCall(FrameworkMethod.java:47)
(68 more lines...)
Collapse Failed StreamTest testNonexistentStreams History
10 mins
java.lang.RuntimeException: java.util.concurrent.TimeoutException: CDAP Services are not available. Retried for 600 seconds.
	at com.google.common.base.Throwables.propagate(Throwables.java:240)
	at co.cask.cdap.test.IntegrationTestBase.checkSystemServices(IntegrationTestBase.java:204)
	at co.cask.cdap.test.IntegrationTestBase.setUp(IntegrationTestBase.java:99)
	at sun.reflect.GeneratedMethodAccessor1.invoke(Unknown Source)
	at sun.reflect.DelegatingMethodAccessorImpl.invoke(DelegatingMethodAccessorImpl.java:43)
	at java.lang.reflect.Method.invoke(Method.java:498)
	at org.junit.runners.model.FrameworkMethod$1.runReflectiveCall(FrameworkMethod.java:47)
(68 more lines...)
Collapse Failed StreamTest testStreams History
10 mins
java.lang.RuntimeException: java.util.concurrent.TimeoutException: CDAP Services are not available. Retried for 600 seconds.
	at com.google.common.base.Throwables.propagate(Throwables.java:240)
	at co.cask.cdap.test.IntegrationTestBase.checkSystemServices(IntegrationTestBase.java:204)
	at co.cask.cdap.test.IntegrationTestBase.setUp(IntegrationTestBase.java:99)
	at sun.reflect.GeneratedMethodAccessor1.invoke(Unknown Source)
	at sun.reflect.DelegatingMethodAccessorImpl.invoke(DelegatingMethodAccessorImpl.java:43)
	at java.lang.reflect.Method.invoke(Method.java:498)
	at org.junit.runners.model.FrameworkMethod$1.runReflectiveCall(FrameworkMethod.java:47)
(68 more lines...)
Collapse Failed ExploreTest test History
10 mins
java.lang.RuntimeException: java.util.concurrent.TimeoutException: CDAP Services are not available. Retried for 600 seconds.
	at com.google.common.base.Throwables.propagate(Throwables.java:240)
	at co.cask.cdap.test.IntegrationTestBase.checkSystemServices(IntegrationTestBase.java:204)
	at co.cask.cdap.test.IntegrationTestBase.setUp(IntegrationTestBase.java:99)
	at sun.reflect.GeneratedMethodAccessor1.invoke(Unknown Source)
	at sun.reflect.DelegatingMethodAccessorImpl.invoke(DelegatingMethodAccessorImpl.java:43)
	at java.lang.reflect.Method.invoke(Method.java:498)
	at org.junit.runners.model.FrameworkMethod$1.runReflectiveCall(FrameworkMethod.java:47)
(68 more lines...)
Collapse Failed ExploreTest testSubqueryInWhereClause History
10 mins
java.lang.RuntimeException: java.util.concurrent.TimeoutException: CDAP Services are not available. Retried for 600 seconds.
	at com.google.common.base.Throwables.propagate(Throwables.java:240)
	at co.cask.cdap.test.IntegrationTestBase.checkSystemServices(IntegrationTestBase.java:204)
	at co.cask.cdap.test.IntegrationTestBase.setUp(IntegrationTestBase.java:99)
	at sun.reflect.GeneratedMethodAccessor1.invoke(Unknown Source)
	at sun.reflect.DelegatingMethodAccessorImpl.invoke(DelegatingMethodAccessorImpl.java:43)
	at java.lang.reflect.Method.invoke(Method.java:498)
	at org.junit.runners.model.FrameworkMethod$1.runReflectiveCall(FrameworkMethod.java:47)
(68 more lines...)
Collapse Failed FileSetTest test History
10 mins
java.lang.RuntimeException: java.util.concurrent.TimeoutException: CDAP Services are not available. Retried for 600 seconds.
	at com.google.common.base.Throwables.propagate(Throwables.java:240)
	at co.cask.cdap.test.IntegrationTestBase.checkSystemServices(IntegrationTestBase.java:204)
	at co.cask.cdap.test.IntegrationTestBase.setUp(IntegrationTestBase.java:99)
	at sun.reflect.GeneratedMethodAccessor1.invoke(Unknown Source)
	at sun.reflect.DelegatingMethodAccessorImpl.invoke(DelegatingMethodAccessorImpl.java:43)
	at java.lang.reflect.Method.invoke(Method.java:498)
	at org.junit.runners.model.FrameworkMethod$1.runReflectiveCall(FrameworkMethod.java:47)
(68 more lines...)
Collapse Failed PartitionCorrectorTest test History
10 mins
java.lang.RuntimeException: java.util.concurrent.TimeoutException: CDAP Services are not available. Retried for 600 seconds.
	at com.google.common.base.Throwables.propagate(Throwables.java:240)
	at co.cask.cdap.test.IntegrationTestBase.checkSystemServices(IntegrationTestBase.java:204)
	at co.cask.cdap.test.IntegrationTestBase.setUp(IntegrationTestBase.java:99)
	at sun.reflect.GeneratedMethodAccessor1.invoke(Unknown Source)
	at sun.reflect.DelegatingMethodAccessorImpl.invoke(DelegatingMethodAccessorImpl.java:43)
	at java.lang.reflect.Method.invoke(Method.java:498)
	at org.junit.runners.model.FrameworkMethod$1.runReflectiveCall(FrameworkMethod.java:47)
(68 more lines...)
Collapse Failed PartitionedFileSetUpdateTest test History
10 mins
java.lang.RuntimeException: java.util.concurrent.TimeoutException: CDAP Services are not available. Retried for 600 seconds.
	at com.google.common.base.Throwables.propagate(Throwables.java:240)
	at co.cask.cdap.test.IntegrationTestBase.checkSystemServices(IntegrationTestBase.java:204)
	at co.cask.cdap.test.IntegrationTestBase.setUp(IntegrationTestBase.java:99)
	at sun.reflect.GeneratedMethodAccessor1.invoke(Unknown Source)
	at sun.reflect.DelegatingMethodAccessorImpl.invoke(DelegatingMethodAccessorImpl.java:43)
	at java.lang.reflect.Method.invoke(Method.java:498)
	at org.junit.runners.model.FrameworkMethod$1.runReflectiveCall(FrameworkMethod.java:47)
(68 more lines...)
Collapse Failed PurchaseMetadataTest testLineage History
10 mins
java.lang.RuntimeException: java.util.concurrent.TimeoutException: CDAP Services are not available. Retried for 600 seconds.
	at com.google.common.base.Throwables.propagate(Throwables.java:240)
	at co.cask.cdap.test.IntegrationTestBase.checkSystemServices(IntegrationTestBase.java:204)
	at co.cask.cdap.test.IntegrationTestBase.setUp(IntegrationTestBase.java:99)
	at sun.reflect.GeneratedMethodAccessor1.invoke(Unknown Source)
	at sun.reflect.DelegatingMethodAccessorImpl.invoke(DelegatingMethodAccessorImpl.java:43)
	at java.lang.reflect.Method.invoke(Method.java:498)
	at org.junit.runners.model.FrameworkMethod$1.runReflectiveCall(FrameworkMethod.java:47)
(68 more lines...)
Collapse Failed PurchaseMetadataTest testSearchUsingSystemMetadata History
10 mins
java.lang.RuntimeException: java.util.concurrent.TimeoutException: CDAP Services are not available. Retried for 600 seconds.
	at com.google.common.base.Throwables.propagate(Throwables.java:240)
	at co.cask.cdap.test.IntegrationTestBase.checkSystemServices(IntegrationTestBase.java:204)
	at co.cask.cdap.test.IntegrationTestBase.setUp(IntegrationTestBase.java:99)
	at sun.reflect.GeneratedMethodAccessor1.invoke(Unknown Source)
	at sun.reflect.DelegatingMethodAccessorImpl.invoke(DelegatingMethodAccessorImpl.java:43)
	at java.lang.reflect.Method.invoke(Method.java:498)
	at org.junit.runners.model.FrameworkMethod$1.runReflectiveCall(FrameworkMethod.java:47)
(68 more lines...)
Collapse Failed PurchaseAudiTest test History
10 mins
java.lang.RuntimeException: java.util.concurrent.TimeoutException: CDAP Services are not available. Retried for 600 seconds.
	at com.google.common.base.Throwables.propagate(Throwables.java:240)
	at co.cask.cdap.test.IntegrationTestBase.checkSystemServices(IntegrationTestBase.java:204)
	at co.cask.cdap.test.IntegrationTestBase.setUp(IntegrationTestBase.java:99)
	at sun.reflect.GeneratedMethodAccessor1.invoke(Unknown Source)
	at sun.reflect.DelegatingMethodAccessorImpl.invoke(DelegatingMethodAccessorImpl.java:43)
	at java.lang.reflect.Method.invoke(Method.java:498)
	at org.junit.runners.model.FrameworkMethod$1.runReflectiveCall(FrameworkMethod.java:47)
(68 more lines...)
Collapse Failed SparkPageRankAppTest test History
10 mins
java.lang.RuntimeException: java.util.concurrent.TimeoutException: CDAP Services are not available. Retried for 600 seconds.
	at com.google.common.base.Throwables.propagate(Throwables.java:240)
	at co.cask.cdap.test.IntegrationTestBase.checkSystemServices(IntegrationTestBase.java:204)
	at co.cask.cdap.test.IntegrationTestBase.setUp(IntegrationTestBase.java:99)
	at sun.reflect.GeneratedMethodAccessor1.invoke(Unknown Source)
	at sun.reflect.DelegatingMethodAccessorImpl.invoke(DelegatingMethodAccessorImpl.java:43)
	at java.lang.reflect.Method.invoke(Method.java:498)
	at org.junit.runners.model.FrameworkMethod$1.runReflectiveCall(FrameworkMethod.java:47)
(68 more lines...)
Collapse Failed TrackerTest test History
10 mins
java.lang.RuntimeException: java.util.concurrent.TimeoutException: CDAP Services are not available. Retried for 600 seconds.
	at com.google.common.base.Throwables.propagate(Throwables.java:240)
	at co.cask.cdap.test.IntegrationTestBase.checkSystemServices(IntegrationTestBase.java:204)
	at co.cask.cdap.test.IntegrationTestBase.setUp(IntegrationTestBase.java:99)
	at sun.reflect.GeneratedMethodAccessor1.invoke(Unknown Source)
	at sun.reflect.DelegatingMethodAccessorImpl.invoke(DelegatingMethodAccessorImpl.java:43)
	at java.lang.reflect.Method.invoke(Method.java:498)
	at org.junit.runners.model.FrameworkMethod$1.runReflectiveCall(FrameworkMethod.java:47)
(68 more lines...)
Existing test failures 1
Status Test Failing since Duration
java.lang.RuntimeException: java.util.concurrent.TimeoutException: CDAP Services are not available. Retried for 600 seconds.
	at com.google.common.base.Throwables.propagate(Throwables.java:240)
	at co.cask.cdap.test.IntegrationTestBase.checkSystemServices(IntegrationTestBase.java:204)
	at co.cask.cdap.test.IntegrationTestBase.setUp(IntegrationTestBase.java:99)
	at sun.reflect.NativeMethodAccessorImpl.invoke0(Native Method)
	at sun.reflect.NativeMethodAccessorImpl.invoke(NativeMethodAccessorImpl.java:62)
	at sun.reflect.DelegatingMethodAccessorImpl.invoke(DelegatingMethodAccessorImpl.java:43)
	at java.lang.reflect.Method.invoke(Method.java:498)
(70 more lines...)

Error summary

The build generated some errors. See the full build log for more details.

Java HotSpot(TM) 64-Bit Server VM warning: ignoring option MaxPermSize=128m; support was removed in 8.0
Warning:  org.apache.xerces.jaxp.SAXParserImpl$JAXPSAXParser: Property 'http://www.oracle.com/xml/jaxp/properties/entityExpansionLimit' is not recognized.
Compiler warnings:
  WARNING:  'org.apache.xerces.jaxp.SAXParserImpl: Property 'http://javax.xml.XMLConstants/property/accessExternalDTD' is not recognized.'
Warning:  org.apache.xerces.parsers.SAXParser: Feature 'http://javax.xml.XMLConstants/feature/secure-processing' is not recognized.
Warning:  org.apache.xerces.parsers.SAXParser: Property 'http://javax.xml.XMLConstants/property/accessExternalDTD' is not recognized.
Warning:  org.apache.xerces.parsers.SAXParser: Property 'http://www.oracle.com/xml/jaxp/properties/entityExpansionLimit' is not recognized.
Warning:  org.apache.xerces.jaxp.SAXParserImpl$JAXPSAXParser: Property 'http://www.oracle.com/xml/jaxp/properties/entityExpansionLimit' is not recognized.
Compiler warnings:
  WARNING:  'org.apache.xerces.jaxp.SAXParserImpl: Property 'http://javax.xml.XMLConstants/property/accessExternalDTD' is not recognized.'
Warning:  org.apache.xerces.parsers.SAXParser: Feature 'http://javax.xml.XMLConstants/feature/secure-processing' is not recognized.
Warning:  org.apache.xerces.parsers.SAXParser: Property 'http://javax.xml.XMLConstants/property/accessExternalDTD' is not recognized.
Warning:  org.apache.xerces.parsers.SAXParser: Property 'http://www.oracle.com/xml/jaxp/properties/entityExpansionLimit' is not recognized.
Warning:  org.apache.xerces.jaxp.SAXParserImpl$JAXPSAXParser: Property 'http://www.oracle.com/xml/jaxp/properties/entityExpansionLimit' is not recognized.
Compiler warnings:
  WARNING:  'org.apache.xerces.jaxp.SAXParserImpl: Property 'http://javax.xml.XMLConstants/property/accessExternalDTD' is not recognized.'
Warning:  org.apache.xerces.parsers.SAXParser: Feature 'http://javax.xml.XMLConstants/feature/secure-processing' is not recognized.
Warning:  org.apache.xerces.parsers.SAXParser: Property 'http://javax.xml.XMLConstants/property/accessExternalDTD' is not recognized.
Warning:  org.apache.xerces.parsers.SAXParser: Property 'http://www.oracle.com/xml/jaxp/properties/entityExpansionLimit' is not recognized.
SLF4J: Class path contains multiple SLF4J bindings.
SLF4J: Found binding in [jar:file:/home/bamboo/.m2/repository/co/cask/cdap/cdap-cli/5.1.0-SNAPSHOT/cdap-cli-5.1.0-SNAPSHOT.jar!/org/slf4j/impl/StaticLoggerBinder.class]
SLF4J: Found binding in [jar:file:/home/bamboo/.m2/repository/co/cask/cdap/cdap-explore-jdbc/5.1.0-SNAPSHOT/cdap-explore-jdbc-5.1.0-SNAPSHOT.jar!/org/slf4j/impl/StaticLoggerBinder.class]
SLF4J: Found binding in [jar:file:/home/bamboo/.m2/repository/ch/qos/logback/logback-classic/1.0.9/logback-classic-1.0.9.jar!/org/slf4j/impl/StaticLoggerBinder.class]
SLF4J: See http://www.slf4j.org/codes.html#multiple_bindings for an explanation.
SLF4J: Actual binding is of type [ch.qos.logback.classic.util.ContextSelectorStaticBinder]