Build #87

Build: #87 failed Manual run by Ali Anwar

Stages & jobs

  1. Variables

  2. Spinup and Test

Logs

The following logs have been generated by the jobs in this plan.
  • Expand all
  • Collapse all
Job Logs
Collapse Ambari - HDP 2.6 Spinup and Test Download or View
07-Dec-2018 07:19:43 [INFO] integration-test-core ............................. SUCCESS [5.298s]
07-Dec-2018 07:19:43 [INFO] integration-test-remote ........................... FAILURE [9:19:37.797s]
07-Dec-2018 07:19:43 [INFO] integration-test-standalone ....................... SKIPPED
07-Dec-2018 07:19:43 [INFO] upgrade-test ...................................... SKIPPED
07-Dec-2018 07:19:43 [INFO] long-running-test ................................. SKIPPED
07-Dec-2018 07:19:43 [INFO] ------------------------------------------------------------------------
07-Dec-2018 07:19:43 [INFO] BUILD FAILURE
07-Dec-2018 07:19:43 [INFO] ------------------------------------------------------------------------
07-Dec-2018 07:19:43 [INFO] Total time: 9:20:35.850s
07-Dec-2018 07:19:43 [INFO] Finished at: Fri Dec 07 07:19:43 UTC 2018
07-Dec-2018 07:19:43 [INFO] Final Memory: 103M/698M
07-Dec-2018 07:19:43 [INFO] ------------------------------------------------------------------------
07-Dec-2018 07:19:43 [ERROR] Failed to execute goal org.apache.maven.plugins:maven-surefire-plugin:2.18.1:test (default-test) on project integration-test-remote: There are test failures.
07-Dec-2018 07:19:43 [ERROR]
07-Dec-2018 07:19:43 [ERROR] Please refer to /var/bamboo/xml-data/build-dir/IT-ITA-AMBH26/cdap-integration-tests/integration-test-remote/target/surefire-reports for the individual test results.
07-Dec-2018 07:19:43 [ERROR] -> [Help 1]
07-Dec-2018 07:19:43 [ERROR]
07-Dec-2018 07:19:43 [ERROR] To see the full stack trace of the errors, re-run Maven with the -e switch.
07-Dec-2018 07:19:43 [ERROR] Re-run Maven using the -X switch to enable full debug logging.
07-Dec-2018 07:19:43 [ERROR]
07-Dec-2018 07:19:43 [ERROR] For more information about the errors and possible solutions, please read the following articles:
07-Dec-2018 07:19:43 [ERROR] [Help 1] http://cwiki.apache.org/confluence/display/MAVEN/MojoFailureException
07-Dec-2018 07:19:43 [ERROR]
07-Dec-2018 07:19:43 [ERROR] After correcting the problems, you can resume the build with the command
07-Dec-2018 07:19:43 [ERROR]   mvn <goals> -rf :integration-test-remote