Build #80

Build: #80 failed Scheduled with changes by 4 people

Stages & jobs

  1. Variables

  2. Spinup and Test

Build result summary

Details

Completed
Duration
660 minutes
Labels
None
Revisions
caskdata/cdap-integration-tests
863308647e98ec11e3ab45c42a2d370dbb87904e 863308647e98ec11e3ab45c42a2d370dbb87904e
caskdata/coopr-internal
da918409366d3485ecacffa357da69da29bd6b39 da918409366d3485ecacffa357da69da29bd6b39
Total tests
59
Failing since
#64 (Scheduled – )

Responsible

This build has been failing since #64
No one has taken responsibility

Code commits

caskdata/cdap-integration-tests
Author Commit Message Commit date
Rohit Sinha <rosinha@google.com> Rohit Sinha <rosinha@google.com> 863308647e98ec11e3ab45c42a2d370dbb87904e 863308647e98ec11e3ab45c42a2d370dbb87904e Merge pull request #940 from caskdata/feature/merge-rel-5-dev
Merge release/5.0 to develop
Rohit Sinha <rosinha@google.com> Rohit Sinha <rosinha@google.com> 631de22defd3f6ace9ef0fff605724c079f4b3ae m 631de22defd3f6ace9ef0fff605724c079f4b3ae Revert "update autobuild repos"
This reverts commit befb90139aceafc922bec10f012dbc3aaeb0a08f.
Rohit Sinha <rosinha@google.com> Rohit Sinha <rosinha@google.com> e37a889981afad516f445e79149f92e34a537b07 m e37a889981afad516f445e79149f92e34a537b07 Merge pull request #938 from caskdata/feature/fix-keytabs
Update keytabs for impersonation testing
Rohit Sinha <rosinha@google.com> Rohit Sinha <rosinha@google.com> f2ee352444c027f3780d989b2865f48793df8e74 m f2ee352444c027f3780d989b2865f48793df8e74 Update keytabs for impersonation testing
dereklwood <derekwood@google.com> dereklwood <derekwood@google.com> 0e3fa0c28938081dc7683ba81e2348ce8b852886 m 0e3fa0c28938081dc7683ba81e2348ce8b852886 Merge pull request #937 from caskdata/feature/bump-rm-allocation-memory-cm
increase memory lower-bound for all containers in cm clusters

Configuration changes

Plan configuration has changed since the last successful build. See the plan audit log for more details.

Tests

New test failures 58
Status Test View job Duration
Collapse Failed KVTableWithProjectionTest testKVTableWithProjection History
Ambari - HDP 2.6 10 mins
java.lang.RuntimeException: java.util.concurrent.TimeoutException: CDAP Services are not available. Retried for 600 seconds.
	at com.google.common.base.Throwables.propagate(Throwables.java:240)
	at co.cask.cdap.test.IntegrationTestBase.checkSystemServices(IntegrationTestBase.java:204)
	at co.cask.cdap.test.IntegrationTestBase.setUp(IntegrationTestBase.java:99)
	at sun.reflect.GeneratedMethodAccessor1.invoke(Unknown Source)
	at sun.reflect.DelegatingMethodAccessorImpl.invoke(DelegatingMethodAccessorImpl.java:43)
	at java.lang.reflect.Method.invoke(Method.java:498)
	at org.junit.runners.model.FrameworkMethod$1.runReflectiveCall(FrameworkMethod.java:47)
(68 more lines...)
Collapse Failed StreamTPFSWithProjectionTest testStreamTPFSWithProjection History
Ambari - HDP 2.6 10 mins
java.lang.RuntimeException: java.util.concurrent.TimeoutException: CDAP Services are not available. Retried for 600 seconds.
	at com.google.common.base.Throwables.propagate(Throwables.java:240)
	at co.cask.cdap.test.IntegrationTestBase.checkSystemServices(IntegrationTestBase.java:204)
	at co.cask.cdap.test.IntegrationTestBase.setUp(IntegrationTestBase.java:99)
	at sun.reflect.GeneratedMethodAccessor1.invoke(Unknown Source)
	at sun.reflect.DelegatingMethodAccessorImpl.invoke(DelegatingMethodAccessorImpl.java:43)
	at java.lang.reflect.Method.invoke(Method.java:498)
	at org.junit.runners.model.FrameworkMethod$1.runReflectiveCall(FrameworkMethod.java:47)
(68 more lines...)
Collapse Failed BatchAggregatorTest test History
Ambari - HDP 2.6 10 mins
java.lang.RuntimeException: java.util.concurrent.TimeoutException: CDAP Services are not available. Retried for 600 seconds.
	at com.google.common.base.Throwables.propagate(Throwables.java:240)
	at co.cask.cdap.test.IntegrationTestBase.checkSystemServices(IntegrationTestBase.java:204)
	at co.cask.cdap.test.IntegrationTestBase.setUp(IntegrationTestBase.java:99)
	at sun.reflect.NativeMethodAccessorImpl.invoke0(Native Method)
	at sun.reflect.NativeMethodAccessorImpl.invoke(NativeMethodAccessorImpl.java:62)
	at sun.reflect.DelegatingMethodAccessorImpl.invoke(DelegatingMethodAccessorImpl.java:43)
	at java.lang.reflect.Method.invoke(Method.java:498)
(70 more lines...)
Collapse Failed BatchCubeSinkTest test History
Ambari - HDP 2.6 10 mins
java.lang.RuntimeException: java.util.concurrent.TimeoutException: CDAP Services are not available. Retried for 600 seconds.
	at com.google.common.base.Throwables.propagate(Throwables.java:240)
	at co.cask.cdap.test.IntegrationTestBase.checkSystemServices(IntegrationTestBase.java:204)
	at co.cask.cdap.test.IntegrationTestBase.setUp(IntegrationTestBase.java:99)
	at sun.reflect.NativeMethodAccessorImpl.invoke0(Native Method)
	at sun.reflect.NativeMethodAccessorImpl.invoke(NativeMethodAccessorImpl.java:62)
	at sun.reflect.DelegatingMethodAccessorImpl.invoke(DelegatingMethodAccessorImpl.java:43)
	at java.lang.reflect.Method.invoke(Method.java:498)
(70 more lines...)
Collapse Failed BatchJoinerTest testJoinerMR History
Ambari - HDP 2.6 10 mins
java.lang.RuntimeException: java.util.concurrent.TimeoutException: CDAP Services are not available. Retried for 600 seconds.
	at com.google.common.base.Throwables.propagate(Throwables.java:240)
	at co.cask.cdap.test.IntegrationTestBase.checkSystemServices(IntegrationTestBase.java:204)
	at co.cask.cdap.test.IntegrationTestBase.setUp(IntegrationTestBase.java:99)
	at sun.reflect.NativeMethodAccessorImpl.invoke0(Native Method)
	at sun.reflect.NativeMethodAccessorImpl.invoke(NativeMethodAccessorImpl.java:62)
	at sun.reflect.DelegatingMethodAccessorImpl.invoke(DelegatingMethodAccessorImpl.java:43)
	at java.lang.reflect.Method.invoke(Method.java:498)
(70 more lines...)
Collapse Failed BatchJoinerTest testJoinerSpark History
Ambari - HDP 2.6 10 mins
java.lang.RuntimeException: java.util.concurrent.TimeoutException: CDAP Services are not available. Retried for 600 seconds.
	at com.google.common.base.Throwables.propagate(Throwables.java:240)
	at co.cask.cdap.test.IntegrationTestBase.checkSystemServices(IntegrationTestBase.java:204)
	at co.cask.cdap.test.IntegrationTestBase.setUp(IntegrationTestBase.java:99)
	at sun.reflect.NativeMethodAccessorImpl.invoke0(Native Method)
	at sun.reflect.NativeMethodAccessorImpl.invoke(NativeMethodAccessorImpl.java:62)
	at sun.reflect.DelegatingMethodAccessorImpl.invoke(DelegatingMethodAccessorImpl.java:43)
	at java.lang.reflect.Method.invoke(Method.java:498)
(70 more lines...)
Collapse Failed ETLMapReduceTest testTableToTableWithValidations History
Ambari - HDP 2.6 10 mins
java.lang.RuntimeException: java.util.concurrent.TimeoutException: CDAP Services are not available. Retried for 600 seconds.
	at com.google.common.base.Throwables.propagate(Throwables.java:240)
	at co.cask.cdap.test.IntegrationTestBase.checkSystemServices(IntegrationTestBase.java:204)
	at co.cask.cdap.test.IntegrationTestBase.setUp(IntegrationTestBase.java:99)
	at sun.reflect.NativeMethodAccessorImpl.invoke0(Native Method)
	at sun.reflect.NativeMethodAccessorImpl.invoke(NativeMethodAccessorImpl.java:62)
	at sun.reflect.DelegatingMethodAccessorImpl.invoke(DelegatingMethodAccessorImpl.java:43)
	at java.lang.reflect.Method.invoke(Method.java:498)
(70 more lines...)
Collapse Failed ETLMapReduceTest testKVToKV History
Ambari - HDP 2.6 10 mins
java.lang.RuntimeException: java.util.concurrent.TimeoutException: CDAP Services are not available. Retried for 600 seconds.
	at com.google.common.base.Throwables.propagate(Throwables.java:240)
	at co.cask.cdap.test.IntegrationTestBase.checkSystemServices(IntegrationTestBase.java:204)
	at co.cask.cdap.test.IntegrationTestBase.setUp(IntegrationTestBase.java:99)
	at sun.reflect.NativeMethodAccessorImpl.invoke0(Native Method)
	at sun.reflect.NativeMethodAccessorImpl.invoke(NativeMethodAccessorImpl.java:62)
	at sun.reflect.DelegatingMethodAccessorImpl.invoke(DelegatingMethodAccessorImpl.java:43)
	at java.lang.reflect.Method.invoke(Method.java:498)
(70 more lines...)
Collapse Failed ETLMapReduceTest testDAGSchemaChanges History
Ambari - HDP 2.6 10 mins
java.lang.RuntimeException: java.util.concurrent.TimeoutException: CDAP Services are not available. Retried for 600 seconds.
	at com.google.common.base.Throwables.propagate(Throwables.java:240)
	at co.cask.cdap.test.IntegrationTestBase.checkSystemServices(IntegrationTestBase.java:204)
	at co.cask.cdap.test.IntegrationTestBase.setUp(IntegrationTestBase.java:99)
	at sun.reflect.NativeMethodAccessorImpl.invoke0(Native Method)
	at sun.reflect.NativeMethodAccessorImpl.invoke(NativeMethodAccessorImpl.java:62)
	at sun.reflect.DelegatingMethodAccessorImpl.invoke(DelegatingMethodAccessorImpl.java:43)
	at java.lang.reflect.Method.invoke(Method.java:498)
(70 more lines...)
Collapse Failed ETLMapReduceTest testDAGInvalidSchema History
Ambari - HDP 2.6 10 mins
java.lang.RuntimeException: java.util.concurrent.TimeoutException: CDAP Services are not available. Retried for 600 seconds.
	at com.google.common.base.Throwables.propagate(Throwables.java:240)
	at co.cask.cdap.test.IntegrationTestBase.checkSystemServices(IntegrationTestBase.java:204)
	at co.cask.cdap.test.IntegrationTestBase.setUp(IntegrationTestBase.java:99)
	at sun.reflect.NativeMethodAccessorImpl.invoke0(Native Method)
	at sun.reflect.NativeMethodAccessorImpl.invoke(NativeMethodAccessorImpl.java:62)
	at sun.reflect.DelegatingMethodAccessorImpl.invoke(DelegatingMethodAccessorImpl.java:43)
	at java.lang.reflect.Method.invoke(Method.java:498)
(70 more lines...)
Collapse Failed ETLMapReduceTest testDAG History
Ambari - HDP 2.6 10 mins
java.lang.RuntimeException: java.util.concurrent.TimeoutException: CDAP Services are not available. Retried for 600 seconds.
	at com.google.common.base.Throwables.propagate(Throwables.java:240)
	at co.cask.cdap.test.IntegrationTestBase.checkSystemServices(IntegrationTestBase.java:204)
	at co.cask.cdap.test.IntegrationTestBase.setUp(IntegrationTestBase.java:99)
	at sun.reflect.NativeMethodAccessorImpl.invoke0(Native Method)
	at sun.reflect.NativeMethodAccessorImpl.invoke(NativeMethodAccessorImpl.java:62)
	at sun.reflect.DelegatingMethodAccessorImpl.invoke(DelegatingMethodAccessorImpl.java:43)
	at java.lang.reflect.Method.invoke(Method.java:498)
(70 more lines...)
Collapse Failed ExcelInputReaderTest testExcelReaderReprocessFalse History
Ambari - HDP 2.6 10 mins
java.lang.RuntimeException: java.util.concurrent.TimeoutException: CDAP Services are not available. Retried for 600 seconds.
	at com.google.common.base.Throwables.propagate(Throwables.java:240)
	at co.cask.cdap.test.IntegrationTestBase.checkSystemServices(IntegrationTestBase.java:204)
	at co.cask.cdap.test.IntegrationTestBase.setUp(IntegrationTestBase.java:99)
	at sun.reflect.NativeMethodAccessorImpl.invoke0(Native Method)
	at sun.reflect.NativeMethodAccessorImpl.invoke(NativeMethodAccessorImpl.java:62)
	at sun.reflect.DelegatingMethodAccessorImpl.invoke(DelegatingMethodAccessorImpl.java:43)
	at java.lang.reflect.Method.invoke(Method.java:498)
(70 more lines...)
Collapse Failed ExcelInputReaderTest testExcelReader History
Ambari - HDP 2.6 10 mins
java.lang.RuntimeException: java.util.concurrent.TimeoutException: CDAP Services are not available. Retried for 600 seconds.
	at com.google.common.base.Throwables.propagate(Throwables.java:240)
	at co.cask.cdap.test.IntegrationTestBase.checkSystemServices(IntegrationTestBase.java:204)
	at co.cask.cdap.test.IntegrationTestBase.setUp(IntegrationTestBase.java:99)
	at sun.reflect.NativeMethodAccessorImpl.invoke0(Native Method)
	at sun.reflect.NativeMethodAccessorImpl.invoke(NativeMethodAccessorImpl.java:62)
	at sun.reflect.DelegatingMethodAccessorImpl.invoke(DelegatingMethodAccessorImpl.java:43)
	at java.lang.reflect.Method.invoke(Method.java:498)
(70 more lines...)
Collapse Failed HivePluginTest testHivePlugins History
Ambari - HDP 2.6 10 mins
java.lang.RuntimeException: java.util.concurrent.TimeoutException: CDAP Services are not available. Retried for 600 seconds.
	at com.google.common.base.Throwables.propagate(Throwables.java:240)
	at co.cask.cdap.test.IntegrationTestBase.checkSystemServices(IntegrationTestBase.java:204)
	at co.cask.cdap.test.IntegrationTestBase.setUp(IntegrationTestBase.java:99)
	at sun.reflect.GeneratedMethodAccessor1.invoke(Unknown Source)
	at sun.reflect.DelegatingMethodAccessorImpl.invoke(DelegatingMethodAccessorImpl.java:43)
	at java.lang.reflect.Method.invoke(Method.java:498)
	at org.junit.runners.model.FrameworkMethod$1.runReflectiveCall(FrameworkMethod.java:47)
(68 more lines...)
Collapse Failed NormalizeTest testNormalizeWithEmptyAttributeValue History
Ambari - HDP 2.6 10 mins
java.lang.RuntimeException: java.util.concurrent.TimeoutException: CDAP Services are not available. Retried for 600 seconds.
	at com.google.common.base.Throwables.propagate(Throwables.java:240)
	at co.cask.cdap.test.IntegrationTestBase.checkSystemServices(IntegrationTestBase.java:204)
	at co.cask.cdap.test.IntegrationTestBase.setUp(IntegrationTestBase.java:99)
	at sun.reflect.GeneratedMethodAccessor1.invoke(Unknown Source)
	at sun.reflect.DelegatingMethodAccessorImpl.invoke(DelegatingMethodAccessorImpl.java:43)
	at java.lang.reflect.Method.invoke(Method.java:498)
	at org.junit.runners.model.FrameworkMethod$1.runReflectiveCall(FrameworkMethod.java:47)
(70 more lines...)
Collapse Failed NormalizeTest testNormalize History
Ambari - HDP 2.6 10 mins
java.lang.RuntimeException: java.util.concurrent.TimeoutException: CDAP Services are not available. Retried for 600 seconds.
	at com.google.common.base.Throwables.propagate(Throwables.java:240)
	at co.cask.cdap.test.IntegrationTestBase.checkSystemServices(IntegrationTestBase.java:204)
	at co.cask.cdap.test.IntegrationTestBase.setUp(IntegrationTestBase.java:99)
	at sun.reflect.GeneratedMethodAccessor1.invoke(Unknown Source)
	at sun.reflect.DelegatingMethodAccessorImpl.invoke(DelegatingMethodAccessorImpl.java:43)
	at java.lang.reflect.Method.invoke(Method.java:498)
	at org.junit.runners.model.FrameworkMethod$1.runReflectiveCall(FrameworkMethod.java:47)
(70 more lines...)
Collapse Failed RowDenormalizerTest test History
Ambari - HDP 2.6 10 mins
java.lang.RuntimeException: java.util.concurrent.TimeoutException: CDAP Services are not available. Retried for 600 seconds.
	at com.google.common.base.Throwables.propagate(Throwables.java:240)
	at co.cask.cdap.test.IntegrationTestBase.checkSystemServices(IntegrationTestBase.java:204)
	at co.cask.cdap.test.IntegrationTestBase.setUp(IntegrationTestBase.java:99)
	at sun.reflect.GeneratedMethodAccessor1.invoke(Unknown Source)
	at sun.reflect.DelegatingMethodAccessorImpl.invoke(DelegatingMethodAccessorImpl.java:43)
	at java.lang.reflect.Method.invoke(Method.java:498)
	at org.junit.runners.model.FrameworkMethod$1.runReflectiveCall(FrameworkMethod.java:47)
(68 more lines...)
Collapse Failed TPFSSinkSourceTest testMR History
Ambari - HDP 2.6 10 mins
java.lang.RuntimeException: java.util.concurrent.TimeoutException: CDAP Services are not available. Retried for 600 seconds.
	at com.google.common.base.Throwables.propagate(Throwables.java:240)
	at co.cask.cdap.test.IntegrationTestBase.checkSystemServices(IntegrationTestBase.java:204)
	at co.cask.cdap.test.IntegrationTestBase.setUp(IntegrationTestBase.java:99)
	at sun.reflect.GeneratedMethodAccessor1.invoke(Unknown Source)
	at sun.reflect.DelegatingMethodAccessorImpl.invoke(DelegatingMethodAccessorImpl.java:43)
	at java.lang.reflect.Method.invoke(Method.java:498)
	at org.junit.runners.model.FrameworkMethod$1.runReflectiveCall(FrameworkMethod.java:47)
(68 more lines...)
Collapse Failed TPFSSinkSourceTest testSpark History
Ambari - HDP 2.6 10 mins
java.lang.RuntimeException: java.util.concurrent.TimeoutException: CDAP Services are not available. Retried for 600 seconds.
	at com.google.common.base.Throwables.propagate(Throwables.java:240)
	at co.cask.cdap.test.IntegrationTestBase.checkSystemServices(IntegrationTestBase.java:204)
	at co.cask.cdap.test.IntegrationTestBase.setUp(IntegrationTestBase.java:99)
	at sun.reflect.GeneratedMethodAccessor1.invoke(Unknown Source)
	at sun.reflect.DelegatingMethodAccessorImpl.invoke(DelegatingMethodAccessorImpl.java:43)
	at java.lang.reflect.Method.invoke(Method.java:498)
	at org.junit.runners.model.FrameworkMethod$1.runReflectiveCall(FrameworkMethod.java:47)
(68 more lines...)
Collapse Failed ValueMapperTest test History
Ambari - HDP 2.6 10 mins
java.lang.RuntimeException: java.util.concurrent.TimeoutException: CDAP Services are not available. Retried for 600 seconds.
	at com.google.common.base.Throwables.propagate(Throwables.java:240)
	at co.cask.cdap.test.IntegrationTestBase.checkSystemServices(IntegrationTestBase.java:204)
	at co.cask.cdap.test.IntegrationTestBase.setUp(IntegrationTestBase.java:99)
	at sun.reflect.GeneratedMethodAccessor1.invoke(Unknown Source)
	at sun.reflect.DelegatingMethodAccessorImpl.invoke(DelegatingMethodAccessorImpl.java:43)
	at java.lang.reflect.Method.invoke(Method.java:498)
	at org.junit.runners.model.FrameworkMethod$1.runReflectiveCall(FrameworkMethod.java:47)
(68 more lines...)
Collapse Failed XMLReaderTest testInvalidNodePathWithMoveAction History
Ambari - HDP 2.6 10 mins
java.lang.RuntimeException: java.util.concurrent.TimeoutException: CDAP Services are not available. Retried for 600 seconds.
	at com.google.common.base.Throwables.propagate(Throwables.java:240)
	at co.cask.cdap.test.IntegrationTestBase.checkSystemServices(IntegrationTestBase.java:204)
	at co.cask.cdap.test.IntegrationTestBase.setUp(IntegrationTestBase.java:99)
	at sun.reflect.GeneratedMethodAccessor1.invoke(Unknown Source)
	at sun.reflect.DelegatingMethodAccessorImpl.invoke(DelegatingMethodAccessorImpl.java:43)
	at java.lang.reflect.Method.invoke(Method.java:498)
	at org.junit.runners.model.FrameworkMethod$1.runReflectiveCall(FrameworkMethod.java:47)
(68 more lines...)
Collapse Failed XMLReaderTest testPatternWithDeleteAction History
Ambari - HDP 2.6 10 mins
java.lang.RuntimeException: java.util.concurrent.TimeoutException: CDAP Services are not available. Retried for 600 seconds.
	at com.google.common.base.Throwables.propagate(Throwables.java:240)
	at co.cask.cdap.test.IntegrationTestBase.checkSystemServices(IntegrationTestBase.java:204)
	at co.cask.cdap.test.IntegrationTestBase.setUp(IntegrationTestBase.java:99)
	at sun.reflect.GeneratedMethodAccessor1.invoke(Unknown Source)
	at sun.reflect.DelegatingMethodAccessorImpl.invoke(DelegatingMethodAccessorImpl.java:43)
	at java.lang.reflect.Method.invoke(Method.java:498)
	at org.junit.runners.model.FrameworkMethod$1.runReflectiveCall(FrameworkMethod.java:47)
(68 more lines...)
Collapse Failed XMLReaderTest testPreProcessingRequired History
Ambari - HDP 2.6 10 mins
java.lang.RuntimeException: java.util.concurrent.TimeoutException: CDAP Services are not available. Retried for 600 seconds.
	at com.google.common.base.Throwables.propagate(Throwables.java:240)
	at co.cask.cdap.test.IntegrationTestBase.checkSystemServices(IntegrationTestBase.java:204)
	at co.cask.cdap.test.IntegrationTestBase.setUp(IntegrationTestBase.java:99)
	at sun.reflect.GeneratedMethodAccessor1.invoke(Unknown Source)
	at sun.reflect.DelegatingMethodAccessorImpl.invoke(DelegatingMethodAccessorImpl.java:43)
	at java.lang.reflect.Method.invoke(Method.java:498)
	at org.junit.runners.model.FrameworkMethod$1.runReflectiveCall(FrameworkMethod.java:47)
(68 more lines...)
Collapse Failed XMLReaderTest testInvalidPatternWithDeleteAction History
Ambari - HDP 2.6 10 mins
java.lang.RuntimeException: java.util.concurrent.TimeoutException: CDAP Services are not available. Retried for 600 seconds.
	at com.google.common.base.Throwables.propagate(Throwables.java:240)
	at co.cask.cdap.test.IntegrationTestBase.checkSystemServices(IntegrationTestBase.java:204)
	at co.cask.cdap.test.IntegrationTestBase.setUp(IntegrationTestBase.java:99)
	at sun.reflect.GeneratedMethodAccessor1.invoke(Unknown Source)
	at sun.reflect.DelegatingMethodAccessorImpl.invoke(DelegatingMethodAccessorImpl.java:43)
	at java.lang.reflect.Method.invoke(Method.java:498)
	at org.junit.runners.model.FrameworkMethod$1.runReflectiveCall(FrameworkMethod.java:47)
(68 more lines...)
Collapse Failed XMLReaderTest testPreProcessingNotRequired History
Ambari - HDP 2.6 10 mins
java.lang.RuntimeException: java.util.concurrent.TimeoutException: CDAP Services are not available. Retried for 600 seconds.
	at com.google.common.base.Throwables.propagate(Throwables.java:240)
	at co.cask.cdap.test.IntegrationTestBase.checkSystemServices(IntegrationTestBase.java:204)
	at co.cask.cdap.test.IntegrationTestBase.setUp(IntegrationTestBase.java:99)
	at sun.reflect.GeneratedMethodAccessor1.invoke(Unknown Source)
	at sun.reflect.DelegatingMethodAccessorImpl.invoke(DelegatingMethodAccessorImpl.java:43)
	at java.lang.reflect.Method.invoke(Method.java:498)
	at org.junit.runners.model.FrameworkMethod$1.runReflectiveCall(FrameworkMethod.java:47)
(68 more lines...)
Collapse Failed DataStreamsTest testDataStreams History
Ambari - HDP 2.6 10 mins
java.lang.RuntimeException: java.util.concurrent.TimeoutException: CDAP Services are not available. Retried for 600 seconds.
	at com.google.common.base.Throwables.propagate(Throwables.java:240)
	at co.cask.cdap.test.IntegrationTestBase.checkSystemServices(IntegrationTestBase.java:204)
	at co.cask.cdap.test.IntegrationTestBase.setUp(IntegrationTestBase.java:99)
	at sun.reflect.NativeMethodAccessorImpl.invoke0(Native Method)
	at sun.reflect.NativeMethodAccessorImpl.invoke(NativeMethodAccessorImpl.java:62)
	at sun.reflect.DelegatingMethodAccessorImpl.invoke(DelegatingMethodAccessorImpl.java:43)
	at java.lang.reflect.Method.invoke(Method.java:498)
(70 more lines...)
Collapse Failed WranglerServiceTest test History
Ambari - HDP 2.6 10 mins
java.lang.RuntimeException: java.util.concurrent.TimeoutException: CDAP Services are not available. Retried for 600 seconds.
	at com.google.common.base.Throwables.propagate(Throwables.java:240)
	at co.cask.cdap.test.IntegrationTestBase.checkSystemServices(IntegrationTestBase.java:204)
	at co.cask.cdap.test.IntegrationTestBase.setUp(IntegrationTestBase.java:99)
	at sun.reflect.GeneratedMethodAccessor1.invoke(Unknown Source)
	at sun.reflect.DelegatingMethodAccessorImpl.invoke(DelegatingMethodAccessorImpl.java:43)
	at java.lang.reflect.Method.invoke(Method.java:498)
	at org.junit.runners.model.FrameworkMethod$1.runReflectiveCall(FrameworkMethod.java:47)
(68 more lines...)
Collapse Failed WranglerTest testWranglerMR History
Ambari - HDP 2.6 10 mins
java.lang.RuntimeException: java.util.concurrent.TimeoutException: CDAP Services are not available. Retried for 600 seconds.
	at com.google.common.base.Throwables.propagate(Throwables.java:240)
	at co.cask.cdap.test.IntegrationTestBase.checkSystemServices(IntegrationTestBase.java:204)
	at co.cask.cdap.test.IntegrationTestBase.setUp(IntegrationTestBase.java:99)
	at sun.reflect.GeneratedMethodAccessor1.invoke(Unknown Source)
	at sun.reflect.DelegatingMethodAccessorImpl.invoke(DelegatingMethodAccessorImpl.java:43)
	at java.lang.reflect.Method.invoke(Method.java:498)
	at org.junit.runners.model.FrameworkMethod$1.runReflectiveCall(FrameworkMethod.java:47)
(68 more lines...)
Collapse Failed WranglerTest testWranglerSpark History
Ambari - HDP 2.6 10 mins
java.lang.RuntimeException: java.util.concurrent.TimeoutException: CDAP Services are not available. Retried for 600 seconds.
	at com.google.common.base.Throwables.propagate(Throwables.java:240)
	at co.cask.cdap.test.IntegrationTestBase.checkSystemServices(IntegrationTestBase.java:204)
	at co.cask.cdap.test.IntegrationTestBase.setUp(IntegrationTestBase.java:99)
	at sun.reflect.GeneratedMethodAccessor1.invoke(Unknown Source)
	at sun.reflect.DelegatingMethodAccessorImpl.invoke(DelegatingMethodAccessorImpl.java:43)
	at java.lang.reflect.Method.invoke(Method.java:498)
	at org.junit.runners.model.FrameworkMethod$1.runReflectiveCall(FrameworkMethod.java:47)
(68 more lines...)
Collapse Failed PermissionTest test History
Ambari - HDP 2.6 10 mins
java.lang.RuntimeException: java.util.concurrent.TimeoutException: CDAP Services are not available. Retried for 600 seconds.
	at com.google.common.base.Throwables.propagate(Throwables.java:240)
	at co.cask.cdap.test.IntegrationTestBase.checkSystemServices(IntegrationTestBase.java:204)
	at co.cask.cdap.test.IntegrationTestBase.setUp(IntegrationTestBase.java:99)
	at sun.reflect.GeneratedMethodAccessor1.invoke(Unknown Source)
	at sun.reflect.DelegatingMethodAccessorImpl.invoke(DelegatingMethodAccessorImpl.java:43)
	at java.lang.reflect.Method.invoke(Method.java:498)
	at org.junit.runners.model.FrameworkMethod$1.runReflectiveCall(FrameworkMethod.java:47)
(68 more lines...)
Collapse Failed ReadlessIncrementTest testReadlessIncrementsInMapReduce History
Ambari - HDP 2.6 10 mins
java.lang.RuntimeException: java.util.concurrent.TimeoutException: CDAP Services are not available. Retried for 600 seconds.
	at com.google.common.base.Throwables.propagate(Throwables.java:240)
	at co.cask.cdap.test.IntegrationTestBase.checkSystemServices(IntegrationTestBase.java:204)
	at co.cask.cdap.test.IntegrationTestBase.setUp(IntegrationTestBase.java:99)
	at sun.reflect.GeneratedMethodAccessor1.invoke(Unknown Source)
	at sun.reflect.DelegatingMethodAccessorImpl.invoke(DelegatingMethodAccessorImpl.java:43)
	at java.lang.reflect.Method.invoke(Method.java:498)
	at org.junit.runners.model.FrameworkMethod$1.runReflectiveCall(FrameworkMethod.java:47)
(68 more lines...)
Collapse Failed HangingWorkerTest testRestart History
Ambari - HDP 2.6 10 mins
java.lang.RuntimeException: java.util.concurrent.TimeoutException: CDAP Services are not available. Retried for 600 seconds.
	at com.google.common.base.Throwables.propagate(Throwables.java:240)
	at co.cask.cdap.test.IntegrationTestBase.checkSystemServices(IntegrationTestBase.java:204)
	at co.cask.cdap.test.IntegrationTestBase.setUp(IntegrationTestBase.java:99)
	at sun.reflect.GeneratedMethodAccessor1.invoke(Unknown Source)
	at sun.reflect.DelegatingMethodAccessorImpl.invoke(DelegatingMethodAccessorImpl.java:43)
	at java.lang.reflect.Method.invoke(Method.java:498)
	at org.junit.runners.model.FrameworkMethod$1.runReflectiveCall(FrameworkMethod.java:47)
(68 more lines...)
Collapse Failed ServiceWorkerTest test History
Ambari - HDP 2.6 10 mins
java.lang.RuntimeException: java.util.concurrent.TimeoutException: CDAP Services are not available. Retried for 600 seconds.
	at com.google.common.base.Throwables.propagate(Throwables.java:240)
	at co.cask.cdap.test.IntegrationTestBase.checkSystemServices(IntegrationTestBase.java:204)
	at co.cask.cdap.test.IntegrationTestBase.setUp(IntegrationTestBase.java:99)
	at sun.reflect.GeneratedMethodAccessor1.invoke(Unknown Source)
	at sun.reflect.DelegatingMethodAccessorImpl.invoke(DelegatingMethodAccessorImpl.java:43)
	at java.lang.reflect.Method.invoke(Method.java:498)
	at org.junit.runners.model.FrameworkMethod$1.runReflectiveCall(FrameworkMethod.java:47)
(68 more lines...)
Collapse Failed ApplicationTest test History
Ambari - HDP 2.6 10 mins
java.lang.RuntimeException: java.util.concurrent.TimeoutException: CDAP Services are not available. Retried for 600 seconds.
	at com.google.common.base.Throwables.propagate(Throwables.java:240)
	at co.cask.cdap.test.IntegrationTestBase.checkSystemServices(IntegrationTestBase.java:204)
	at co.cask.cdap.test.IntegrationTestBase.setUp(IntegrationTestBase.java:99)
	at sun.reflect.NativeMethodAccessorImpl.invoke0(Native Method)
	at sun.reflect.NativeMethodAccessorImpl.invoke(NativeMethodAccessorImpl.java:62)
	at sun.reflect.DelegatingMethodAccessorImpl.invoke(DelegatingMethodAccessorImpl.java:43)
	at java.lang.reflect.Method.invoke(Method.java:498)
(70 more lines...)
Collapse Failed ApplicationVersionTest testAppVersionsCreationUpdateDeletion History
Ambari - HDP 2.6 10 mins
java.lang.RuntimeException: java.util.concurrent.TimeoutException: CDAP Services are not available. Retried for 600 seconds.
	at com.google.common.base.Throwables.propagate(Throwables.java:240)
	at co.cask.cdap.test.IntegrationTestBase.checkSystemServices(IntegrationTestBase.java:204)
	at co.cask.cdap.test.IntegrationTestBase.setUp(IntegrationTestBase.java:99)
	at sun.reflect.NativeMethodAccessorImpl.invoke0(Native Method)
	at sun.reflect.NativeMethodAccessorImpl.invoke(NativeMethodAccessorImpl.java:62)
	at sun.reflect.DelegatingMethodAccessorImpl.invoke(DelegatingMethodAccessorImpl.java:43)
	at java.lang.reflect.Method.invoke(Method.java:498)
(70 more lines...)
Collapse Failed DatasetTest test History
Ambari - HDP 2.6 10 mins
java.lang.RuntimeException: java.util.concurrent.TimeoutException: CDAP Services are not available. Retried for 600 seconds.
	at com.google.common.base.Throwables.propagate(Throwables.java:240)
	at co.cask.cdap.test.IntegrationTestBase.checkSystemServices(IntegrationTestBase.java:204)
	at co.cask.cdap.test.IntegrationTestBase.setUp(IntegrationTestBase.java:99)
	at sun.reflect.NativeMethodAccessorImpl.invoke0(Native Method)
	at sun.reflect.NativeMethodAccessorImpl.invoke(NativeMethodAccessorImpl.java:62)
	at sun.reflect.DelegatingMethodAccessorImpl.invoke(DelegatingMethodAccessorImpl.java:43)
	at java.lang.reflect.Method.invoke(Method.java:498)
(70 more lines...)
Collapse Failed NamespaceTest testNamespaces History
Ambari - HDP 2.6 10 mins
java.lang.RuntimeException: java.util.concurrent.TimeoutException: CDAP Services are not available. Retried for 600 seconds.
	at com.google.common.base.Throwables.propagate(Throwables.java:240)
	at co.cask.cdap.test.IntegrationTestBase.checkSystemServices(IntegrationTestBase.java:204)
	at co.cask.cdap.test.IntegrationTestBase.setUp(IntegrationTestBase.java:99)
	at sun.reflect.GeneratedMethodAccessor1.invoke(Unknown Source)
	at sun.reflect.DelegatingMethodAccessorImpl.invoke(DelegatingMethodAccessorImpl.java:43)
	at java.lang.reflect.Method.invoke(Method.java:498)
	at org.junit.runners.model.FrameworkMethod$1.runReflectiveCall(FrameworkMethod.java:47)
(68 more lines...)
Collapse Failed NamespacedStreamTest testNamespacedStreams History
Ambari - HDP 2.6 10 mins
java.lang.RuntimeException: java.util.concurrent.TimeoutException: CDAP Services are not available. Retried for 600 seconds.
	at com.google.common.base.Throwables.propagate(Throwables.java:240)
	at co.cask.cdap.test.IntegrationTestBase.checkSystemServices(IntegrationTestBase.java:204)
	at co.cask.cdap.test.IntegrationTestBase.setUp(IntegrationTestBase.java:99)
	at sun.reflect.GeneratedMethodAccessor1.invoke(Unknown Source)
	at sun.reflect.DelegatingMethodAccessorImpl.invoke(DelegatingMethodAccessorImpl.java:43)
	at java.lang.reflect.Method.invoke(Method.java:498)
	at org.junit.runners.model.FrameworkMethod$1.runReflectiveCall(FrameworkMethod.java:47)
(68 more lines...)
Collapse Failed StreamTest testNonexistentStreams History
Ambari - HDP 2.6 10 mins
java.lang.RuntimeException: java.util.concurrent.TimeoutException: CDAP Services are not available. Retried for 600 seconds.
	at com.google.common.base.Throwables.propagate(Throwables.java:240)
	at co.cask.cdap.test.IntegrationTestBase.checkSystemServices(IntegrationTestBase.java:204)
	at co.cask.cdap.test.IntegrationTestBase.setUp(IntegrationTestBase.java:99)
	at sun.reflect.GeneratedMethodAccessor1.invoke(Unknown Source)
	at sun.reflect.DelegatingMethodAccessorImpl.invoke(DelegatingMethodAccessorImpl.java:43)
	at java.lang.reflect.Method.invoke(Method.java:498)
	at org.junit.runners.model.FrameworkMethod$1.runReflectiveCall(FrameworkMethod.java:47)
(68 more lines...)
Collapse Failed StreamTest testStreams History
Ambari - HDP 2.6 10 mins
java.lang.RuntimeException: java.util.concurrent.TimeoutException: CDAP Services are not available. Retried for 600 seconds.
	at com.google.common.base.Throwables.propagate(Throwables.java:240)
	at co.cask.cdap.test.IntegrationTestBase.checkSystemServices(IntegrationTestBase.java:204)
	at co.cask.cdap.test.IntegrationTestBase.setUp(IntegrationTestBase.java:99)
	at sun.reflect.GeneratedMethodAccessor1.invoke(Unknown Source)
	at sun.reflect.DelegatingMethodAccessorImpl.invoke(DelegatingMethodAccessorImpl.java:43)
	at java.lang.reflect.Method.invoke(Method.java:498)
	at org.junit.runners.model.FrameworkMethod$1.runReflectiveCall(FrameworkMethod.java:47)
(68 more lines...)
Collapse Failed ExploreTest test History
Ambari - HDP 2.6 10 mins
java.lang.RuntimeException: java.util.concurrent.TimeoutException: CDAP Services are not available. Retried for 600 seconds.
	at com.google.common.base.Throwables.propagate(Throwables.java:240)
	at co.cask.cdap.test.IntegrationTestBase.checkSystemServices(IntegrationTestBase.java:204)
	at co.cask.cdap.test.IntegrationTestBase.setUp(IntegrationTestBase.java:99)
	at sun.reflect.GeneratedMethodAccessor1.invoke(Unknown Source)
	at sun.reflect.DelegatingMethodAccessorImpl.invoke(DelegatingMethodAccessorImpl.java:43)
	at java.lang.reflect.Method.invoke(Method.java:498)
	at org.junit.runners.model.FrameworkMethod$1.runReflectiveCall(FrameworkMethod.java:47)
(68 more lines...)
Collapse Failed ExploreTest testSubqueryInWhereClause History
Ambari - HDP 2.6 10 mins
java.lang.RuntimeException: java.util.concurrent.TimeoutException: CDAP Services are not available. Retried for 600 seconds.
	at com.google.common.base.Throwables.propagate(Throwables.java:240)
	at co.cask.cdap.test.IntegrationTestBase.checkSystemServices(IntegrationTestBase.java:204)
	at co.cask.cdap.test.IntegrationTestBase.setUp(IntegrationTestBase.java:99)
	at sun.reflect.GeneratedMethodAccessor1.invoke(Unknown Source)
	at sun.reflect.DelegatingMethodAccessorImpl.invoke(DelegatingMethodAccessorImpl.java:43)
	at java.lang.reflect.Method.invoke(Method.java:498)
	at org.junit.runners.model.FrameworkMethod$1.runReflectiveCall(FrameworkMethod.java:47)
(68 more lines...)
Collapse Failed FileSetTest test History
Ambari - HDP 2.6 10 mins
java.lang.RuntimeException: java.util.concurrent.TimeoutException: CDAP Services are not available. Retried for 600 seconds.
	at com.google.common.base.Throwables.propagate(Throwables.java:240)
	at co.cask.cdap.test.IntegrationTestBase.checkSystemServices(IntegrationTestBase.java:204)
	at co.cask.cdap.test.IntegrationTestBase.setUp(IntegrationTestBase.java:99)
	at sun.reflect.GeneratedMethodAccessor1.invoke(Unknown Source)
	at sun.reflect.DelegatingMethodAccessorImpl.invoke(DelegatingMethodAccessorImpl.java:43)
	at java.lang.reflect.Method.invoke(Method.java:498)
	at org.junit.runners.model.FrameworkMethod$1.runReflectiveCall(FrameworkMethod.java:47)
(68 more lines...)
Collapse Failed PartitionCorrectorTest test History
Ambari - HDP 2.6 10 mins
java.lang.RuntimeException: java.util.concurrent.TimeoutException: CDAP Services are not available. Retried for 600 seconds.
	at com.google.common.base.Throwables.propagate(Throwables.java:240)
	at co.cask.cdap.test.IntegrationTestBase.checkSystemServices(IntegrationTestBase.java:204)
	at co.cask.cdap.test.IntegrationTestBase.setUp(IntegrationTestBase.java:99)
	at sun.reflect.GeneratedMethodAccessor1.invoke(Unknown Source)
	at sun.reflect.DelegatingMethodAccessorImpl.invoke(DelegatingMethodAccessorImpl.java:43)
	at java.lang.reflect.Method.invoke(Method.java:498)
	at org.junit.runners.model.FrameworkMethod$1.runReflectiveCall(FrameworkMethod.java:47)
(68 more lines...)
Collapse Failed PartitionedFileSetUpdateTest test History
Ambari - HDP 2.6 10 mins
java.lang.RuntimeException: java.util.concurrent.TimeoutException: CDAP Services are not available. Retried for 600 seconds.
	at com.google.common.base.Throwables.propagate(Throwables.java:240)
	at co.cask.cdap.test.IntegrationTestBase.checkSystemServices(IntegrationTestBase.java:204)
	at co.cask.cdap.test.IntegrationTestBase.setUp(IntegrationTestBase.java:99)
	at sun.reflect.GeneratedMethodAccessor1.invoke(Unknown Source)
	at sun.reflect.DelegatingMethodAccessorImpl.invoke(DelegatingMethodAccessorImpl.java:43)
	at java.lang.reflect.Method.invoke(Method.java:498)
	at org.junit.runners.model.FrameworkMethod$1.runReflectiveCall(FrameworkMethod.java:47)
(68 more lines...)
Collapse Failed PurchaseMetadataTest testSearchUsingSystemMetadata History
Ambari - HDP 2.6 10 mins
java.lang.RuntimeException: java.util.concurrent.TimeoutException: CDAP Services are not available. Retried for 600 seconds.
	at com.google.common.base.Throwables.propagate(Throwables.java:240)
	at co.cask.cdap.test.IntegrationTestBase.checkSystemServices(IntegrationTestBase.java:204)
	at co.cask.cdap.test.IntegrationTestBase.setUp(IntegrationTestBase.java:99)
	at sun.reflect.GeneratedMethodAccessor1.invoke(Unknown Source)
	at sun.reflect.DelegatingMethodAccessorImpl.invoke(DelegatingMethodAccessorImpl.java:43)
	at java.lang.reflect.Method.invoke(Method.java:498)
	at org.junit.runners.model.FrameworkMethod$1.runReflectiveCall(FrameworkMethod.java:47)
(68 more lines...)
Collapse Failed PurchaseMetadataTest testLineage History
Ambari - HDP 2.6 10 mins
java.lang.RuntimeException: java.util.concurrent.TimeoutException: CDAP Services are not available. Retried for 600 seconds.
	at com.google.common.base.Throwables.propagate(Throwables.java:240)
	at co.cask.cdap.test.IntegrationTestBase.checkSystemServices(IntegrationTestBase.java:204)
	at co.cask.cdap.test.IntegrationTestBase.setUp(IntegrationTestBase.java:99)
	at sun.reflect.GeneratedMethodAccessor1.invoke(Unknown Source)
	at sun.reflect.DelegatingMethodAccessorImpl.invoke(DelegatingMethodAccessorImpl.java:43)
	at java.lang.reflect.Method.invoke(Method.java:498)
	at org.junit.runners.model.FrameworkMethod$1.runReflectiveCall(FrameworkMethod.java:47)
(68 more lines...)
Collapse Failed PurchaseAudiTest test History
Ambari - HDP 2.6 10 mins
java.lang.RuntimeException: java.util.concurrent.TimeoutException: CDAP Services are not available. Retried for 600 seconds.
	at com.google.common.base.Throwables.propagate(Throwables.java:240)
	at co.cask.cdap.test.IntegrationTestBase.checkSystemServices(IntegrationTestBase.java:204)
	at co.cask.cdap.test.IntegrationTestBase.setUp(IntegrationTestBase.java:99)
	at sun.reflect.GeneratedMethodAccessor1.invoke(Unknown Source)
	at sun.reflect.DelegatingMethodAccessorImpl.invoke(DelegatingMethodAccessorImpl.java:43)
	at java.lang.reflect.Method.invoke(Method.java:498)
	at org.junit.runners.model.FrameworkMethod$1.runReflectiveCall(FrameworkMethod.java:47)
(68 more lines...)
Collapse Failed SparkPageRankAppTest test History
Ambari - HDP 2.6 10 mins
java.lang.RuntimeException: java.util.concurrent.TimeoutException: CDAP Services are not available. Retried for 600 seconds.
	at com.google.common.base.Throwables.propagate(Throwables.java:240)
	at co.cask.cdap.test.IntegrationTestBase.checkSystemServices(IntegrationTestBase.java:204)
	at co.cask.cdap.test.IntegrationTestBase.setUp(IntegrationTestBase.java:99)
	at sun.reflect.GeneratedMethodAccessor1.invoke(Unknown Source)
	at sun.reflect.DelegatingMethodAccessorImpl.invoke(DelegatingMethodAccessorImpl.java:43)
	at java.lang.reflect.Method.invoke(Method.java:498)
	at org.junit.runners.model.FrameworkMethod$1.runReflectiveCall(FrameworkMethod.java:47)
(68 more lines...)
Collapse Failed TrackerTest test History
Ambari - HDP 2.6 10 mins
java.lang.RuntimeException: java.util.concurrent.TimeoutException: CDAP Services are not available. Retried for 600 seconds.
	at com.google.common.base.Throwables.propagate(Throwables.java:240)
	at co.cask.cdap.test.IntegrationTestBase.checkSystemServices(IntegrationTestBase.java:204)
	at co.cask.cdap.test.IntegrationTestBase.setUp(IntegrationTestBase.java:99)
	at sun.reflect.GeneratedMethodAccessor1.invoke(Unknown Source)
	at sun.reflect.DelegatingMethodAccessorImpl.invoke(DelegatingMethodAccessorImpl.java:43)
	at java.lang.reflect.Method.invoke(Method.java:498)
	at org.junit.runners.model.FrameworkMethod$1.runReflectiveCall(FrameworkMethod.java:47)
(68 more lines...)
Existing test failures 1
Status Test Failing since View job Duration
java.lang.RuntimeException: java.util.concurrent.TimeoutException: CDAP Services are not available. Retried for 600 seconds.
	at com.google.common.base.Throwables.propagate(Throwables.java:240)
	at co.cask.cdap.test.IntegrationTestBase.checkSystemServices(IntegrationTestBase.java:204)
	at co.cask.cdap.test.IntegrationTestBase.setUp(IntegrationTestBase.java:99)
	at sun.reflect.NativeMethodAccessorImpl.invoke0(Native Method)
	at sun.reflect.NativeMethodAccessorImpl.invoke(NativeMethodAccessorImpl.java:62)
	at sun.reflect.DelegatingMethodAccessorImpl.invoke(DelegatingMethodAccessorImpl.java:43)
	at java.lang.reflect.Method.invoke(Method.java:498)
(70 more lines...)

JIRA issues

IssueDescriptionStatus
Unknown Issue TypeCDAP-13533Could not obtain issue details from JIRA