Build #2

Build: #2 failed Scheduled

Logs

The following logs have been generated by the jobs in this branch.
  • Expand all
  • Collapse all
Job Logs
Collapse Distro Tests - CDH 5.5 Spinup and Test Download or View
09-Nov-2017 03:40:37 [INFO] integration-test-core ............................. SUCCESS [4.635s]
09-Nov-2017 03:40:37 [INFO] integration-test-remote ........................... FAILURE [3:37:42.124s]
09-Nov-2017 03:40:37 [INFO] integration-test-standalone ....................... SKIPPED
09-Nov-2017 03:40:37 [INFO] upgrade-test ...................................... SKIPPED
09-Nov-2017 03:40:37 [INFO] long-running-test ................................. SKIPPED
09-Nov-2017 03:40:37 [INFO] ------------------------------------------------------------------------
09-Nov-2017 03:40:37 [INFO] BUILD FAILURE
09-Nov-2017 03:40:37 [INFO] ------------------------------------------------------------------------
09-Nov-2017 03:40:37 [INFO] Total time: 3:38:15.443s
09-Nov-2017 03:40:37 [INFO] Finished at: Thu Nov 09 03:40:37 UTC 2017
09-Nov-2017 03:40:37 [INFO] Final Memory: 71M/580M
09-Nov-2017 03:40:37 [INFO] ------------------------------------------------------------------------
09-Nov-2017 03:40:37 [ERROR] Failed to execute goal org.apache.maven.plugins:maven-surefire-plugin:2.18.1:test (default-test) on project integration-test-remote: There are test failures.
09-Nov-2017 03:40:37 [ERROR]
09-Nov-2017 03:40:37 [ERROR] Please refer to /var/bamboo/xml-data/build-dir/IT-IIT0-DSTC55/cdap-integration-tests/integration-test-remote/target/surefire-reports for the individual test results.
09-Nov-2017 03:40:37 [ERROR] -> [Help 1]
09-Nov-2017 03:40:37 [ERROR]
09-Nov-2017 03:40:37 [ERROR] To see the full stack trace of the errors, re-run Maven with the -e switch.
09-Nov-2017 03:40:37 [ERROR] Re-run Maven using the -X switch to enable full debug logging.
09-Nov-2017 03:40:37 [ERROR]
09-Nov-2017 03:40:37 [ERROR] For more information about the errors and possible solutions, please read the following articles:
09-Nov-2017 03:40:37 [ERROR] [Help 1] http://cwiki.apache.org/confluence/display/MAVEN/MojoFailureException
09-Nov-2017 03:40:37 [ERROR]
09-Nov-2017 03:40:37 [ERROR] After correcting the problems, you can resume the build with the command
09-Nov-2017 03:40:37 [ERROR]   mvn <goals> -rf :integration-test-remote