Build #574

Tests impersonation using ITN test cases

Build: #574 failed

Job: Distro Tests - CDH 5.5 failed

Stages & jobs

  1. Spinup and Test

test: Test case result

The below summarizes the result of the test "test" in build 574 of Integration Tests - Impersonation - Integration Tests - Distro Tests - CDH 5.5. View test case history
Description
test
Test class
io.cdap.cdap.app.serviceworker.ServiceWorkerTest
Method
test
Duration
1 min
Status
Failed (New Failure)

Error Log

java.lang.RuntimeException: java.io.IOException: Failed on local exception: java.io.IOException: javax.security.sasl.SaslException: GSS initiate failed [Caused by GSSException: No valid credentials provided (Mechanism level: Receive timed out)]; Host Details : local host is: "it-iit-dstc55-574-49939-1000.coopr.sh/10.210.0.61"; destination host is: "it-iit-dstc55-574-49939-1000.coopr.sh":8020; 
	at io.cdap.cdap.client.util.RESTClient.upload(RESTClient.java:160)
	at io.cdap.cdap.client.ApplicationClient.deployApp(ApplicationClient.java:449)
	at io.cdap.cdap.client.ApplicationClient.deploy(ApplicationClient.java:377)
	at io.cdap.cdap.client.ApplicationClient.deploy(ApplicationClient.java:353)
	at io.cdap.cdap.test.IntegrationTestManager.deployApplication(IntegrationTestManager.java:180)
	at io.cdap.cdap.test.AbstractTestManager.deployApplication(AbstractTestManager.java:43)
	at io.cdap.cdap.test.IntegrationTestBase.deployApplication(IntegrationTestBase.java:368)
	at io.cdap.cdap.test.IntegrationTestBase.deployApplication(IntegrationTestBase.java:372)
	at io.cdap.cdap.app.serviceworker.ServiceWorkerTest.test(ServiceWorkerTest.java:66)