Build #64

Tests impersonation using ITN test cases

Build: #64 failed Scheduled with changes by 7 people

Build result summary

Details

Completed
Duration
430 minutes
Labels
None
Agent
bamboo-agent01
Revision
0fda9fb554504d3df96b1a1c1e56cccaa3851b51 0fda9fb554504d3df96b1a1c1e56cccaa3851b51
Total tests
61
Fixed in
#78 (Scheduled with changes by Rohit Sinha <rosinha@google.com>)

Responsible

Code commits

Author Commit Message Commit date
mattwuenschel <mwuenschel@google.com> mattwuenschel <mwuenschel@google.com> 0fda9fb554504d3df96b1a1c1e56cccaa3851b51 0fda9fb554504d3df96b1a1c1e56cccaa3851b51 Merge pull request #923 from caskdata/feature/add-cm-5.15
add cm 5.15
mattwuenschel <mwuenschel@google.com> mattwuenschel <mwuenschel@google.com> 88c3187799fd68aeb139fedfdbc2ba725ee22ffd 88c3187799fd68aeb139fedfdbc2ba725ee22ffd add cdh 5.15
mattwuenschel <mwuenschel@google.com> mattwuenschel <mwuenschel@google.com> abb654050c8c8e190183433b9ecc31d2248b8a7f abb654050c8c8e190183433b9ecc31d2248b8a7f add cm 5.15
Rohit Sinha <rosinha@google.com> Rohit Sinha <rosinha@google.com> 2e7867ddc1a73cb0a6a7f649c71335c47f25c74a 2e7867ddc1a73cb0a6a7f649c71335c47f25c74a Merge pull request #921 from caskdata/feature/update-tracker-version
Update tracker version to latest
Rohit Sinha <rosinha@google.com> Rohit Sinha <rosinha@google.com> 85099e2d0411cce6316d331956a8c11caf24d027 85099e2d0411cce6316d331956a8c11caf24d027 Update tracker version to latest

Configuration changes

Plan configuration has changed since the last successful build. See the plan audit log for more details.

Tests

New test failures 7
Status Test View job Duration
Collapse Failed DatasetTest test History
Distro Tests - CDH 5.5 2 mins
java.lang.AssertionError: expected:<4> but was:<0>
	at org.junit.Assert.fail(Assert.java:88)
	at org.junit.Assert.failNotEquals(Assert.java:743)
	at org.junit.Assert.assertEquals(Assert.java:118)
	at org.junit.Assert.assertEquals(Assert.java:555)
	at org.junit.Assert.assertEquals(Assert.java:542)
	at co.cask.cdap.apps.DatasetTest.test(DatasetTest.java:121)
Collapse Failed PurchaseMetadataTest testLineage History
Distro Tests - CDH 5.5 1 min
java.lang.AssertionError: expected:<LineageRecord{start=1530247112, end=1530257112, relations=[RelationRecord{data='dataset.alice.purchases', program='flows.alice.PurchaseHistory.PurchaseFlow', accesses=[write], runs=[47422095-7b56-11e8-bff3-42010ad20002], components=[collector]}, RelationRecord{data='stream.alice.purchaseStream', program='flows.alice.PurchaseHistory.PurchaseFlow', accesses=[read], runs=[47422095-7b56-11e8-bff3-42010ad20002], components=[reader]}], programs={flows.alice.PurchaseHistory.PurchaseFlow=ProgramRecord{entityId=program:alice.PurchaseHistory.-SNAPSHOT.flow.PurchaseFlow}}, data={dataset.alice.purchases=DataRecord{entityId=dataset:alice.purchases}, stream.alice.purchaseStream=DataRecord{entityId=stream:alice.purchaseStream}}}> but was:<LineageRecord{start=1530247112, end=1530257112, relations=[], programs={}, data={}}>
	at org.junit.Assert.fail(Assert.java:88)
	at org.junit.Assert.failNotEquals(Assert.java:743)
	at org.junit.Assert.assertEquals(Assert.java:118)
	at org.junit.Assert.assertEquals(Assert.java:144)
	at co.cask.cdap.apps.metadata.PurchaseMetadataTest.testLineage(PurchaseMetadataTest.java:138)
Collapse Failed SparkPageRankAppTest test History
Distro Tests - CDH 5.5 5 mins
java.lang.AssertionError: expected:<LineageRecord{start=1530247947, end=1530248348, relations=[RelationRecord{data='dataset.alice.ranks', program='spark.alice.SparkPageRank.PageRankSpark', accesses=[write], runs=[47fad762-7b58-11e8-aa2c-42010ad20002], components=[]}, RelationRecord{data='dataset.alice.rankscount', program='mapreduce.alice.SparkPageRank.RanksCounter', accesses=[write], runs=[874b2f53-7b58-11e8-8e37-42010ad20002], components=[]}, RelationRecord{data='dataset.alice.rankscount', program='services.alice.SparkPageRank.SparkPageRankService', accesses=[read], runs=[3ad6bc71-7b58-11e8-bca3-42010ad20002], components=[]}, RelationRecord{data='dataset.alice.ranks', program='mapreduce.alice.SparkPageRank.RanksCounter', accesses=[read], runs=[874b2f53-7b58-11e8-8e37-42010ad20002], components=[]}, RelationRecord{data='stream.alice.backlinkURLStream', program='spark.alice.SparkPageRank.PageRankSpark', accesses=[read], runs=[47fad762-7b58-11e8-aa2c-42010ad20002], components=[]}, RelationRecord{data='dataset.alice.ranks', program='services.alice.SparkPageRank.SparkPageRankService', accesses=[read], runs=[3ad6bc71-7b58-11e8-bca3-42010ad20002], components=[]}], programs={services.alice.SparkPageRank.SparkPageRankService=ProgramRecord{entityId=program:alice.SparkPageRank.-SNAPSHOT.service.SparkPageRankService}, mapreduce.alice.SparkPageRank.RanksCounter=ProgramRecord{entityId=program:alice.SparkPageRank.-SNAPSHOT.mapreduce.RanksCounter}, spark.alice.SparkPageRank.PageRankSpark=ProgramRecord{entityId=program:alice.SparkPageRank.-SNAPSHOT.spark.PageRankSpark}}, data={dataset.alice.ranks=DataRecord{entityId=dataset:alice.ranks}, dataset.alice.rankscount=DataRecord{entityId=dataset:alice.rankscount}, stream.alice.backlinkURLStream=DataRecord{entityId=stream:alice.backlinkURLStream}}}> but was:<LineageRecord{start=1530247947, end=1530248348, relations=[], programs={}, data={}}>
	at org.junit.Assert.fail(Assert.java:88)
	at org.junit.Assert.failNotEquals(Assert.java:743)
	at org.junit.Assert.assertEquals(Assert.java:118)
	at org.junit.Assert.assertEquals(Assert.java:144)
	at co.cask.cdap.apps.spark.sparkpagerank.SparkPageRankAppTest.testLineage(SparkPageRankAppTest.java:231)
	at co.cask.cdap.apps.spark.sparkpagerank.SparkPageRankAppTest.test(SparkPageRankAppTest.java:208)
Collapse Failed WorkflowTest testKMeans History
Distro Tests - CDH 5.5 7 mins
co.cask.cdap.common.NotFoundException: 'Either the workflow or its run id or the specified key at the specified scope' was not found.
	at co.cask.cdap.client.WorkflowClient.getWorkflowTokenAtNode(WorkflowClient.java:205)
	at co.cask.cdap.test.remote.RemoteWorkflowManager.getTokenAtNode(RemoteWorkflowManager.java:83)
	at co.cask.cdap.apps.workflow.WorkflowTest.testWorkflow(WorkflowTest.java:133)
	at co.cask.cdap.apps.workflow.WorkflowTest.testKMeans(WorkflowTest.java:107)
Collapse Failed WorkflowTest testLDA History
Distro Tests - CDH 5.5 2 mins
co.cask.cdap.common.NotFoundException: 'Either the workflow or its run id or the specified key at the specified scope' was not found.
	at co.cask.cdap.client.WorkflowClient.getWorkflowTokenAtNode(WorkflowClient.java:205)
	at co.cask.cdap.test.remote.RemoteWorkflowManager.getTokenAtNode(RemoteWorkflowManager.java:83)
	at co.cask.cdap.apps.workflow.WorkflowTest.testWorkflow(WorkflowTest.java:133)
	at co.cask.cdap.apps.workflow.WorkflowTest.testWorkflow(WorkflowTest.java:112)
	at co.cask.cdap.apps.workflow.WorkflowTest.testLDA(WorkflowTest.java:92)
Collapse Failed AppImpersonationTest test History
Distro Tests - CDH 5.5 2 secs
java.io.IOException: 500: Checksum failed
	at co.cask.cdap.client.util.RESTClient.execute(RESTClient.java:132)
	at co.cask.cdap.client.util.RESTClient.execute(RESTClient.java:69)
	at co.cask.cdap.client.NamespaceClient.execute(NamespaceClient.java:56)
	at co.cask.cdap.common.namespace.AbstractNamespaceClient.create(AbstractNamespaceClient.java:58)
	at co.cask.cdap.security.AppImpersonationTest.test(AppImpersonationTest.java:71)
Collapse Failed CrossNSAppImpersonationTest testAcrossNamespaces History
Distro Tests - CDH 5.5 2 secs
java.io.IOException: 500: Checksum failed
	at co.cask.cdap.client.util.RESTClient.execute(RESTClient.java:132)
	at co.cask.cdap.client.util.RESTClient.execute(RESTClient.java:69)
	at co.cask.cdap.client.NamespaceClient.execute(NamespaceClient.java:56)
	at co.cask.cdap.common.namespace.AbstractNamespaceClient.create(AbstractNamespaceClient.java:58)
	at co.cask.cdap.security.CrossNSAppImpersonationTest.testAcrossNamespaces(CrossNSAppImpersonationTest.java:94)

JIRA issues

IssueDescriptionStatus
Unknown Issue TypeCDAP-13493Could not obtain issue details from JIRA