Build #368

Tests impersonation using ITN test cases

Build: #368 failed Scheduled

Build result summary

Details

Completed
Duration
256 minutes
Labels
None
Agent
bamboo-agent09
Revision
2e165efdba5d805ae084d4852c78b74ba6a19fe5 2e165efdba5d805ae084d4852c78b74ba6a19fe5
Total tests
47
Failing since
#367 (Scheduled – )
Fixed in
#371 (Scheduled)

Responsible

This build has been failing since #367
No one has taken responsibility

Tests

New test failures 1
Status Test View job Duration
Collapse Failed XMLReaderTest testInvalidPatternWithDeleteAction History
Distro Tests - CDH 5.5 2 mins
java.util.concurrent.ExecutionException: java.lang.RuntimeException: java.io.IOException: 500: Connection refused (Connection refused)
	at io.cdap.cdap.client.util.RESTClient.execute(RESTClient.java:132)
	at io.cdap.cdap.client.util.RESTClient.execute(RESTClient.java:74)
	at io.cdap.cdap.client.ProgramClient.getProgramRuns(ProgramClient.java:478)
	at io.cdap.cdap.test.remote.RemoteApplicationManager.getHistory(RemoteApplicationManager.java:160)
	at io.cdap.cdap.test.AbstractProgramManager.getHistory(AbstractProgramManager.java:150)
	at io.cdap.cdap.test.AbstractProgramManager.lambda$waitForRuns$0(AbstractProgramManager.java:96)
	at io.cdap.cdap.common.utils.Tasks.waitFor(Tasks.java:58)
(6 more lines...)