Build #279

Tests impersonation using ITN test cases

Build: #279 failed Scheduled

Build result summary

Details

Completed
Duration
245 minutes
Labels
None
Agent
bamboo-agent15
Revision
14a0385ad931117f07cf7afa9943901699306494 14a0385ad931117f07cf7afa9943901699306494
Total tests
47
Fixed in
#280 (Scheduled)

Responsible

No one has taken responsibility for this failure

Tests

New test failures 1
Status Test View job Duration
Collapse Failed ETLMapReduceTest testTableToTableWithValidations History
Distro Tests - CDH 5.5 48 secs
java.util.concurrent.ExecutionException: java.lang.RuntimeException: java.net.ConnectException: Connection refused
	at java.net.PlainSocketImpl.socketConnect(Native Method)
	at java.net.AbstractPlainSocketImpl.doConnect(AbstractPlainSocketImpl.java:350)
	at java.net.AbstractPlainSocketImpl.connectToAddress(AbstractPlainSocketImpl.java:206)
	at java.net.AbstractPlainSocketImpl.connect(AbstractPlainSocketImpl.java:188)
	at java.net.SocksSocketImpl.connect(SocksSocketImpl.java:392)
	at java.net.Socket.connect(Socket.java:589)
	at sun.net.NetworkClient.doConnect(NetworkClient.java:175)
(20 more lines...)