Build #43

Build: #43 failed Scheduled with changes by 3 people

Build result summary

Details

Completed
Duration
66 minutes
Labels
None
Agent
bamboo-agent18
Revisions
caskdata/cdap-integration-tests
33ca06a919bc191bb2b52d458ad4b6d7ef17737b 33ca06a919bc191bb2b52d458ad4b6d7ef17737b
caskdata/coopr-internal
106a354d8d9aff7d15e1cf80f1353351fe9742db 106a354d8d9aff7d15e1cf80f1353351fe9742db
Total tests
54
Failing since
#2 (Manual run by Matt Wuenschel)
Fixed in
#56 (Manual run by Ali Anwar)

Responsible

This build has been failing since #2
No one has taken responsibility

Code commits

caskdata/cdap-integration-tests
Author Commit Message Commit date
mattwuenschel <mwuenschel@google.com> mattwuenschel <mwuenschel@google.com> 33ca06a919bc191bb2b52d458ad4b6d7ef17737b 33ca06a919bc191bb2b52d458ad4b6d7ef17737b Merge pull request #947 from caskdata/feature/sdk-version-bump
update CDAP SDK version to 5.1
mattwuenschel <mwuenschel@google.com> mattwuenschel <mwuenschel@google.com> e9c9ade743504dce29f0fe17deca157c9f27a4c8 e9c9ade743504dce29f0fe17deca157c9f27a4c8 update CDAP SDK version to 5.1
caskdata/coopr-internal
Author Commit Message Commit date
dereklwood <derekwood@google.com> dereklwood <derekwood@google.com> 106a354d8d9aff7d15e1cf80f1353351fe9742db 106a354d8d9aff7d15e1cf80f1353351fe9742db Merge pull request #709 from caskdata/feature/update-cdap-auto-sdk-to-sandbox
update cdap_auto::sdk recipe to sandbox
Derek Wood <derekwood@google.com> Derek Wood <derekwood@google.com> 0ebb2068ca662c206d23e49c191c5cdb47ee32d1 0ebb2068ca662c206d23e49c191c5cdb47ee32d1 update cdap_auto::sdk recipe to sandbox

Configuration changes

Plan configuration has changed since the last successful build. See the plan audit log for more details.

Tests

Existing test failures 3
Status Test Failing since View job Duration
java.util.concurrent.TimeoutException: Timeout occurred. Expected true but found false.
	at co.cask.cdap.common.utils.Tasks.waitFor(Tasks.java:70)
	at co.cask.cdap.common.utils.Tasks.waitFor(Tasks.java:91)
	at co.cask.cdap.common.utils.Tasks.waitFor(Tasks.java:130)
	at co.cask.cdap.test.AbstractProgramManager.waitForRuns(AbstractProgramManager.java:81)
	at co.cask.cdap.test.AbstractProgramManager.waitForRun(AbstractProgramManager.java:75)
	at co.cask.cdap.app.etl.batch.BatchJoinerTest.testJoiner(BatchJoinerTest.java:225)
	at co.cask.cdap.app.etl.batch.BatchJoinerTest.testJoinerMR(BatchJoinerTest.java:88)
java.util.concurrent.TimeoutException: Timeout occurred. Expected true but found false.
	at co.cask.cdap.common.utils.Tasks.waitFor(Tasks.java:70)
	at co.cask.cdap.common.utils.Tasks.waitFor(Tasks.java:91)
	at co.cask.cdap.common.utils.Tasks.waitFor(Tasks.java:130)
	at co.cask.cdap.test.AbstractProgramManager.waitForRuns(AbstractProgramManager.java:81)
	at co.cask.cdap.test.AbstractProgramManager.waitForRun(AbstractProgramManager.java:75)
	at co.cask.cdap.apps.spark.sparkpagerank.SparkPageRankAppTest.test(SparkPageRankAppTest.java:141)
java.util.concurrent.TimeoutException: Timeout occurred. Expected true but found false.
	at co.cask.cdap.common.utils.Tasks.waitFor(Tasks.java:70)
	at co.cask.cdap.common.utils.Tasks.waitFor(Tasks.java:91)
	at co.cask.cdap.apps.workflow.WorkflowTest.testWorkflow(WorkflowTest.java:133)
	at co.cask.cdap.apps.workflow.WorkflowTest.testKMeans(WorkflowTest.java:108)