Build #15

Build: #15 failed Manual run by Matt Wuenschel

Stages & jobs

  1. Variables

  2. Spinup and Test

Build result summary

Details

Completed
Duration
56 minutes
Flags
Custom build
Labels
None
Revisions
caskdata/cdap-integration-tests
bb84328597074fc79b4fcf238e1cbe80be8a1cd0 bb84328597074fc79b4fcf238e1cbe80be8a1cd0
caskdata/coopr-internal
878ada126a3b2af910131ee39159ee8d0a8d5a6b 878ada126a3b2af910131ee39159ee8d0a8d5a6b
Total tests
3
Failing since
#1 (Manual run by Shankar Selvam)

Responsible

This build has been failing since #1
No one has taken responsibility

Custom variables

Name Value
cdap.test ReportingSpark2

Tests

New test failures 3
Status Test View job Duration
Collapse Failed ReportGenerationAppTest testGenerateApp History
Spark 2.0 Release 2 1 min
java.io.IOException: 'system:cdap-program-report' was not found.
	at co.cask.cdap.client.util.RESTClient.upload(RESTClient.java:160)
	at co.cask.cdap.client.ApplicationClient.deploy(ApplicationClient.java:410)
	at co.cask.cdap.test.IntegrationTestManager.deployApplication(IntegrationTestManager.java:203)
	at co.cask.cdap.apps.report.ReportGenerationAppTest.testGenerateApp(ReportGenerationAppTest.java:103)
Collapse Failed ReportGenerationAppTest testGenerateApp History
Spark 2.1 Release 2 1 min
java.io.IOException: 500: Internal error while querying for metrics
	at co.cask.cdap.client.util.RESTClient.execute(RESTClient.java:132)
	at co.cask.cdap.client.util.RESTClient.execute(RESTClient.java:74)
	at co.cask.cdap.client.MetricsClient.query(MetricsClient.java:181)
	at co.cask.cdap.client.MetricsClient.query(MetricsClient.java:130)
	at co.cask.cdap.test.AudiTestBase.getMetricValue(AudiTestBase.java:163)
	at co.cask.cdap.apps.report.ReportGenerationAppTest.testGenerateApp(ReportGenerationAppTest.java:97)
Collapse Failed ReportGenerationAppTest testGenerateApp History
Spark 2.2 Release 2 1 min
java.io.IOException: 'system:cdap-program-report' was not found.
	at co.cask.cdap.client.util.RESTClient.upload(RESTClient.java:160)
	at co.cask.cdap.client.ApplicationClient.deploy(ApplicationClient.java:410)
	at co.cask.cdap.test.IntegrationTestManager.deployApplication(IntegrationTestManager.java:203)
	at co.cask.cdap.apps.report.ReportGenerationAppTest.testGenerateApp(ReportGenerationAppTest.java:103)