Build #593

Build: #593 failed

Job: Spark 2.2 Release 2 failed

Stages & jobs

  1. Variables

  2. Spinup and Test

Job result summary

Completed
Duration
258 minutes
Agent
bamboo-agent02
Revisions
caskdata/cdap-integration-tests
0b7ed9478d8767c981b843acc196ef6713defe19 0b7ed9478d8767c981b843acc196ef6713defe19
caskdata/coopr-internal
8c2797da17295a6737c5c746943af521cf6bb43f 8c2797da17295a6737c5c746943af521cf6bb43f
Total tests
45
Failing since
#16 (Scheduled – )

Tests

  • 45 tests in total
  • 2 tests failed
  • 43 tests were fixed
  • 209 minutes taken in total.
Existing test failures 2
Status Test Failing since Duration
java.net.ConnectException: Connection refused
	at java.net.PlainSocketImpl.socketConnect(Native Method)
	at java.net.AbstractPlainSocketImpl.doConnect(AbstractPlainSocketImpl.java:350)
	at java.net.AbstractPlainSocketImpl.connectToAddress(AbstractPlainSocketImpl.java:206)
	at java.net.AbstractPlainSocketImpl.connect(AbstractPlainSocketImpl.java:188)
	at java.net.SocksSocketImpl.connect(SocksSocketImpl.java:392)
	at java.net.Socket.connect(Socket.java:589)
	at sun.net.NetworkClient.doConnect(NetworkClient.java:175)
(14 more lines...)
java.lang.RuntimeException: java.io.IOException: Service 'dataset.service' is not available. Please wait until it is up and running.
	at io.cdap.cdap.client.util.RESTClient.upload(RESTClient.java:160)
	at io.cdap.cdap.client.ApplicationClient.deployApp(ApplicationClient.java:449)
	at io.cdap.cdap.client.ApplicationClient.deploy(ApplicationClient.java:377)
	at io.cdap.cdap.client.ApplicationClient.deploy(ApplicationClient.java:353)
	at io.cdap.cdap.test.IntegrationTestManager.deployApplication(IntegrationTestManager.java:180)
	at io.cdap.cdap.test.AbstractTestManager.deployApplication(AbstractTestManager.java:43)
	at io.cdap.cdap.test.IntegrationTestBase.deployApplication(IntegrationTestBase.java:368)
(2 more lines...)
Fixed tests 43
Status Test Failing since Duration
Successful KVTableWithProjectionTest testKVTableWithProjection History
Failing since build #592 (Scheduled) 4 mins
Successful TPFSAvroSinkSourceTest testTPFSWithProjection History
Failing since build #592 (Scheduled) 8 mins
Successful BatchAggregatorTest test History
Failing since build #592 (Scheduled) 11 mins
Successful BatchCubeSinkTest test History
Failing since build #592 (Scheduled) 5 mins
Successful BatchJoinerTest testJoinerMR History
Failing since build #592 (Scheduled) 10 mins
Successful BatchJoinerTest testJoinerSpark History
Failing since build #592 (Scheduled) 7 mins
Successful ETLMapReduceTest testDAG History
Failing since build #592 (Scheduled) 4 mins
Successful ETLMapReduceTest testDAGInvalidSchema History
Failing since build #592 (Scheduled) 3 secs
Successful ETLMapReduceTest testDAGSchemaChanges History
Failing since build #592 (Scheduled) 4 mins
Successful ETLMapReduceTest testKVToKV History
Failing since build #592 (Scheduled) 5 mins
Successful ExcelInputReaderTest testExcelReader History
Failing since build #592 (Scheduled) 4 mins
Successful ExcelInputReaderTest testExcelReaderReprocessFalse History
Failing since build #592 (Scheduled) 5 mins
Successful NormalizeTest testNormalize History
Failing since build #592 (Scheduled) 4 mins
Successful NormalizeTest testNormalizeWithEmptyAttributeValue History
Failing since build #592 (Scheduled) 5 mins
Successful RowDenormalizerTest test History
Failing since build #592 (Scheduled) 5 mins
Successful TPFSParquetSinkSourceTest testMR History
Failing since build #592 (Scheduled) 8 mins
Successful TPFSParquetSinkSourceTest testSpark History
Failing since build #592 (Scheduled) 6 mins
Successful ValueMapperTest test History
Failing since build #592 (Scheduled) 6 mins
Successful XMLReaderTest testInvalidNodePathWithMoveAction History
Failing since build #592 (Scheduled) 6 mins
Successful XMLReaderTest testInvalidPatternWithDeleteAction History
Failing since build #592 (Scheduled) 5 mins
Successful XMLReaderTest testPatternWithDeleteAction History
Failing since build #592 (Scheduled) 5 mins
Successful XMLReaderTest testPreProcessingNotRequired History
Failing since build #592 (Scheduled) 6 mins
Successful XMLReaderTest testPreProcessingRequired History
Failing since build #592 (Scheduled) 5 mins
Successful DataStreamsTest testDataStreams History
Failing since build #592 (Scheduled) 4 mins
Successful WranglerServiceTest test History
Failing since build #592 (Scheduled) 1 min
Successful WranglerTest testWranglerMR History
Failing since build #592 (Scheduled) 5 mins
Successful WranglerTest testWranglerSpark History
Failing since build #592 (Scheduled) 4 mins
Successful PermissionTest test History
Failing since build #592 (Scheduled) 15 mins
Successful ReadlessIncrementTest testReadlessIncrementsInMapReduce History
Failing since build #592 (Scheduled) 3 mins
Successful HangingWorkerTest testRestart History
Failing since build #592 (Scheduled) 3 mins
Successful ServiceWorkerTest test History
Failing since build #592 (Scheduled) 2 mins
Successful NamespaceTest testNamespaces History
Failing since build #592 (Scheduled) 5 secs
Successful DatasetTest test History
Failing since build #592 (Scheduled) 2 mins
Successful FileSetTest test History
Failing since build #592 (Scheduled) 4 mins
Successful PartitionCorrectorTest test History
Failing since build #592 (Scheduled) 5 mins
Successful PartitionedFileSetUpdateTest test History
Failing since build #592 (Scheduled) 2 mins
Successful ProgramMetadataTest testSearchUsingSystemMetadata History
Failing since build #592 (Scheduled) 26 secs
Successful ProgramMetadataTest testWithLineage History
Failing since build #592 (Scheduled) 3 mins
Successful WorkflowTest test History
Failing since build #592 (Scheduled) 3 mins
Successful OperationalStatsTest testCDAPStats History
Failing since build #592 (Scheduled) 1 sec
Successful RemoteCubeTest test History
Failing since build #592 (Scheduled) 1 min
Successful RemoteKeyValueTest test History
Failing since build #592 (Scheduled) 1 min
Successful RemoteTableTest test History
Failing since build #592 (Scheduled) 1 min

Error summary

The build generated some errors. See the full build log for more details.

Warning: Permanently added '10.210.0.45' (RSA) to the list of known hosts.
Warning: Permanently added '10.210.0.45' (RSA) to the list of known hosts.
Warning: Permanently added '10.210.0.45' (RSA) to the list of known hosts.
Warning: Permanently added '10.210.0.45' (RSA) to the list of known hosts.
Warning: Permanently added '10.210.0.45' (RSA) to the list of known hosts.
Warning: Permanently added '10.210.0.45' (RSA) to the list of known hosts.
Warning: Permanently added '10.210.0.45' (RSA) to the list of known hosts.
Warning: Permanently added '10.210.0.45' (RSA) to the list of known hosts.
Warning: Permanently added '10.210.0.45' (RSA) to the list of known hosts.
Warning: Permanently added '10.210.0.45' (RSA) to the list of known hosts.
Warning: Permanently added '10.210.0.45' (RSA) to the list of known hosts.
Warning: Permanently added '10.210.0.45' (RSA) to the list of known hosts.
Warning: Permanently added '10.210.0.45' (RSA) to the list of known hosts.
Warning: Permanently added '10.210.0.45' (RSA) to the list of known hosts.
Warning: Permanently added '10.210.0.45' (RSA) to the list of known hosts.
Warning: Permanently added '10.210.0.45' (RSA) to the list of known hosts.
Java HotSpot(TM) 64-Bit Server VM warning: ignoring option MaxPermSize=128m; support was removed in 8.0
Warning:  org.apache.xerces.jaxp.SAXParserImpl$JAXPSAXParser: Property 'http://www.oracle.com/xml/jaxp/properties/entityExpansionLimit' is not recognized.
Compiler warnings:
  WARNING:  'org.apache.xerces.jaxp.SAXParserImpl: Property 'http://javax.xml.XMLConstants/property/accessExternalDTD' is not recognized.'
Warning:  org.apache.xerces.parsers.SAXParser: Feature 'http://javax.xml.XMLConstants/feature/secure-processing' is not recognized.
Warning:  org.apache.xerces.parsers.SAXParser: Property 'http://javax.xml.XMLConstants/property/accessExternalDTD' is not recognized.
Warning:  org.apache.xerces.parsers.SAXParser: Property 'http://www.oracle.com/xml/jaxp/properties/entityExpansionLimit' is not recognized.
Warning:  org.apache.xerces.jaxp.SAXParserImpl$JAXPSAXParser: Property 'http://www.oracle.com/xml/jaxp/properties/entityExpansionLimit' is not recognized.
Compiler warnings:
  WARNING:  'org.apache.xerces.jaxp.SAXParserImpl: Property 'http://javax.xml.XMLConstants/property/accessExternalDTD' is not recognized.'
Warning:  org.apache.xerces.parsers.SAXParser: Feature 'http://javax.xml.XMLConstants/feature/secure-processing' is not recognized.
Warning:  org.apache.xerces.parsers.SAXParser: Property 'http://javax.xml.XMLConstants/property/accessExternalDTD' is not recognized.
Warning:  org.apache.xerces.parsers.SAXParser: Property 'http://www.oracle.com/xml/jaxp/properties/entityExpansionLimit' is not recognized.
Warning:  org.apache.xerces.jaxp.SAXParserImpl$JAXPSAXParser: Property 'http://www.oracle.com/xml/jaxp/properties/entityExpansionLimit' is not recognized.
Compiler warnings:
  WARNING:  'org.apache.xerces.jaxp.SAXParserImpl: Property 'http://javax.xml.XMLConstants/property/accessExternalDTD' is not recognized.'
Warning:  org.apache.xerces.parsers.SAXParser: Feature 'http://javax.xml.XMLConstants/feature/secure-processing' is not recognized.
Warning:  org.apache.xerces.parsers.SAXParser: Property 'http://javax.xml.XMLConstants/property/accessExternalDTD' is not recognized.
Warning:  org.apache.xerces.parsers.SAXParser: Property 'http://www.oracle.com/xml/jaxp/properties/entityExpansionLimit' is not recognized.
SLF4J: Class path contains multiple SLF4J bindings.
SLF4J: Found binding in [jar:file:/home/bamboo/.m2/repository/io/cdap/cdap/cdap-cli/6.2.0-SNAPSHOT/cdap-cli-6.2.0-SNAPSHOT.jar!/org/slf4j/impl/StaticLoggerBinder.class]
SLF4J: Found binding in [jar:file:/home/bamboo/.m2/repository/io/cdap/cdap/cdap-explore-jdbc/6.2.0-SNAPSHOT/cdap-explore-jdbc-6.2.0-SNAPSHOT.jar!/org/slf4j/impl/StaticLoggerBinder.class]
SLF4J: Found binding in [jar:file:/home/bamboo/.m2/repository/ch/qos/logback/logback-classic/1.0.9/logback-classic-1.0.9.jar!/org/slf4j/impl/StaticLoggerBinder.class]
SLF4J: See http://www.slf4j.org/codes.html#multiple_bindings for an explanation.
SLF4J: Actual binding is of type [ch.qos.logback.classic.util.ContextSelectorStaticBinder]