Build #16

Build: #16 failed

Job: Spark 2.1 Release 1 failed

Job result summary

Completed
Duration
275 minutes
Agent
bamboo-agent05
Revisions
CDAP Integration Tests
c6346df49f3bd12596e344d0e3ce99bc156b558e c6346df49f3bd12596e344d0e3ce99bc156b558e
Coopr-internal
b76d80c44be4d9e818d7365bed9a7aee9dc2ee4f b76d80c44be4d9e818d7365bed9a7aee9dc2ee4f
Total tests
62

Tests

  • 62 tests in total
  • 4 tests failed
  • 1 test was fixed
  • 214 minutes taken in total.
Existing test failures 4
Status Test Failing since Duration
java.util.concurrent.TimeoutException: Timeout occurred. Expected true but found false.
	at co.cask.cdap.common.utils.Tasks.waitFor(Tasks.java:70)
	at co.cask.cdap.common.utils.Tasks.waitFor(Tasks.java:91)
	at co.cask.cdap.common.utils.Tasks.waitFor(Tasks.java:130)
	at co.cask.cdap.test.AbstractProgramManager.waitForRuns(AbstractProgramManager.java:82)
	at co.cask.cdap.test.AbstractProgramManager.waitForRun(AbstractProgramManager.java:76)
	at co.cask.cdap.app.etl.batch.HivePluginTest.testHivePlugins(HivePluginTest.java:137)
java.lang.AssertionError: All traffic should be routed to service v1 but service v2 is also reached.
	at org.junit.Assert.fail(Assert.java:88)
	at co.cask.cdap.apps.ApplicationVersionTest.testRouteConfig(ApplicationVersionTest.java:214)
java.util.concurrent.TimeoutException: Timeout occurred. Expected true but found false.
	at co.cask.cdap.common.utils.Tasks.waitFor(Tasks.java:70)
	at co.cask.cdap.common.utils.Tasks.waitFor(Tasks.java:91)
	at co.cask.cdap.common.utils.Tasks.waitFor(Tasks.java:130)
	at co.cask.cdap.test.AbstractProgramManager.waitForRuns(AbstractProgramManager.java:82)
	at co.cask.cdap.test.AbstractProgramManager.waitForRun(AbstractProgramManager.java:76)
	at co.cask.cdap.apps.spark.sparkpagerank.SparkPageRankAppTest.test(SparkPageRankAppTest.java:141)
java.lang.AssertionError: expected:<10> but was:<2>
	at org.junit.Assert.fail(Assert.java:88)
	at org.junit.Assert.failNotEquals(Assert.java:743)
	at org.junit.Assert.assertEquals(Assert.java:118)
	at org.junit.Assert.assertEquals(Assert.java:555)
	at org.junit.Assert.assertEquals(Assert.java:542)
	at co.cask.cdap.apps.workflow.WorkflowTest.assertTokenAtSparkClusteringNode(WorkflowTest.java:212)
	at co.cask.cdap.apps.workflow.WorkflowTest.assertWorkflowToken(WorkflowTest.java:164)
(2 more lines...)
Fixed tests 1
Status Test Failing since Duration
Successful PermissionTest test History
11 mins

Error summary

The build generated some errors. See the full build log for more details.

Warning: Permanently added '10.210.0.16' (RSA) to the list of known hosts.
Warning: Permanently added '10.210.0.16' (RSA) to the list of known hosts.
Warning: Permanently added '10.210.0.16' (RSA) to the list of known hosts.
Warning: Permanently added '10.210.0.16' (RSA) to the list of known hosts.
Warning: Permanently added '10.210.0.16' (RSA) to the list of known hosts.
Warning: Permanently added '10.210.0.16' (RSA) to the list of known hosts.
Warning: Permanently added '10.210.0.16' (RSA) to the list of known hosts.
Warning: Permanently added '10.210.0.16' (RSA) to the list of known hosts.
Warning: Permanently added '10.210.0.16' (RSA) to the list of known hosts.
Warning: Permanently added '10.210.0.16' (RSA) to the list of known hosts.
Warning: Permanently added '10.210.0.16' (RSA) to the list of known hosts.
Warning: Permanently added '10.210.0.16' (RSA) to the list of known hosts.
Warning: Permanently added '10.210.0.16' (RSA) to the list of known hosts.
Warning: Permanently added '10.210.0.16' (RSA) to the list of known hosts.
Warning: Permanently added '10.210.0.16' (RSA) to the list of known hosts.
Warning: Permanently added '10.210.0.16' (RSA) to the list of known hosts.
Java HotSpot(TM) 64-Bit Server VM warning: ignoring option MaxPermSize=128m; support was removed in 8.0
Warning:  org.apache.xerces.jaxp.SAXParserImpl$JAXPSAXParser: Property 'http://www.oracle.com/xml/jaxp/properties/entityExpansionLimit' is not recognized.
Compiler warnings:
  WARNING:  'org.apache.xerces.jaxp.SAXParserImpl: Property 'http://javax.xml.XMLConstants/property/accessExternalDTD' is not recognized.'
Warning:  org.apache.xerces.parsers.SAXParser: Feature 'http://javax.xml.XMLConstants/feature/secure-processing' is not recognized.
Warning:  org.apache.xerces.parsers.SAXParser: Property 'http://javax.xml.XMLConstants/property/accessExternalDTD' is not recognized.
Warning:  org.apache.xerces.parsers.SAXParser: Property 'http://www.oracle.com/xml/jaxp/properties/entityExpansionLimit' is not recognized.
Warning:  org.apache.xerces.jaxp.SAXParserImpl$JAXPSAXParser: Property 'http://www.oracle.com/xml/jaxp/properties/entityExpansionLimit' is not recognized.
Compiler warnings:
  WARNING:  'org.apache.xerces.jaxp.SAXParserImpl: Property 'http://javax.xml.XMLConstants/property/accessExternalDTD' is not recognized.'
Warning:  org.apache.xerces.parsers.SAXParser: Feature 'http://javax.xml.XMLConstants/feature/secure-processing' is not recognized.
Warning:  org.apache.xerces.parsers.SAXParser: Property 'http://javax.xml.XMLConstants/property/accessExternalDTD' is not recognized.
Warning:  org.apache.xerces.parsers.SAXParser: Property 'http://www.oracle.com/xml/jaxp/properties/entityExpansionLimit' is not recognized.
Warning:  org.apache.xerces.jaxp.SAXParserImpl$JAXPSAXParser: Property 'http://www.oracle.com/xml/jaxp/properties/entityExpansionLimit' is not recognized.
Compiler warnings:
  WARNING:  'org.apache.xerces.jaxp.SAXParserImpl: Property 'http://javax.xml.XMLConstants/property/accessExternalDTD' is not recognized.'
Warning:  org.apache.xerces.parsers.SAXParser: Feature 'http://javax.xml.XMLConstants/feature/secure-processing' is not recognized.
Warning:  org.apache.xerces.parsers.SAXParser: Property 'http://javax.xml.XMLConstants/property/accessExternalDTD' is not recognized.
Warning:  org.apache.xerces.parsers.SAXParser: Property 'http://www.oracle.com/xml/jaxp/properties/entityExpansionLimit' is not recognized.
SLF4J: Class path contains multiple SLF4J bindings.
SLF4J: Found binding in [jar:file:/home/bamboo/.m2/repository/co/cask/cdap/cdap-cli/5.0.0-SNAPSHOT/cdap-cli-5.0.0-SNAPSHOT.jar!/org/slf4j/impl/StaticLoggerBinder.class]
SLF4J: Found binding in [jar:file:/home/bamboo/.m2/repository/co/cask/cdap/cdap-explore-jdbc/5.0.0-SNAPSHOT/cdap-explore-jdbc-5.0.0-SNAPSHOT.jar!/org/slf4j/impl/StaticLoggerBinder.class]
SLF4J: Found binding in [jar:file:/home/bamboo/.m2/repository/ch/qos/logback/logback-classic/1.0.9/logback-classic-1.0.9.jar!/org/slf4j/impl/StaticLoggerBinder.class]
SLF4J: See http://www.slf4j.org/codes.html#multiple_bindings for an explanation.
SLF4J: Actual binding is of type [ch.qos.logback.classic.util.ContextSelectorStaticBinder]