Build #593

Build: #593 failed Scheduled with changes by MEseifan <54917202+MEseifan@users.noreply.github.com> and Mo Eseifan

Stages & jobs

  1. Variables

  2. Spinup and Test

Build result summary

Details

Completed
Duration
258 minutes
Labels
None
Revisions
caskdata/cdap-integration-tests
0b7ed9478d8767c981b843acc196ef6713defe19 0b7ed9478d8767c981b843acc196ef6713defe19
caskdata/coopr-internal
8c2797da17295a6737c5c746943af521cf6bb43f 8c2797da17295a6737c5c746943af521cf6bb43f
Total tests
45
Failing since
#16 (Scheduled with changes by Derek Wood)

Responsible

This build has been failing since #16
No one has taken responsibility

Code commits

caskdata/coopr-internal
Author Commit Message Commit date
MEseifan <54917202+MEseifan@users.noreply.github.com> MEseifan <54917202+MEseifan@users.noreply.github.com> 8c2797da17295a6737c5c746943af521cf6bb43f 8c2797da17295a6737c5c746943af521cf6bb43f Merge pull request #744 from cdapio/feature/add-mo-user
Add Mo user
Mo Eseifan Mo Eseifan f632da223bd3455166a7b776e67ff4e81ccb1768 f632da223bd3455166a7b776e67ff4e81ccb1768 Add Mo Users

Tests

Existing test failures 2
Status Test Failing since View job Duration
java.net.ConnectException: Connection refused
	at java.net.PlainSocketImpl.socketConnect(Native Method)
	at java.net.AbstractPlainSocketImpl.doConnect(AbstractPlainSocketImpl.java:350)
	at java.net.AbstractPlainSocketImpl.connectToAddress(AbstractPlainSocketImpl.java:206)
	at java.net.AbstractPlainSocketImpl.connect(AbstractPlainSocketImpl.java:188)
	at java.net.SocksSocketImpl.connect(SocksSocketImpl.java:392)
	at java.net.Socket.connect(Socket.java:589)
	at sun.net.NetworkClient.doConnect(NetworkClient.java:175)
(14 more lines...)
java.lang.RuntimeException: java.io.IOException: Service 'dataset.service' is not available. Please wait until it is up and running.
	at io.cdap.cdap.client.util.RESTClient.upload(RESTClient.java:160)
	at io.cdap.cdap.client.ApplicationClient.deployApp(ApplicationClient.java:449)
	at io.cdap.cdap.client.ApplicationClient.deploy(ApplicationClient.java:377)
	at io.cdap.cdap.client.ApplicationClient.deploy(ApplicationClient.java:353)
	at io.cdap.cdap.test.IntegrationTestManager.deployApplication(IntegrationTestManager.java:180)
	at io.cdap.cdap.test.AbstractTestManager.deployApplication(AbstractTestManager.java:43)
	at io.cdap.cdap.test.IntegrationTestBase.deployApplication(IntegrationTestBase.java:368)
(2 more lines...)
Fixed tests 43
Status Test Failing since View job Duration
Successful KVTableWithProjectionTest testKVTableWithProjection History
Failing since build #592 (Scheduled) Spark 2.2 Release 2 4 mins
Successful TPFSAvroSinkSourceTest testTPFSWithProjection History
Failing since build #592 (Scheduled) Spark 2.2 Release 2 8 mins
Successful BatchAggregatorTest test History
Failing since build #592 (Scheduled) Spark 2.2 Release 2 11 mins
Successful BatchCubeSinkTest test History
Failing since build #592 (Scheduled) Spark 2.2 Release 2 5 mins
Successful BatchJoinerTest testJoinerSpark History
Failing since build #592 (Scheduled) Spark 2.2 Release 2 7 mins
Successful BatchJoinerTest testJoinerMR History
Failing since build #592 (Scheduled) Spark 2.2 Release 2 10 mins
Successful ETLMapReduceTest testKVToKV History
Failing since build #592 (Scheduled) Spark 2.2 Release 2 5 mins
Successful ETLMapReduceTest testDAGInvalidSchema History
Failing since build #592 (Scheduled) Spark 2.2 Release 2 3 secs
Successful ETLMapReduceTest testDAG History
Failing since build #592 (Scheduled) Spark 2.2 Release 2 4 mins
Successful ETLMapReduceTest testDAGSchemaChanges History
Failing since build #592 (Scheduled) Spark 2.2 Release 2 4 mins
Successful ExcelInputReaderTest testExcelReaderReprocessFalse History
Failing since build #592 (Scheduled) Spark 2.2 Release 2 5 mins
Successful ExcelInputReaderTest testExcelReader History
Failing since build #592 (Scheduled) Spark 2.2 Release 2 4 mins
Successful NormalizeTest testNormalize History
Failing since build #592 (Scheduled) Spark 2.2 Release 2 4 mins
Successful NormalizeTest testNormalizeWithEmptyAttributeValue History
Failing since build #592 (Scheduled) Spark 2.2 Release 2 5 mins
Successful RowDenormalizerTest test History
Failing since build #592 (Scheduled) Spark 2.2 Release 2 5 mins
Successful TPFSParquetSinkSourceTest testMR History
Failing since build #592 (Scheduled) Spark 2.2 Release 2 8 mins
Successful TPFSParquetSinkSourceTest testSpark History
Failing since build #592 (Scheduled) Spark 2.2 Release 2 6 mins
Successful ValueMapperTest test History
Failing since build #592 (Scheduled) Spark 2.2 Release 2 6 mins
Successful XMLReaderTest testPreProcessingNotRequired History
Failing since build #592 (Scheduled) Spark 2.2 Release 2 6 mins
Successful XMLReaderTest testInvalidNodePathWithMoveAction History
Failing since build #592 (Scheduled) Spark 2.2 Release 2 6 mins
Successful XMLReaderTest testPatternWithDeleteAction History
Failing since build #592 (Scheduled) Spark 2.2 Release 2 5 mins
Successful XMLReaderTest testPreProcessingRequired History
Failing since build #592 (Scheduled) Spark 2.2 Release 2 5 mins
Successful XMLReaderTest testInvalidPatternWithDeleteAction History
Failing since build #592 (Scheduled) Spark 2.2 Release 2 5 mins
Successful DataStreamsTest testDataStreams History
Failing since build #592 (Scheduled) Spark 2.2 Release 2 4 mins
Successful WranglerServiceTest test History
Failing since build #592 (Scheduled) Spark 2.2 Release 2 1 min
Successful WranglerTest testWranglerMR History
Failing since build #592 (Scheduled) Spark 2.2 Release 2 5 mins
Successful WranglerTest testWranglerSpark History
Failing since build #592 (Scheduled) Spark 2.2 Release 2 4 mins
Successful PermissionTest test History
Failing since build #592 (Scheduled) Spark 2.2 Release 2 15 mins
Successful ReadlessIncrementTest testReadlessIncrementsInMapReduce History
Failing since build #592 (Scheduled) Spark 2.2 Release 2 3 mins
Successful HangingWorkerTest testRestart History
Failing since build #592 (Scheduled) Spark 2.2 Release 2 3 mins
Successful ServiceWorkerTest test History
Failing since build #592 (Scheduled) Spark 2.2 Release 2 2 mins
Successful NamespaceTest testNamespaces History
Failing since build #592 (Scheduled) Spark 2.2 Release 2 5 secs
Successful DatasetTest test History
Failing since build #592 (Scheduled) Spark 2.2 Release 2 2 mins
Successful FileSetTest test History
Failing since build #592 (Scheduled) Spark 2.2 Release 2 4 mins
Successful PartitionCorrectorTest test History
Failing since build #592 (Scheduled) Spark 2.2 Release 2 5 mins
Successful PartitionedFileSetUpdateTest test History
Failing since build #592 (Scheduled) Spark 2.2 Release 2 2 mins
Successful ProgramMetadataTest testWithLineage History
Failing since build #592 (Scheduled) Spark 2.2 Release 2 3 mins
Successful ProgramMetadataTest testSearchUsingSystemMetadata History
Failing since build #592 (Scheduled) Spark 2.2 Release 2 26 secs
Successful WorkflowTest test History
Failing since build #592 (Scheduled) Spark 2.2 Release 2 3 mins
Successful OperationalStatsTest testCDAPStats History
Failing since build #592 (Scheduled) Spark 2.2 Release 2 1 sec
Successful RemoteCubeTest test History
Failing since build #592 (Scheduled) Spark 2.2 Release 2 1 min
Successful RemoteKeyValueTest test History
Failing since build #592 (Scheduled) Spark 2.2 Release 2 1 min
Successful RemoteTableTest test History
Failing since build #592 (Scheduled) Spark 2.2 Release 2 1 min