Build #504

Build: #504 failed Scheduled with changes by albertshau <ashau@google.com> and Daniel <danielye@google.com>

Stages & jobs

  1. Variables

  2. Spinup and Test

Build result summary

Details

Completed
Duration
227 minutes
Labels
None
Revisions
caskdata/cdap-integration-tests
0b7ed9478d8767c981b843acc196ef6713defe19 0b7ed9478d8767c981b843acc196ef6713defe19
caskdata/coopr-internal
b7a74651688c18a871aa4e50e8004389d7b5e2ef b7a74651688c18a871aa4e50e8004389d7b5e2ef
Total tests
45
Failing since
#16 (Scheduled with changes by Derek Wood)

Responsible

This build has been failing since #16
No one has taken responsibility

Code commits

caskdata/cdap-integration-tests
Author Commit Message Commit date
albertshau <ashau@google.com> albertshau <ashau@google.com> 0b7ed9478d8767c981b843acc196ef6713defe19 0b7ed9478d8767c981b843acc196ef6713defe19 Merge pull request #1042 from yeweidaniel/integration-docs
Update steps for running integration test
Daniel <danielye@google.com> Daniel <danielye@google.com> e0762675907ce2347b96144fac6e1d046cb2cafa e0762675907ce2347b96144fac6e1d046cb2cafa Update steps for running integration test

Tests

New test failures 1
Status Test View job Duration
Collapse Failed BatchAggregatorTest test History
Spark 2.2 Release 2 < 1 sec
java.util.concurrent.TimeoutException: Timeout occurred. Expected true but found false.
	at io.cdap.cdap.common.utils.Tasks.waitFor(Tasks.java:70)
	at io.cdap.cdap.common.utils.Tasks.waitFor(Tasks.java:91)
	at io.cdap.cdap.common.utils.Tasks.waitFor(Tasks.java:130)
	at io.cdap.cdap.test.AbstractProgramManager.waitForRuns(AbstractProgramManager.java:96)
	at io.cdap.cdap.test.AbstractProgramManager.waitForRun(AbstractProgramManager.java:90)
	at io.cdap.cdap.app.etl.batch.BatchAggregatorTest.test(BatchAggregatorTest.java:162)
Existing test failures 2
Status Test Failing since View job Duration
java.util.concurrent.TimeoutException: Timeout occurred. Expected true but found false.
	at io.cdap.cdap.common.utils.Tasks.waitFor(Tasks.java:70)
	at io.cdap.cdap.common.utils.Tasks.waitFor(Tasks.java:91)
	at io.cdap.cdap.common.utils.Tasks.waitFor(Tasks.java:130)
	at io.cdap.cdap.test.AbstractProgramManager.waitForRuns(AbstractProgramManager.java:96)
	at io.cdap.cdap.test.AbstractProgramManager.waitForRun(AbstractProgramManager.java:90)
	at io.cdap.cdap.app.etl.batch.HivePluginTest.testHivePlugins(HivePluginTest.java:134)
java.lang.RuntimeException: java.io.IOException: Service 'dataset.service' is not available. Please wait until it is up and running.
	at io.cdap.cdap.client.util.RESTClient.upload(RESTClient.java:160)
	at io.cdap.cdap.client.ApplicationClient.deployApp(ApplicationClient.java:449)
	at io.cdap.cdap.client.ApplicationClient.deploy(ApplicationClient.java:377)
	at io.cdap.cdap.client.ApplicationClient.deploy(ApplicationClient.java:353)
	at io.cdap.cdap.test.IntegrationTestManager.deployApplication(IntegrationTestManager.java:180)
	at io.cdap.cdap.test.AbstractTestManager.deployApplication(AbstractTestManager.java:43)
	at io.cdap.cdap.test.IntegrationTestBase.deployApplication(IntegrationTestBase.java:368)
(2 more lines...)