Build #457

Build: #457 failed Scheduled with changes by albertshau <ashau@google.com>

Stages & jobs

  1. Variables

  2. Spinup and Test

Build result summary

Details

Completed
Duration
240 minutes
Labels
None
Revisions
caskdata/cdap-integration-tests
fcfec769e9c31b9bb146700e0c07e75c044ab4c4 fcfec769e9c31b9bb146700e0c07e75c044ab4c4
caskdata/coopr-internal
b7a74651688c18a871aa4e50e8004389d7b5e2ef b7a74651688c18a871aa4e50e8004389d7b5e2ef
Total tests
46
Failing since
#16 (Scheduled with changes by Derek Wood)

Responsible

This build has been failing since #16
No one has taken responsibility

Code commits

caskdata/cdap-integration-tests
Author Commit Message Commit date
albertshau <ashau@google.com> albertshau <ashau@google.com> fcfec769e9c31b9bb146700e0c07e75c044ab4c4 fcfec769e9c31b9bb146700e0c07e75c044ab4c4 Merge pull request #1031 from cdapio/feature/CDAP-15879-gcs-formats-test
CDAP-15879 test GCS formats
albertshau <ashau@google.com> albertshau <ashau@google.com> c5257419f917eac4a2f22b4d2fa7fe0bb0ce18ad c5257419f917eac4a2f22b4d2fa7fe0bb0ce18ad CDAP-15879 test GCS formats
Modified the existing GCS test to test that all the formats can
be used, and to also test the usage of regex.

Tests

New test failures 2
Status Test View job Duration
Collapse Failed HivePluginTest testHivePlugins History
Spark 2.2 Release 2 6 mins
java.util.concurrent.TimeoutException: Timeout occurred. Expected true but found false.
	at io.cdap.cdap.common.utils.Tasks.waitFor(Tasks.java:70)
	at io.cdap.cdap.common.utils.Tasks.waitFor(Tasks.java:91)
	at io.cdap.cdap.common.utils.Tasks.waitFor(Tasks.java:130)
	at io.cdap.cdap.test.AbstractProgramManager.waitForRuns(AbstractProgramManager.java:96)
	at io.cdap.cdap.test.AbstractProgramManager.waitForRun(AbstractProgramManager.java:90)
	at io.cdap.cdap.app.etl.batch.HivePluginTest.testHivePlugins(HivePluginTest.java:134)
Collapse Failed ApplicationTest test History
Spark 2.2 Release 2 1 min
java.lang.RuntimeException: java.io.IOException: Service 'dataset.service' is not available. Please wait until it is up and running.
	at io.cdap.cdap.client.util.RESTClient.upload(RESTClient.java:160)
	at io.cdap.cdap.client.ApplicationClient.deployApp(ApplicationClient.java:449)
	at io.cdap.cdap.client.ApplicationClient.deploy(ApplicationClient.java:377)
	at io.cdap.cdap.client.ApplicationClient.deploy(ApplicationClient.java:353)
	at io.cdap.cdap.test.IntegrationTestManager.deployApplication(IntegrationTestManager.java:180)
	at io.cdap.cdap.test.AbstractTestManager.deployApplication(AbstractTestManager.java:43)
	at io.cdap.cdap.test.IntegrationTestBase.deployApplication(IntegrationTestBase.java:368)
(2 more lines...)

JIRA issues

IssueDescriptionStatus
Unknown Issue TypeCDAP-15879Could not obtain issue details from JIRA