Build #334

Build: #334 failed Scheduled

Stages & jobs

  1. Variables

  2. Spinup and Test

Build result summary

Details

Completed
Duration
152 minutes
Labels
None
Revisions
caskdata/cdap-integration-tests
2e165efdba5d805ae084d4852c78b74ba6a19fe5 2e165efdba5d805ae084d4852c78b74ba6a19fe5
caskdata/coopr-internal
ddfce542a9a9a4e3676b7999ca8bcd40d0bad51f ddfce542a9a9a4e3676b7999ca8bcd40d0bad51f
Total tests
46
Failing since
#16 (Scheduled with changes by Derek Wood)

Responsible

This build has been failing since #16
No one has taken responsibility

Tests

New test failures 43
Status Test View job Duration
Collapse Failed KVTableWithProjectionTest testKVTableWithProjection History
Spark 2.2 Release 2 2 mins
java.util.concurrent.TimeoutException: Timeout occurred. Expected STOPPED but found RUNNING.
	at io.cdap.cdap.common.utils.Tasks.waitFor(Tasks.java:70)
	at io.cdap.cdap.common.utils.Tasks.waitFor(Tasks.java:91)
	at io.cdap.cdap.client.ProgramClient.waitForStatus(ProgramClient.java:323)
	at io.cdap.cdap.client.ProgramClient.stopAll(ProgramClient.java:254)
	at io.cdap.cdap.test.IntegrationTestBase.doClear(IntegrationTestBase.java:390)
	at io.cdap.cdap.test.IntegrationTestBase.setUp(IntegrationTestBase.java:107)
	at sun.reflect.GeneratedMethodAccessor3.invoke(Unknown Source)
(33 more lines...)
Collapse Failed TPFSAvroSinkSourceTest testTPFSWithProjection History
Spark 2.2 Release 2 2 mins
java.util.concurrent.TimeoutException: Timeout occurred. Expected STOPPED but found RUNNING.
	at io.cdap.cdap.common.utils.Tasks.waitFor(Tasks.java:70)
	at io.cdap.cdap.common.utils.Tasks.waitFor(Tasks.java:91)
	at io.cdap.cdap.client.ProgramClient.waitForStatus(ProgramClient.java:323)
	at io.cdap.cdap.client.ProgramClient.stopAll(ProgramClient.java:254)
	at io.cdap.cdap.test.IntegrationTestBase.doClear(IntegrationTestBase.java:390)
	at io.cdap.cdap.test.IntegrationTestBase.setUp(IntegrationTestBase.java:107)
	at sun.reflect.GeneratedMethodAccessor3.invoke(Unknown Source)
(33 more lines...)
Collapse Failed BatchCubeSinkTest test History
Spark 2.2 Release 2 2 mins
java.util.concurrent.TimeoutException: Timeout occurred. Expected STOPPED but found RUNNING.
	at io.cdap.cdap.common.utils.Tasks.waitFor(Tasks.java:70)
	at io.cdap.cdap.common.utils.Tasks.waitFor(Tasks.java:91)
	at io.cdap.cdap.client.ProgramClient.waitForStatus(ProgramClient.java:323)
	at io.cdap.cdap.client.ProgramClient.stopAll(ProgramClient.java:254)
	at io.cdap.cdap.test.IntegrationTestBase.doClear(IntegrationTestBase.java:390)
	at io.cdap.cdap.test.IntegrationTestBase.setUp(IntegrationTestBase.java:107)
	at sun.reflect.NativeMethodAccessorImpl.invoke0(Native Method)
(34 more lines...)
Collapse Failed BatchJoinerTest testJoinerSpark History
Spark 2.2 Release 2 2 mins
java.util.concurrent.TimeoutException: Timeout occurred. Expected STOPPED but found RUNNING.
	at io.cdap.cdap.common.utils.Tasks.waitFor(Tasks.java:70)
	at io.cdap.cdap.common.utils.Tasks.waitFor(Tasks.java:91)
	at io.cdap.cdap.client.ProgramClient.waitForStatus(ProgramClient.java:323)
	at io.cdap.cdap.client.ProgramClient.stopAll(ProgramClient.java:254)
	at io.cdap.cdap.test.IntegrationTestBase.doClear(IntegrationTestBase.java:390)
	at io.cdap.cdap.test.IntegrationTestBase.setUp(IntegrationTestBase.java:107)
	at sun.reflect.NativeMethodAccessorImpl.invoke0(Native Method)
(34 more lines...)
Collapse Failed BatchJoinerTest testJoinerMR History
Spark 2.2 Release 2 2 mins
java.util.concurrent.TimeoutException: Timeout occurred. Expected STOPPED but found RUNNING.
	at io.cdap.cdap.common.utils.Tasks.waitFor(Tasks.java:70)
	at io.cdap.cdap.common.utils.Tasks.waitFor(Tasks.java:91)
	at io.cdap.cdap.client.ProgramClient.waitForStatus(ProgramClient.java:323)
	at io.cdap.cdap.client.ProgramClient.stopAll(ProgramClient.java:254)
	at io.cdap.cdap.test.IntegrationTestBase.doClear(IntegrationTestBase.java:390)
	at io.cdap.cdap.test.IntegrationTestBase.setUp(IntegrationTestBase.java:107)
	at sun.reflect.NativeMethodAccessorImpl.invoke0(Native Method)
(34 more lines...)
Collapse Failed ETLMapReduceTest testKVToKV History
Spark 2.2 Release 2 2 mins
java.util.concurrent.TimeoutException: Timeout occurred. Expected STOPPED but found RUNNING.
	at io.cdap.cdap.common.utils.Tasks.waitFor(Tasks.java:70)
	at io.cdap.cdap.common.utils.Tasks.waitFor(Tasks.java:91)
	at io.cdap.cdap.client.ProgramClient.waitForStatus(ProgramClient.java:323)
	at io.cdap.cdap.client.ProgramClient.stopAll(ProgramClient.java:254)
	at io.cdap.cdap.test.IntegrationTestBase.doClear(IntegrationTestBase.java:390)
	at io.cdap.cdap.test.IntegrationTestBase.setUp(IntegrationTestBase.java:107)
	at sun.reflect.NativeMethodAccessorImpl.invoke0(Native Method)
(34 more lines...)
Collapse Failed ETLMapReduceTest testDAGInvalidSchema History
Spark 2.2 Release 2 2 mins
java.util.concurrent.TimeoutException: Timeout occurred. Expected STOPPED but found RUNNING.
	at io.cdap.cdap.common.utils.Tasks.waitFor(Tasks.java:70)
	at io.cdap.cdap.common.utils.Tasks.waitFor(Tasks.java:91)
	at io.cdap.cdap.client.ProgramClient.waitForStatus(ProgramClient.java:323)
	at io.cdap.cdap.client.ProgramClient.stopAll(ProgramClient.java:254)
	at io.cdap.cdap.test.IntegrationTestBase.doClear(IntegrationTestBase.java:390)
	at io.cdap.cdap.test.IntegrationTestBase.setUp(IntegrationTestBase.java:107)
	at sun.reflect.NativeMethodAccessorImpl.invoke0(Native Method)
(34 more lines...)
Collapse Failed ETLMapReduceTest testDAG History
Spark 2.2 Release 2 2 mins
java.util.concurrent.TimeoutException: Timeout occurred. Expected STOPPED but found RUNNING.
	at io.cdap.cdap.common.utils.Tasks.waitFor(Tasks.java:70)
	at io.cdap.cdap.common.utils.Tasks.waitFor(Tasks.java:91)
	at io.cdap.cdap.client.ProgramClient.waitForStatus(ProgramClient.java:323)
	at io.cdap.cdap.client.ProgramClient.stopAll(ProgramClient.java:254)
	at io.cdap.cdap.test.IntegrationTestBase.doClear(IntegrationTestBase.java:390)
	at io.cdap.cdap.test.IntegrationTestBase.setUp(IntegrationTestBase.java:107)
	at sun.reflect.NativeMethodAccessorImpl.invoke0(Native Method)
(34 more lines...)
Collapse Failed ETLMapReduceTest testTableToTableWithValidations History
Spark 2.2 Release 2 2 mins
java.util.concurrent.TimeoutException: Timeout occurred. Expected STOPPED but found RUNNING.
	at io.cdap.cdap.common.utils.Tasks.waitFor(Tasks.java:70)
	at io.cdap.cdap.common.utils.Tasks.waitFor(Tasks.java:91)
	at io.cdap.cdap.client.ProgramClient.waitForStatus(ProgramClient.java:323)
	at io.cdap.cdap.client.ProgramClient.stopAll(ProgramClient.java:254)
	at io.cdap.cdap.test.IntegrationTestBase.doClear(IntegrationTestBase.java:390)
	at io.cdap.cdap.test.IntegrationTestBase.setUp(IntegrationTestBase.java:107)
	at sun.reflect.NativeMethodAccessorImpl.invoke0(Native Method)
(34 more lines...)
Collapse Failed ETLMapReduceTest testDAGSchemaChanges History
Spark 2.2 Release 2 2 mins
java.util.concurrent.TimeoutException: Timeout occurred. Expected STOPPED but found RUNNING.
	at io.cdap.cdap.common.utils.Tasks.waitFor(Tasks.java:70)
	at io.cdap.cdap.common.utils.Tasks.waitFor(Tasks.java:91)
	at io.cdap.cdap.client.ProgramClient.waitForStatus(ProgramClient.java:323)
	at io.cdap.cdap.client.ProgramClient.stopAll(ProgramClient.java:254)
	at io.cdap.cdap.test.IntegrationTestBase.doClear(IntegrationTestBase.java:390)
	at io.cdap.cdap.test.IntegrationTestBase.setUp(IntegrationTestBase.java:107)
	at sun.reflect.NativeMethodAccessorImpl.invoke0(Native Method)
(34 more lines...)
Collapse Failed ExcelInputReaderTest testExcelReaderReprocessFalse History
Spark 2.2 Release 2 2 mins
java.util.concurrent.TimeoutException: Timeout occurred. Expected STOPPED but found RUNNING.
	at io.cdap.cdap.common.utils.Tasks.waitFor(Tasks.java:70)
	at io.cdap.cdap.common.utils.Tasks.waitFor(Tasks.java:91)
	at io.cdap.cdap.client.ProgramClient.waitForStatus(ProgramClient.java:323)
	at io.cdap.cdap.client.ProgramClient.stopAll(ProgramClient.java:254)
	at io.cdap.cdap.test.IntegrationTestBase.doClear(IntegrationTestBase.java:390)
	at io.cdap.cdap.test.IntegrationTestBase.setUp(IntegrationTestBase.java:107)
	at sun.reflect.NativeMethodAccessorImpl.invoke0(Native Method)
(34 more lines...)
Collapse Failed ExcelInputReaderTest testExcelReader History
Spark 2.2 Release 2 2 mins
java.util.concurrent.TimeoutException: Timeout occurred. Expected STOPPED but found RUNNING.
	at io.cdap.cdap.common.utils.Tasks.waitFor(Tasks.java:70)
	at io.cdap.cdap.common.utils.Tasks.waitFor(Tasks.java:91)
	at io.cdap.cdap.client.ProgramClient.waitForStatus(ProgramClient.java:323)
	at io.cdap.cdap.client.ProgramClient.stopAll(ProgramClient.java:254)
	at io.cdap.cdap.test.IntegrationTestBase.doClear(IntegrationTestBase.java:390)
	at io.cdap.cdap.test.IntegrationTestBase.setUp(IntegrationTestBase.java:107)
	at sun.reflect.NativeMethodAccessorImpl.invoke0(Native Method)
(34 more lines...)
Collapse Failed NormalizeTest testNormalize History
Spark 2.2 Release 2 2 mins
java.util.concurrent.TimeoutException: Timeout occurred. Expected STOPPED but found RUNNING.
	at io.cdap.cdap.common.utils.Tasks.waitFor(Tasks.java:70)
	at io.cdap.cdap.common.utils.Tasks.waitFor(Tasks.java:91)
	at io.cdap.cdap.client.ProgramClient.waitForStatus(ProgramClient.java:323)
	at io.cdap.cdap.client.ProgramClient.stopAll(ProgramClient.java:254)
	at io.cdap.cdap.test.IntegrationTestBase.doClear(IntegrationTestBase.java:390)
	at io.cdap.cdap.test.IntegrationTestBase.setUp(IntegrationTestBase.java:107)
	at sun.reflect.GeneratedMethodAccessor3.invoke(Unknown Source)
(34 more lines...)
Collapse Failed NormalizeTest testNormalizeWithEmptyAttributeValue History
Spark 2.2 Release 2 2 mins
java.util.concurrent.TimeoutException: Timeout occurred. Expected STOPPED but found RUNNING.
	at io.cdap.cdap.common.utils.Tasks.waitFor(Tasks.java:70)
	at io.cdap.cdap.common.utils.Tasks.waitFor(Tasks.java:91)
	at io.cdap.cdap.client.ProgramClient.waitForStatus(ProgramClient.java:323)
	at io.cdap.cdap.client.ProgramClient.stopAll(ProgramClient.java:254)
	at io.cdap.cdap.test.IntegrationTestBase.doClear(IntegrationTestBase.java:390)
	at io.cdap.cdap.test.IntegrationTestBase.setUp(IntegrationTestBase.java:107)
	at sun.reflect.GeneratedMethodAccessor3.invoke(Unknown Source)
(34 more lines...)
Collapse Failed RowDenormalizerTest test History
Spark 2.2 Release 2 2 mins
java.util.concurrent.TimeoutException: Timeout occurred. Expected STOPPED but found RUNNING.
	at io.cdap.cdap.common.utils.Tasks.waitFor(Tasks.java:70)
	at io.cdap.cdap.common.utils.Tasks.waitFor(Tasks.java:91)
	at io.cdap.cdap.client.ProgramClient.waitForStatus(ProgramClient.java:323)
	at io.cdap.cdap.client.ProgramClient.stopAll(ProgramClient.java:254)
	at io.cdap.cdap.test.IntegrationTestBase.doClear(IntegrationTestBase.java:390)
	at io.cdap.cdap.test.IntegrationTestBase.setUp(IntegrationTestBase.java:107)
	at sun.reflect.GeneratedMethodAccessor3.invoke(Unknown Source)
(33 more lines...)
Collapse Failed TPFSParquetSinkSourceTest testMR History
Spark 2.2 Release 2 2 mins
java.util.concurrent.TimeoutException: Timeout occurred. Expected STOPPED but found RUNNING.
	at io.cdap.cdap.common.utils.Tasks.waitFor(Tasks.java:70)
	at io.cdap.cdap.common.utils.Tasks.waitFor(Tasks.java:91)
	at io.cdap.cdap.client.ProgramClient.waitForStatus(ProgramClient.java:323)
	at io.cdap.cdap.client.ProgramClient.stopAll(ProgramClient.java:254)
	at io.cdap.cdap.test.IntegrationTestBase.doClear(IntegrationTestBase.java:390)
	at io.cdap.cdap.test.IntegrationTestBase.setUp(IntegrationTestBase.java:107)
	at sun.reflect.GeneratedMethodAccessor3.invoke(Unknown Source)
(33 more lines...)
Collapse Failed TPFSParquetSinkSourceTest testSpark History
Spark 2.2 Release 2 2 mins
java.util.concurrent.TimeoutException: Timeout occurred. Expected STOPPED but found RUNNING.
	at io.cdap.cdap.common.utils.Tasks.waitFor(Tasks.java:70)
	at io.cdap.cdap.common.utils.Tasks.waitFor(Tasks.java:91)
	at io.cdap.cdap.client.ProgramClient.waitForStatus(ProgramClient.java:323)
	at io.cdap.cdap.client.ProgramClient.stopAll(ProgramClient.java:254)
	at io.cdap.cdap.test.IntegrationTestBase.doClear(IntegrationTestBase.java:390)
	at io.cdap.cdap.test.IntegrationTestBase.setUp(IntegrationTestBase.java:107)
	at sun.reflect.GeneratedMethodAccessor3.invoke(Unknown Source)
(33 more lines...)
Collapse Failed ValueMapperTest test History
Spark 2.2 Release 2 2 mins
java.util.concurrent.TimeoutException: Timeout occurred. Expected STOPPED but found RUNNING.
	at io.cdap.cdap.common.utils.Tasks.waitFor(Tasks.java:70)
	at io.cdap.cdap.common.utils.Tasks.waitFor(Tasks.java:91)
	at io.cdap.cdap.client.ProgramClient.waitForStatus(ProgramClient.java:323)
	at io.cdap.cdap.client.ProgramClient.stopAll(ProgramClient.java:254)
	at io.cdap.cdap.test.IntegrationTestBase.doClear(IntegrationTestBase.java:390)
	at io.cdap.cdap.test.IntegrationTestBase.setUp(IntegrationTestBase.java:107)
	at sun.reflect.GeneratedMethodAccessor3.invoke(Unknown Source)
(33 more lines...)
Collapse Failed XMLReaderTest testPreProcessingNotRequired History
Spark 2.2 Release 2 2 mins
java.util.concurrent.TimeoutException: Timeout occurred. Expected STOPPED but found RUNNING.
	at io.cdap.cdap.common.utils.Tasks.waitFor(Tasks.java:70)
	at io.cdap.cdap.common.utils.Tasks.waitFor(Tasks.java:91)
	at io.cdap.cdap.client.ProgramClient.waitForStatus(ProgramClient.java:323)
	at io.cdap.cdap.client.ProgramClient.stopAll(ProgramClient.java:254)
	at io.cdap.cdap.test.IntegrationTestBase.doClear(IntegrationTestBase.java:390)
	at io.cdap.cdap.test.IntegrationTestBase.setUp(IntegrationTestBase.java:107)
	at sun.reflect.GeneratedMethodAccessor3.invoke(Unknown Source)
(33 more lines...)
Collapse Failed XMLReaderTest testInvalidNodePathWithMoveAction History
Spark 2.2 Release 2 2 mins
java.util.concurrent.TimeoutException: Timeout occurred. Expected STOPPED but found RUNNING.
	at io.cdap.cdap.common.utils.Tasks.waitFor(Tasks.java:70)
	at io.cdap.cdap.common.utils.Tasks.waitFor(Tasks.java:91)
	at io.cdap.cdap.client.ProgramClient.waitForStatus(ProgramClient.java:323)
	at io.cdap.cdap.client.ProgramClient.stopAll(ProgramClient.java:254)
	at io.cdap.cdap.test.IntegrationTestBase.doClear(IntegrationTestBase.java:390)
	at io.cdap.cdap.test.IntegrationTestBase.setUp(IntegrationTestBase.java:107)
	at sun.reflect.GeneratedMethodAccessor3.invoke(Unknown Source)
(33 more lines...)
Collapse Failed XMLReaderTest testPatternWithDeleteAction History
Spark 2.2 Release 2 2 mins
java.util.concurrent.TimeoutException: Timeout occurred. Expected STOPPED but found RUNNING.
	at io.cdap.cdap.common.utils.Tasks.waitFor(Tasks.java:70)
	at io.cdap.cdap.common.utils.Tasks.waitFor(Tasks.java:91)
	at io.cdap.cdap.client.ProgramClient.waitForStatus(ProgramClient.java:323)
	at io.cdap.cdap.client.ProgramClient.stopAll(ProgramClient.java:254)
	at io.cdap.cdap.test.IntegrationTestBase.doClear(IntegrationTestBase.java:390)
	at io.cdap.cdap.test.IntegrationTestBase.setUp(IntegrationTestBase.java:107)
	at sun.reflect.GeneratedMethodAccessor3.invoke(Unknown Source)
(33 more lines...)
Collapse Failed XMLReaderTest testPreProcessingRequired History
Spark 2.2 Release 2 2 mins
java.util.concurrent.TimeoutException: Timeout occurred. Expected STOPPED but found RUNNING.
	at io.cdap.cdap.common.utils.Tasks.waitFor(Tasks.java:70)
	at io.cdap.cdap.common.utils.Tasks.waitFor(Tasks.java:91)
	at io.cdap.cdap.client.ProgramClient.waitForStatus(ProgramClient.java:323)
	at io.cdap.cdap.client.ProgramClient.stopAll(ProgramClient.java:254)
	at io.cdap.cdap.test.IntegrationTestBase.doClear(IntegrationTestBase.java:390)
	at io.cdap.cdap.test.IntegrationTestBase.setUp(IntegrationTestBase.java:107)
	at sun.reflect.GeneratedMethodAccessor3.invoke(Unknown Source)
(33 more lines...)
Collapse Failed XMLReaderTest testInvalidPatternWithDeleteAction History
Spark 2.2 Release 2 2 mins
java.util.concurrent.TimeoutException: Timeout occurred. Expected STOPPED but found RUNNING.
	at io.cdap.cdap.common.utils.Tasks.waitFor(Tasks.java:70)
	at io.cdap.cdap.common.utils.Tasks.waitFor(Tasks.java:91)
	at io.cdap.cdap.client.ProgramClient.waitForStatus(ProgramClient.java:323)
	at io.cdap.cdap.client.ProgramClient.stopAll(ProgramClient.java:254)
	at io.cdap.cdap.test.IntegrationTestBase.doClear(IntegrationTestBase.java:390)
	at io.cdap.cdap.test.IntegrationTestBase.setUp(IntegrationTestBase.java:107)
	at sun.reflect.GeneratedMethodAccessor3.invoke(Unknown Source)
(33 more lines...)
Collapse Failed DataStreamsTest testDataStreams History
Spark 2.2 Release 2 2 mins
java.util.concurrent.TimeoutException: Timeout occurred. Expected STOPPED but found RUNNING.
	at io.cdap.cdap.common.utils.Tasks.waitFor(Tasks.java:70)
	at io.cdap.cdap.common.utils.Tasks.waitFor(Tasks.java:91)
	at io.cdap.cdap.client.ProgramClient.waitForStatus(ProgramClient.java:323)
	at io.cdap.cdap.client.ProgramClient.stopAll(ProgramClient.java:254)
	at io.cdap.cdap.test.IntegrationTestBase.doClear(IntegrationTestBase.java:390)
	at io.cdap.cdap.test.IntegrationTestBase.setUp(IntegrationTestBase.java:107)
	at sun.reflect.NativeMethodAccessorImpl.invoke0(Native Method)
(34 more lines...)
Collapse Failed WranglerServiceTest test History
Spark 2.2 Release 2 2 mins
java.util.concurrent.TimeoutException: Timeout occurred. Expected STOPPED but found RUNNING.
	at io.cdap.cdap.common.utils.Tasks.waitFor(Tasks.java:70)
	at io.cdap.cdap.common.utils.Tasks.waitFor(Tasks.java:91)
	at io.cdap.cdap.client.ProgramClient.waitForStatus(ProgramClient.java:323)
	at io.cdap.cdap.client.ProgramClient.stopAll(ProgramClient.java:254)
	at io.cdap.cdap.test.IntegrationTestBase.doClear(IntegrationTestBase.java:390)
	at io.cdap.cdap.test.IntegrationTestBase.setUp(IntegrationTestBase.java:107)
	at sun.reflect.GeneratedMethodAccessor3.invoke(Unknown Source)
(33 more lines...)
Collapse Failed WranglerTest testWranglerMR History
Spark 2.2 Release 2 2 mins
java.util.concurrent.TimeoutException: Timeout occurred. Expected STOPPED but found RUNNING.
	at io.cdap.cdap.common.utils.Tasks.waitFor(Tasks.java:70)
	at io.cdap.cdap.common.utils.Tasks.waitFor(Tasks.java:91)
	at io.cdap.cdap.client.ProgramClient.waitForStatus(ProgramClient.java:323)
	at io.cdap.cdap.client.ProgramClient.stopAll(ProgramClient.java:254)
	at io.cdap.cdap.test.IntegrationTestBase.doClear(IntegrationTestBase.java:390)
	at io.cdap.cdap.test.IntegrationTestBase.setUp(IntegrationTestBase.java:107)
	at sun.reflect.GeneratedMethodAccessor3.invoke(Unknown Source)
(33 more lines...)
Collapse Failed WranglerTest testWranglerSpark History
Spark 2.2 Release 2 2 mins
java.util.concurrent.TimeoutException: Timeout occurred. Expected STOPPED but found RUNNING.
	at io.cdap.cdap.common.utils.Tasks.waitFor(Tasks.java:70)
	at io.cdap.cdap.common.utils.Tasks.waitFor(Tasks.java:91)
	at io.cdap.cdap.client.ProgramClient.waitForStatus(ProgramClient.java:323)
	at io.cdap.cdap.client.ProgramClient.stopAll(ProgramClient.java:254)
	at io.cdap.cdap.test.IntegrationTestBase.doClear(IntegrationTestBase.java:390)
	at io.cdap.cdap.test.IntegrationTestBase.setUp(IntegrationTestBase.java:107)
	at sun.reflect.GeneratedMethodAccessor3.invoke(Unknown Source)
(33 more lines...)
Collapse Failed PermissionTest test History
Spark 2.2 Release 2 2 mins
java.util.concurrent.TimeoutException: Timeout occurred. Expected STOPPED but found RUNNING.
	at io.cdap.cdap.common.utils.Tasks.waitFor(Tasks.java:70)
	at io.cdap.cdap.common.utils.Tasks.waitFor(Tasks.java:91)
	at io.cdap.cdap.client.ProgramClient.waitForStatus(ProgramClient.java:323)
	at io.cdap.cdap.client.ProgramClient.stopAll(ProgramClient.java:254)
	at io.cdap.cdap.test.IntegrationTestBase.doClear(IntegrationTestBase.java:390)
	at io.cdap.cdap.test.IntegrationTestBase.setUp(IntegrationTestBase.java:107)
	at sun.reflect.GeneratedMethodAccessor3.invoke(Unknown Source)
(33 more lines...)
Collapse Failed ReadlessIncrementTest testReadlessIncrementsInMapReduce History
Spark 2.2 Release 2 2 mins
java.util.concurrent.TimeoutException: Timeout occurred. Expected STOPPED but found RUNNING.
	at io.cdap.cdap.common.utils.Tasks.waitFor(Tasks.java:70)
	at io.cdap.cdap.common.utils.Tasks.waitFor(Tasks.java:91)
	at io.cdap.cdap.client.ProgramClient.waitForStatus(ProgramClient.java:323)
	at io.cdap.cdap.client.ProgramClient.stopAll(ProgramClient.java:254)
	at io.cdap.cdap.test.IntegrationTestBase.doClear(IntegrationTestBase.java:390)
	at io.cdap.cdap.test.IntegrationTestBase.setUp(IntegrationTestBase.java:107)
	at sun.reflect.GeneratedMethodAccessor3.invoke(Unknown Source)
(33 more lines...)
Collapse Failed HangingWorkerTest testRestart History
Spark 2.2 Release 2 2 mins
java.util.concurrent.TimeoutException: Timeout occurred. Expected STOPPED but found RUNNING.
	at io.cdap.cdap.common.utils.Tasks.waitFor(Tasks.java:70)
	at io.cdap.cdap.common.utils.Tasks.waitFor(Tasks.java:91)
	at io.cdap.cdap.client.ProgramClient.waitForStatus(ProgramClient.java:323)
	at io.cdap.cdap.client.ProgramClient.stopAll(ProgramClient.java:254)
	at io.cdap.cdap.test.IntegrationTestBase.doClear(IntegrationTestBase.java:390)
	at io.cdap.cdap.test.IntegrationTestBase.setUp(IntegrationTestBase.java:107)
	at sun.reflect.NativeMethodAccessorImpl.invoke0(Native Method)
(34 more lines...)
Collapse Failed ServiceWorkerTest test History
Spark 2.2 Release 2 2 mins
java.util.concurrent.TimeoutException: Timeout occurred. Expected STOPPED but found RUNNING.
	at io.cdap.cdap.common.utils.Tasks.waitFor(Tasks.java:70)
	at io.cdap.cdap.common.utils.Tasks.waitFor(Tasks.java:91)
	at io.cdap.cdap.client.ProgramClient.waitForStatus(ProgramClient.java:323)
	at io.cdap.cdap.client.ProgramClient.stopAll(ProgramClient.java:254)
	at io.cdap.cdap.test.IntegrationTestBase.doClear(IntegrationTestBase.java:390)
	at io.cdap.cdap.test.IntegrationTestBase.setUp(IntegrationTestBase.java:107)
	at sun.reflect.GeneratedMethodAccessor3.invoke(Unknown Source)
(33 more lines...)
Collapse Failed NamespaceTest testNamespaces History
Spark 2.2 Release 2 2 mins
java.util.concurrent.TimeoutException: Timeout occurred. Expected STOPPED but found RUNNING.
	at io.cdap.cdap.common.utils.Tasks.waitFor(Tasks.java:70)
	at io.cdap.cdap.common.utils.Tasks.waitFor(Tasks.java:91)
	at io.cdap.cdap.client.ProgramClient.waitForStatus(ProgramClient.java:323)
	at io.cdap.cdap.client.ProgramClient.stopAll(ProgramClient.java:254)
	at io.cdap.cdap.test.IntegrationTestBase.doClear(IntegrationTestBase.java:390)
	at io.cdap.cdap.test.IntegrationTestBase.setUp(IntegrationTestBase.java:107)
	at sun.reflect.GeneratedMethodAccessor3.invoke(Unknown Source)
(33 more lines...)
Collapse Failed DatasetTest test History
Spark 2.2 Release 2 2 mins
java.util.concurrent.TimeoutException: Timeout occurred. Expected STOPPED but found RUNNING.
	at io.cdap.cdap.common.utils.Tasks.waitFor(Tasks.java:70)
	at io.cdap.cdap.common.utils.Tasks.waitFor(Tasks.java:91)
	at io.cdap.cdap.client.ProgramClient.waitForStatus(ProgramClient.java:323)
	at io.cdap.cdap.client.ProgramClient.stopAll(ProgramClient.java:254)
	at io.cdap.cdap.test.IntegrationTestBase.doClear(IntegrationTestBase.java:390)
	at io.cdap.cdap.test.IntegrationTestBase.setUp(IntegrationTestBase.java:107)
	at sun.reflect.NativeMethodAccessorImpl.invoke0(Native Method)
(34 more lines...)
Collapse Failed FileSetTest test History
Spark 2.2 Release 2 2 mins
java.util.concurrent.TimeoutException: Timeout occurred. Expected STOPPED but found RUNNING.
	at io.cdap.cdap.common.utils.Tasks.waitFor(Tasks.java:70)
	at io.cdap.cdap.common.utils.Tasks.waitFor(Tasks.java:91)
	at io.cdap.cdap.client.ProgramClient.waitForStatus(ProgramClient.java:323)
	at io.cdap.cdap.client.ProgramClient.stopAll(ProgramClient.java:254)
	at io.cdap.cdap.test.IntegrationTestBase.doClear(IntegrationTestBase.java:390)
	at io.cdap.cdap.test.IntegrationTestBase.setUp(IntegrationTestBase.java:107)
	at sun.reflect.NativeMethodAccessorImpl.invoke0(Native Method)
(34 more lines...)
Collapse Failed PartitionCorrectorTest test History
Spark 2.2 Release 2 2 mins
java.util.concurrent.TimeoutException: Timeout occurred. Expected STOPPED but found RUNNING.
	at io.cdap.cdap.common.utils.Tasks.waitFor(Tasks.java:70)
	at io.cdap.cdap.common.utils.Tasks.waitFor(Tasks.java:91)
	at io.cdap.cdap.client.ProgramClient.waitForStatus(ProgramClient.java:323)
	at io.cdap.cdap.client.ProgramClient.stopAll(ProgramClient.java:254)
	at io.cdap.cdap.test.IntegrationTestBase.doClear(IntegrationTestBase.java:390)
	at io.cdap.cdap.test.IntegrationTestBase.setUp(IntegrationTestBase.java:107)
	at sun.reflect.GeneratedMethodAccessor3.invoke(Unknown Source)
(33 more lines...)
Collapse Failed PartitionedFileSetUpdateTest test History
Spark 2.2 Release 2 2 mins
java.util.concurrent.TimeoutException: Timeout occurred. Expected STOPPED but found RUNNING.
	at io.cdap.cdap.common.utils.Tasks.waitFor(Tasks.java:70)
	at io.cdap.cdap.common.utils.Tasks.waitFor(Tasks.java:91)
	at io.cdap.cdap.client.ProgramClient.waitForStatus(ProgramClient.java:323)
	at io.cdap.cdap.client.ProgramClient.stopAll(ProgramClient.java:254)
	at io.cdap.cdap.test.IntegrationTestBase.doClear(IntegrationTestBase.java:390)
	at io.cdap.cdap.test.IntegrationTestBase.setUp(IntegrationTestBase.java:107)
	at sun.reflect.GeneratedMethodAccessor3.invoke(Unknown Source)
(33 more lines...)
Collapse Failed ProgramMetadataTest testWithLineage History
Spark 2.2 Release 2 2 mins
java.util.concurrent.TimeoutException: Timeout occurred. Expected STOPPED but found RUNNING.
	at io.cdap.cdap.common.utils.Tasks.waitFor(Tasks.java:70)
	at io.cdap.cdap.common.utils.Tasks.waitFor(Tasks.java:91)
	at io.cdap.cdap.client.ProgramClient.waitForStatus(ProgramClient.java:323)
	at io.cdap.cdap.client.ProgramClient.stopAll(ProgramClient.java:254)
	at io.cdap.cdap.test.IntegrationTestBase.doClear(IntegrationTestBase.java:390)
	at io.cdap.cdap.test.IntegrationTestBase.setUp(IntegrationTestBase.java:107)
	at sun.reflect.GeneratedMethodAccessor3.invoke(Unknown Source)
(33 more lines...)
Collapse Failed ProgramMetadataTest testSearchUsingSystemMetadata History
Spark 2.2 Release 2 2 mins
java.util.concurrent.TimeoutException: Timeout occurred. Expected STOPPED but found RUNNING.
	at io.cdap.cdap.common.utils.Tasks.waitFor(Tasks.java:70)
	at io.cdap.cdap.common.utils.Tasks.waitFor(Tasks.java:91)
	at io.cdap.cdap.client.ProgramClient.waitForStatus(ProgramClient.java:323)
	at io.cdap.cdap.client.ProgramClient.stopAll(ProgramClient.java:254)
	at io.cdap.cdap.test.IntegrationTestBase.doClear(IntegrationTestBase.java:390)
	at io.cdap.cdap.test.IntegrationTestBase.setUp(IntegrationTestBase.java:107)
	at sun.reflect.GeneratedMethodAccessor3.invoke(Unknown Source)
(33 more lines...)
Collapse Failed WorkflowTest test History
Spark 2.2 Release 2 2 mins
java.util.concurrent.TimeoutException: Timeout occurred. Expected STOPPED but found RUNNING.
	at io.cdap.cdap.common.utils.Tasks.waitFor(Tasks.java:70)
	at io.cdap.cdap.common.utils.Tasks.waitFor(Tasks.java:91)
	at io.cdap.cdap.client.ProgramClient.waitForStatus(ProgramClient.java:323)
	at io.cdap.cdap.client.ProgramClient.stopAll(ProgramClient.java:254)
	at io.cdap.cdap.test.IntegrationTestBase.doClear(IntegrationTestBase.java:390)
	at io.cdap.cdap.test.IntegrationTestBase.setUp(IntegrationTestBase.java:107)
	at sun.reflect.GeneratedMethodAccessor3.invoke(Unknown Source)
(33 more lines...)
Collapse Failed OperationalStatsTest testCDAPStats History
Spark 2.2 Release 2 2 mins
java.util.concurrent.TimeoutException: Timeout occurred. Expected STOPPED but found RUNNING.
	at io.cdap.cdap.common.utils.Tasks.waitFor(Tasks.java:70)
	at io.cdap.cdap.common.utils.Tasks.waitFor(Tasks.java:91)
	at io.cdap.cdap.client.ProgramClient.waitForStatus(ProgramClient.java:323)
	at io.cdap.cdap.client.ProgramClient.stopAll(ProgramClient.java:254)
	at io.cdap.cdap.test.IntegrationTestBase.doClear(IntegrationTestBase.java:390)
	at io.cdap.cdap.test.IntegrationTestBase.setUp(IntegrationTestBase.java:107)
	at sun.reflect.GeneratedMethodAccessor3.invoke(Unknown Source)
(33 more lines...)
Collapse Failed RemoteCubeTest test History
Spark 2.2 Release 2 2 mins
java.util.concurrent.TimeoutException: Timeout occurred. Expected STOPPED but found RUNNING.
	at io.cdap.cdap.common.utils.Tasks.waitFor(Tasks.java:70)
	at io.cdap.cdap.common.utils.Tasks.waitFor(Tasks.java:91)
	at io.cdap.cdap.client.ProgramClient.waitForStatus(ProgramClient.java:323)
	at io.cdap.cdap.client.ProgramClient.stopAll(ProgramClient.java:254)
	at io.cdap.cdap.test.IntegrationTestBase.doClear(IntegrationTestBase.java:390)
	at io.cdap.cdap.test.IntegrationTestBase.setUp(IntegrationTestBase.java:107)
	at sun.reflect.GeneratedMethodAccessor3.invoke(Unknown Source)
(33 more lines...)
Collapse Failed RemoteKeyValueTest test History
Spark 2.2 Release 2 2 mins
java.util.concurrent.TimeoutException: Timeout occurred. Expected STOPPED but found RUNNING.
	at io.cdap.cdap.common.utils.Tasks.waitFor(Tasks.java:70)
	at io.cdap.cdap.common.utils.Tasks.waitFor(Tasks.java:91)
	at io.cdap.cdap.client.ProgramClient.waitForStatus(ProgramClient.java:323)
	at io.cdap.cdap.client.ProgramClient.stopAll(ProgramClient.java:254)
	at io.cdap.cdap.test.IntegrationTestBase.doClear(IntegrationTestBase.java:390)
	at io.cdap.cdap.test.IntegrationTestBase.setUp(IntegrationTestBase.java:107)
	at sun.reflect.GeneratedMethodAccessor3.invoke(Unknown Source)
(33 more lines...)
Collapse Failed RemoteTableTest test History
Spark 2.2 Release 2 2 mins
java.util.concurrent.TimeoutException: Timeout occurred. Expected STOPPED but found RUNNING.
	at io.cdap.cdap.common.utils.Tasks.waitFor(Tasks.java:70)
	at io.cdap.cdap.common.utils.Tasks.waitFor(Tasks.java:91)
	at io.cdap.cdap.client.ProgramClient.waitForStatus(ProgramClient.java:323)
	at io.cdap.cdap.client.ProgramClient.stopAll(ProgramClient.java:254)
	at io.cdap.cdap.test.IntegrationTestBase.doClear(IntegrationTestBase.java:390)
	at io.cdap.cdap.test.IntegrationTestBase.setUp(IntegrationTestBase.java:107)
	at sun.reflect.GeneratedMethodAccessor3.invoke(Unknown Source)
(33 more lines...)
Existing test failures 2
Status Test Failing since View job Duration
java.util.concurrent.TimeoutException: Timeout occurred. Expected true but found false.
	at io.cdap.cdap.common.utils.Tasks.waitFor(Tasks.java:70)
	at io.cdap.cdap.common.utils.Tasks.waitFor(Tasks.java:91)
	at io.cdap.cdap.common.utils.Tasks.waitFor(Tasks.java:130)
	at io.cdap.cdap.test.AbstractProgramManager.waitForRuns(AbstractProgramManager.java:96)
	at io.cdap.cdap.test.AbstractProgramManager.waitForRun(AbstractProgramManager.java:90)
	at io.cdap.cdap.app.etl.batch.BatchAggregatorTest.test(BatchAggregatorTest.java:162)
java.util.concurrent.TimeoutException: Timeout occurred. Expected STOPPED but found RUNNING.
	at io.cdap.cdap.common.utils.Tasks.waitFor(Tasks.java:70)
	at io.cdap.cdap.common.utils.Tasks.waitFor(Tasks.java:91)
	at io.cdap.cdap.client.ProgramClient.waitForStatus(ProgramClient.java:323)
	at io.cdap.cdap.client.ProgramClient.stopAll(ProgramClient.java:254)
	at io.cdap.cdap.test.IntegrationTestBase.doClear(IntegrationTestBase.java:390)
	at io.cdap.cdap.test.IntegrationTestBase.setUp(IntegrationTestBase.java:107)
	at sun.reflect.GeneratedMethodAccessor3.invoke(Unknown Source)
(33 more lines...)