Build #140

Build: #140 failed Scheduled

Stages & jobs

  1. Variables

  2. Spinup and Test

Build result summary

Details

Completed
Duration
267 minutes
Labels
None
Revisions
caskdata/cdap-integration-tests
fd4631809e3d5d45bf3cf7f151a0e22e14abdc73 fd4631809e3d5d45bf3cf7f151a0e22e14abdc73
caskdata/coopr-internal
27d1ed069cb3acb10963f751b2bb0bd4f30a459c 27d1ed069cb3acb10963f751b2bb0bd4f30a459c
Total tests
55
Failing since
#16 (Scheduled with changes by Derek Wood)

Responsible

This build has been failing since #16
No one has taken responsibility

Tests

Existing test failures 3
Status Test Failing since View job Duration
java.util.concurrent.TimeoutException: Timeout occurred. Expected true but found false.
	at co.cask.cdap.common.utils.Tasks.waitFor(Tasks.java:70)
	at co.cask.cdap.common.utils.Tasks.waitFor(Tasks.java:91)
	at co.cask.cdap.common.utils.Tasks.waitFor(Tasks.java:130)
	at co.cask.cdap.test.AbstractProgramManager.waitForRuns(AbstractProgramManager.java:96)
	at co.cask.cdap.test.AbstractProgramManager.waitForRun(AbstractProgramManager.java:90)
	at co.cask.cdap.app.etl.batch.HivePluginTest.testHivePlugins(HivePluginTest.java:134)
java.io.IOException: java.lang.IllegalArgumentException: No plugin of type transform and name Wrangler could be found for stage Wrangler.
	at co.cask.cdap.client.util.RESTClient.upload(RESTClient.java:160)
	at co.cask.cdap.client.ApplicationClient.deploy(ApplicationClient.java:410)
	at co.cask.cdap.test.IntegrationTestManager.deployApplication(IntegrationTestManager.java:203)
	at co.cask.cdap.test.IntegrationTestBase.deployApplication(IntegrationTestBase.java:383)
	at co.cask.cdap.app.etl.wrangler.WranglerTest.testWrangler(WranglerTest.java:177)
	at co.cask.cdap.app.etl.wrangler.WranglerTest.testWranglerMR(WranglerTest.java:81)
java.io.IOException: java.lang.IllegalArgumentException: No plugin of type transform and name Wrangler could be found for stage Wrangler.
	at co.cask.cdap.client.util.RESTClient.upload(RESTClient.java:160)
	at co.cask.cdap.client.ApplicationClient.deploy(ApplicationClient.java:410)
	at co.cask.cdap.test.IntegrationTestManager.deployApplication(IntegrationTestManager.java:203)
	at co.cask.cdap.test.IntegrationTestBase.deployApplication(IntegrationTestBase.java:383)
	at co.cask.cdap.app.etl.wrangler.WranglerTest.testWrangler(WranglerTest.java:177)
	at co.cask.cdap.app.etl.wrangler.WranglerTest.testWranglerSpark(WranglerTest.java:89)