Build #593

Integration tests for CDAP Cloud Runtime

Build: #593 failed Manual run by Vinisha Shah

Build result summary

Details

Completed
Duration
400 minutes
Labels
None
Agent
bamboo-agent16
Revision
fb3322de1b3bd883c9e4a414c971559c9d960cef fb3322de1b3bd883c9e4a414c971559c9d960cef
Total tests
30
Failing since
#547 (Scheduled – )
Fixed in
#606 (Manual run by Vinisha Shah)

Responsible

This build has been failing since #547
No one has taken responsibility

Code commits

Author Commit Message Commit date
albertshau <ashau@google.com> albertshau <ashau@google.com> fb3322de1b3bd883c9e4a414c971559c9d960cef fb3322de1b3bd883c9e4a414c971559c9d960cef Merge pull request #1043 from yeweidaniel/integration-doc2
Update docs
Daniel <danielye@google.com> Daniel <danielye@google.com> 32745ceda79cd6d1257af2960995a0ab07cad9b9 m 32745ceda79cd6d1257af2960995a0ab07cad9b9 Update integration test docs with debugging instruction and how to load plugins.

Tests

New test failures 3
Status Test View job Duration
Collapse Failed GoogleCloudBigtableTest testReadDataAndStoreInNewTable History
Distro Tests - CDH 5.5 15 mins
java.util.concurrent.TimeoutException: Timeout occurred. Expected true but found false.
	at io.cdap.cdap.common.utils.Tasks.waitFor(Tasks.java:70)
	at io.cdap.cdap.common.utils.Tasks.waitFor(Tasks.java:91)
	at io.cdap.cdap.test.AbstractProgramManager.waitForRuns(AbstractProgramManager.java:109)
	at io.cdap.cdap.test.AbstractProgramManager.startAndWaitForRun(AbstractProgramManager.java:80)
	at io.cdap.cdap.test.AudiTestBase.startAndWaitForRun(AudiTestBase.java:277)
	at io.cdap.cdap.app.etl.gcp.DataprocETLTestBase.startWorkFlow(DataprocETLTestBase.java:124)
	at io.cdap.cdap.app.etl.gcp.DataprocETLTestBase.startWorkFlow(DataprocETLTestBase.java:115)
(1 more lines...)
Collapse Failed GoogleCloudBigtableTest testReadDataAndStoreInExistingTable History
Distro Tests - CDH 5.5 15 mins
java.util.concurrent.TimeoutException: Timeout occurred. Expected true but found false.
	at io.cdap.cdap.common.utils.Tasks.waitFor(Tasks.java:70)
	at io.cdap.cdap.common.utils.Tasks.waitFor(Tasks.java:91)
	at io.cdap.cdap.test.AbstractProgramManager.waitForRuns(AbstractProgramManager.java:109)
	at io.cdap.cdap.test.AbstractProgramManager.startAndWaitForRun(AbstractProgramManager.java:80)
	at io.cdap.cdap.test.AudiTestBase.startAndWaitForRun(AudiTestBase.java:277)
	at io.cdap.cdap.app.etl.gcp.DataprocETLTestBase.startWorkFlow(DataprocETLTestBase.java:124)
	at io.cdap.cdap.app.etl.gcp.DataprocETLTestBase.startWorkFlow(DataprocETLTestBase.java:115)
(1 more lines...)
Collapse Failed GoogleCloudSpannerTest testReadAndStoreInNewTable History
Distro Tests - CDH 5.5 5 mins
java.util.concurrent.TimeoutException: Timeout occurred. Expected 2 but found 0.
	at io.cdap.cdap.common.utils.Tasks.waitFor(Tasks.java:70)
	at io.cdap.cdap.common.utils.Tasks.waitFor(Tasks.java:91)
	at io.cdap.cdap.test.AudiTestBase.checkMetric(AudiTestBase.java:163)
	at io.cdap.cdap.app.etl.gcp.GoogleCloudSpannerTest.checkMetrics(GoogleCloudSpannerTest.java:373)
	at io.cdap.cdap.app.etl.gcp.GoogleCloudSpannerTest.testReadAndStoreInNewTable(GoogleCloudSpannerTest.java:251)
Fixed tests 1
Status Test Failing since View job Duration
Successful GoogleCloudDatastoreTest testReadWithFilterAndUpdateUsingUrlSafeKey History
Failing since build #566 (Scheduled) Distro Tests - CDH 5.5 5 mins